{"text_format":"1","workbook":"xlsx","n_sheets":3,"sheets":["Ark1","Ark2","Ark3"],"not_rendered":{"charts":3,"images":5,"macros":1,"external_links":0,"defined_names":172,"comments":2,"pivot_tables":0},"unopened":[],"bounds":{"document_bytes":16777216,"sheet_cells":100000,"rows_first":2000,"rows_last":500,"rows_between":2000,"halvings":0,"cell_chars":16384,"cell_head_chars":4096},"cells_cut":0,"cells_raw":0,"read":"whole","date_system":"1900"}

{"sheet":"Ark1","index":0,"n_rows":452,"n_cols":149,"rows_kept":452,"cut":false,"hidden":false,"merged":[[182,9,182,10],[3,15,10,20],[92,15,96,18],[112,15,116,18],[131,23,131,27],[176,9,176,10],[177,9,177,10],[178,9,178,10],[180,9,180,10],[181,9,181,10],[183,9,183,10],[184,9,184,10],[186,9,186,10],[188,9,188,10],[189,9,189,10],[350,15,359,18],[192,9,192,10],[278,9,279,10],[190,9,190,10],[313,15,321,18],[240,15,249,18],[193,15,199,18],[282,15,291,18],[229,15,235,18],[196,9,196,10],[260,0,261,0],[278,0,279,1],[144,2,144,3],[177,1,177,2],[196,1,196,2],[186,1,186,2],[188,1,188,2],[195,1,195,2],[189,1,189,2],[192,1,192,2],[158,2,158,3],[242,0,243,0],[89,0,90,0],[152,2,152,3],[154,2,154,3],[177,5,177,6],[184,1,184,2],[184,5,184,6],[178,1,178,2],[178,5,178,6],[180,1,180,2],[181,1,181,2],[182,1,182,2],[183,1,183,2],[148,2,148,3],[181,5,181,6],[180,5,180,6],[182,5,182,6],[0,0,0,9],[160,2,160,3],[136,2,136,3],[138,2,138,3],[140,2,140,3],[156,2,156,3],[2,5,2,6],[4,5,4,6],[6,5,6,6],[142,2,142,3],[146,2,146,3],[88,0,88,1],[109,0,110,0],[132,2,132,3],[150,2,150,3],[134,2,134,3],[183,5,183,6],[235,1,235,2],[176,1,176,2],[176,5,176,6],[190,1,190,2],[186,5,186,6],[188,5,188,6],[189,5,189,6],[190,5,190,6],[192,5,192,6],[195,5,195,6],[196,5,196,6]]}
["Økonomi i afgrøder og sædskifter 2018"]
[null,null,null,null,null,null,null,null,null,null,null,null,null,null,null,null,null,null,null,null,null,null,null,null,null,null,null,null,null,null,null,null,null,null,null,null,null,null,null,null,null,null,null,null,null,null,null,null,null,null,null,null,null,null,null,null,null,null,null,null,null,null,null,null,null,null,null,null,null,null,null,null,null,null,null,null,null,null,null,null,null,null,null,null,null,null,null,null,null,null,null,null,null,null,null,"JB_rækkenr.","Udbytte","N-gødning","Lager_rækkenr","Lagernr",null,null,null,null,null,null,null,"Husdyrgødning"]
["Jordtype",null,null,null,null,"Lager til korn",null,null,null,null,null,null,null,null,null,null,null,null,null,null,null,null,null,null,null,null,null,null,null,null,null,null,null,null,null,null,null,null,null,null,null,null,null,null,null,null,null,null,null,null,null,null,null,null,null,null,null,null,null,null,null,null,null,null,null,null,null,null,null,null,null,null,null,null,null,null,null,null,null,null,null,null,null,null,null,null,null,null,null,null,null,null,null,null,null,4,{"$f":"IF(CR3=1,5,IF(CR3=2,6,IF(CR3=3,7,IF(CR3=4,8,IF(CR3=5,9,\"\")))))","v":8},{"$f":"IF(CR3=1,25,IF(CR3=2,26,IF(CR3=3,27,IF(CR3=4,28,IF(CR3=5,29,\"\")))))","v":28},2,{"$f":"IF(CU3=1,1,IF(CU3=2,BN131,IF(CU3=3,BO131,BP131)))","v":52},null,null,null,null,null,null,null,null,"DE/ha","N","P","K"]
[null,null,null,null,null,null,null,null,null,null,null,null,null,null,null,"Regnearket kan sammenligne økonomien i enkeltafgrøder og sædskifter.\nUdskrift 1 kan vise op til 3 enkeltafgrøder eller sædskifter.\nDu kan definere sædskifter i række 90-125 - og derefter vælge dem i række 16 (nederst i rullelisten). \nDu kan redigere normer fra række 130.\nUdskrift 2 (række 170) viser den samlede økonomi. \nUdskrift 3 (række 295) viser tidsforbruget (netto).",null,null,null,null,null,null,null,null,null,null,null,null,null,null,null,null,null,null,null,null,null,null,null,null,null,null,null,null,null,null,null,null,null,null,null,null,null,null,null,null,null,null,null,null,null,null,null,null,null,null,null,null,null,null,null,null,null,null,null,null,null,null,null,null,null,null,null,null,null,null,null,null,null,null,null,null,null,null,null,"Halm","Halm_rækkenr.","Maskinomkostninger","Tørring_rækkenr.","Tørrenr",null,null,null,null,null,null,1,"Ingen",0,0,0,0,null,"ton gylle pr. DE",18]
["Halm bjærges/nedmuldes",null,null,null,null,"Tørring af korn",null,null,null,null,null,null,null,null,null,null,null,null,null,null,null,null,null,null,null,null,null,null,null,null,null,null,null,null,null,null,null,null,null,null,null,null,null,null,null,null,null,null,null,null,null,null,null,null,null,null,null,null,null,null,null,null,null,null,null,null,null,null,null,null,null,null,null,null,null,null,null,null,null,null,null,null,null,null,null,null,null,null,null,null,null,null,null,null,null,2,{"$f":"IF($CR$5=1,IF($CR$3=1,10,IF($CR$3=2,11,IF($CR$3=3,12,IF($CR$3=4,13,IF($CR$3=5,14,\"\"))))))","v":false},{"$f":"IF($CR$5=1,IF($CR$3=1,39,IF($CR$3=2,40,IF($CR$3=3,41,IF($CR$3=4,42,IF($CR$3=5,43,\"\"))))),IF($CR$3=1,44,IF($CR$3=2,45,IF($CR$3=3,46,IF($CR$3=4,47,IF($CR$3=5,48,\"\"))))))","v":47},2,{"$f":"IF(Tørringnr=1,BK131,BL131)","v":50},null,null,null,null,null,null,2,"10 kg N svin",0.1,{"$f":"DE5*$C$143*UdnytNsvin*0.01","v":7.5},{"$f":"DE5*$C$145","v":2.5},{"$f":"DE5*$C$147","v":5},null,"DE pr. ha",{"$f":"VLOOKUP(Hdgnr,_Hdg2,3)","v":0}]
[null,null,null,null,null,null,null,null,null,null,null,null,null,null,null,null,null,null,null,null,null,null,null,null,null,null,null,null,null,null,null,null,null,null,null,null,null,null,null,null,null,null,null,null,null,null,null,null,null,null,null,null,null,null,null,null,null,null,null,null,null,null,null,null,null,null,null,null,null,null,null,null,null,null,null,null,null,null,null,null,null,null,null,null,null,null,null,null,null,null,null,null,null,null,null,"Kornkøber","Kornkøber / - sælger",null,"Foderenheder",null,null,null,null,null,null,null,3,"10 kg N kvæg",0.1,{"$f":"DE6*$C$149*UdnytNkvæg*0.01","v":7},{"$f":"DE6*$C$151","v":1.7000000000000002},{"$f":"DE6*$C$153","v":6.7}]
["Kornsælger eller kornkøber",null,null,null,null,"Foderenheder",null,null,null,null,null,null,null,null,null,null,null,null,null,null,null,null,null,null,null,null,null,null,null,null,null,null,null,null,null,null,null,null,null,null,null,null,null,null,null,null,null,null,null,null,null,null,null,null,null,null,null,null,null,null,null,null,null,null,null,null,null,null,null,null,null,null,null,null,null,null,null,null,null,null,null,null,null,null,null,null,null,null,null,null,null,null,null,null,null,1,{"$f":"IF(CR7=2,IF(CR3=1,5,IF(CR3=2,6,IF(CR3=3,7,IF(CR3=4,8,IF(CR3=5,9,\"\"))))),\"\")","v":""},null,1,null,null,null,null,null,null,null,4,"20 kg N svin",0.2,{"$f":"DE7*$C$143*UdnytNsvin*0.01","v":15},{"$f":"DE7*$C$145","v":5},{"$f":"DE7*$C$147","v":10}]
[null,null,null,null,null,null,null,null,null,null,null,null,null,null,null,null,null,null,null,null,null,null,null,null,null,null,null,null,null,null,null,null,null,null,null,null,null,null,null,null,null,null,null,null,null,null,null,null,null,null,null,null,null,null,null,null,null,null,null,null,null,null,null,null,null,null,null,null,null,null,null,null,null,null,null,null,null,null,null,null,null,null,null,null,null,null,null,null,null,null,null,null,null,null,null,"Hdg_rækkenr","Styk uden eller med husdyrgødning",null,null,null,null,null,null,null,null,null,5,"20 kg N kvæg",0.2,{"$f":"DE8*$C$149*UdnytNkvæg*0.01","v":14},{"$f":"DE8*$C$151","v":3.4000000000000004},{"$f":"DE8*$C$153","v":13.4}]
["Husdyrgødning",null,null,null,null,null,null,null,null,null,null,null,null,null,null,null,null,null,null,null,null,null,null,null,null,null,null,null,null,null,null,null,null,null,null,null,null,null,null,null,null,null,null,null,null,null,null,null,null,null,null,null,null,null,null,null,null,null,null,null,null,null,null,null,null,null,null,null,null,null,null,null,null,null,null,null,null,null,null,null,null,null,null,null,null,null,null,null,null,null,null,null,null,null,null,1,{"$f":"IF(CR9=1,IF($CR$3=1,21,IF($CR$3=2,22,IF($CR$3=3,23,IF($CR$3=4,24,IF($CR$3=5,25,\"\"))))),IF($CR$3=1,26,IF($CR$3=2,27,IF($CR$3=3,28,IF($CR$3=4,29,IF($CR$3=5,30,\"\"))))))","v":24},null,null,null,null,null,null,null,null,null,6,"30 kg N svin",0.3,{"$f":"DE9*$C$143*UdnytNsvin*0.01","v":22.5},{"$f":"DE9*$C$145","v":7.5},{"$f":"DE9*$C$147","v":15}]
[null,null,null,null,null,null,null,null,null,null,null,null,null,null,null,null,null,null,null,null,null,null,null,null,null,null,null,null,null,null,null,null,null,null,null,null,null,null,null,null,null,null,null,null,null,null,null,null,null,null,null,null,null,null,null,null,null,null,null,null,null,null,null,null,null,null,null,null,null,null,null,null,null,null,null,null,null,null,null,null,null,null,null,null,null,null,null,null,null,null,null,null,null,null,null,null,"Forfrugtsværdi",null,null,null,null,null,null,null,null,null,7,"30 kg N kvæg",0.3,{"$f":"DE10*$C$149*UdnytNkvæg*0.01","v":21},{"$f":"DE10*$C$151","v":5.0999999999999996},{"$f":"DE10*$C$153","v":20.099999999999998}]
["Forfrugtsværdi til forfrugten",null,null,null,null,null,null,null,null,null,null,null,null,null,null,null,null,null,null,null,null,null,null,null,null,null,null,null,null,null,null,null,null,null,null,null,null,null,null,null,null,null,null,null,null,null,null,null,null,null,null,null,null,null,null,null,null,null,null,null,null,null,null,null,null,null,null,null,null,null,null,null,null,null,null,null,null,null,null,null,null,null,null,null,null,null,null,null,null,null,null,null,null,null,null,1,{"$f":"IF(CR11=1,IF($CR$3=1,15,IF($CR$3=2,16,IF($CR$3=3,17,IF($CR$3=4,18,IF($CR$3=5,19,\"\"))))))","v":18},null,null,null,null,null,null,null,null,null,8,"40 kg N svin",0.4,{"$f":"DE11*$C$143*UdnytNsvin*0.01","v":30},{"$f":"DE11*$C$145","v":10},{"$f":"DE11*$C$147","v":20}]
[null,null,null,null,null,null,null,null,null,null,null,null,null,null,null,null,null,null,null,null,null,null,null,null,null,null,null,null,null,null,null,null,null,null,null,null,null,null,null,null,null,null,null,null,null,null,null,null,null,null,null,null,null,null,null,null,null,null,null,null,null,null,null,null,null,null,null,null,null,null,null,null,null,null,null,null,null,null,null,null,null,null,null,null,null,null,null,null,null,null,null,null,null,null,null,null,null,null,null,null,null,null,null,null,null,null,9,"40 kg N kvæg",0.4,{"$f":"DE12*$C$149*UdnytNkvæg*0.01","v":28},{"$f":"DE12*$C$151","v":6.8000000000000007},{"$f":"DE12*$C$153","v":26.8}]
[null,null,null,null,null,null,null,null,null,null,null,null,null,null,null,null,null,null,null,null,null,null,null,null,null,null,null,null,null,null,null,null,null,null,null,null,null,null,null,null,null,null,null,null,null,null,null,null,null,null,null,null,null,null,null,null,null,null,null,null,null,null,null,null,null,null,null,null,null,null,null,null,null,null,null,null,null,null,null,null,null,null,null,null,null,null,null,null,null,null,null,null,null,null,null,null,null,null,null,null,null,null,null,null,null,null,10,"50 kg N svin",0.5,{"$f":"DE13*$C$143*UdnytNsvin*0.01","v":37.5},{"$f":"DE13*$C$145","v":12.5},{"$f":"DE13*$C$147","v":25}]
[null,null,"Afgrøde/sædskifte",null,null,null,"Alternativ 1",null,null,null,"Alternativ 2",null,null,null,null,null,null,null,null,null,null,null,null,null,null,null,null,null,null,null,null,null,null,null,null,null,null,null,null,null,null,null,null,null,null,null,null,null,null,null,null,null,null,null,null,null,null,null,null,null,null,null,null,null,null,null,null,null,null,null,null,null,null,null,null,null,null,null,null,null,null,null,null,null,null,null,null,null,null,null,null,null,null,null,null,null,null,null,null,null,null,null,null,null,null,null,11,"50 kg N kvæg",0.5,{"$f":"DE14*$C$149*UdnytNkvæg*0.01","v":35},{"$f":"DE14*$C$151","v":8.5},{"$f":"DE14*$C$153","v":33.5}]
[null,null,null,null,null,null,null,null,null,null,null,null,null,null,null,null,null,null,null,null,null,null,null,null,null,null,null,null,null,null,null,null,null,null,null,null,null,null,null,null,null,null,null,null,null,null,null,null,null,null,null,null,null,null,null,null,null,null,null,null,null,null,null,null,null,null,null,null,null,null,null,null,null,null,null,null,null,null,null,null,null,null,null,null,null,null,null,null,null,null,null,null,null,null,null,"Afgrøde","Alternat 1","Alternat 2","Alternat 3",null,null,null,null,null,null,null,12,"60 kg N svin",0.6,{"$f":"DE15*$C$143*UdnytNsvin*0.01","v":45},{"$f":"DE15*$C$145","v":15},{"$f":"DE15*$C$147","v":30}]
["Afgrøde",null,null,null,null,null,null,null,null,null,null,null,null,null,null,null,null,null,null,null,null,null,null,null,null,null,null,null,null,null,null,null,null,null,null,null,null,null,null,null,null,null,null,null,null,null,null,null,null,null,null,null,null,null,null,null,null,null,null,null,null,null,null,null,null,null,null,null,null,null,null,null,null,null,null,null,null,null,null,null,null,null,null,null,null,null,null,null,null,null,null,null,null,null,"Afgrøderækkenummer",1,1,1,1,null,null,null,null,null,null,null,13,"60 kg N kvæg",0.6,{"$f":"DE16*$C$149*UdnytNkvæg*0.01","v":42},{"$f":"DE16*$C$151","v":10.199999999999999},{"$f":"DE16*$C$153","v":40.199999999999996}]
[null,null,null,null,null,null,null,null,null,null,null,null,null,null,null,null,null,null,null,null,null,null,null,null,null,null,null,null,null,null,null,null,null,null,null,null,null,null,null,null,null,null,null,null,null,null,null,null,null,null,null,null,null,null,null,null,null,null,null,null,null,null,null,null,null,null,null,null,null,null,null,null,null,null,null,null,null,null,null,null,null,null,null,null,null,null,null,null,null,null,null,null,null,null,null,null,null,null,null,null,null,null,null,null,null,null,14,"70 kg N svin",0.7,{"$f":"DE17*$C$143*UdnytNsvin*0.01","v":52.5},{"$f":"DE17*$C$145","v":17.5},{"$f":"DE17*$C$147","v":35}]
["Udbyttenorm pr. ha",null,{"$f":"VLOOKUP(CR16,_Afg07,CS3)","v":0},{"$f":"IF($CR$16>1,IF(VLOOKUP($CR$16,_Afg07,3)=\"\",\"Hkg\",VLOOKUP($CR$16,_Afg07,3)),\"hkg\")","v":"hkg"},null,null,{"$f":"VLOOKUP(CS16,_Afg07,CS3)","v":0},{"$f":"IF($CS$16>1,IF(VLOOKUP($CS$16,_Afg07,3)=\"\",\"Hkg\",VLOOKUP($CS$16,_Afg07,3)),\"hkg\")","v":"hkg"},null,null,{"$f":"VLOOKUP(CT16,_Afg07,CS3)","v":0},{"$f":"IF($CT$16>1,IF(VLOOKUP($CT$16,_Afg07,3)=\"\",\"hkg\",VLOOKUP($CT$16,_Afg07,3)),\"hkg\")","v":"hkg"},null,null,null,null,null,null,null,null,null,null,null,null,null,null,null,null,null,null,null,null,null,null,null,null,null,null,null,null,null,null,null,null,null,null,null,null,null,null,null,null,null,null,null,null,null,null,null,null,null,null,null,null,null,null,null,null,null,null,null,null,null,null,null,null,null,null,null,null,null,null,null,null,null,null,null,null,null,null,null,null,null,null,null,null,null,null,null,null,null,null,null,null,null,null,15,"70 kg N kvæg",0.7,{"$f":"DE18*$C$149*UdnytNkvæg*0.01","v":49},{"$f":"DE18*$C$151","v":11.899999999999999},{"$f":"DE18*$C$153","v":46.9}]
["Udbytte forventet",null,null,{"$f":"IF($CR$16>1,IF(VLOOKUP($CR$16,_Afg07,3)=\"\",\"Hkg\",VLOOKUP($CR$16,_Afg07,3)),\"hkg\")","v":"hkg"},null,null,null,{"$f":"IF($CS$16>1,IF(VLOOKUP($CS$16,_Afg07,3)=\"\",\"Hkg\",VLOOKUP($CS$16,_Afg07,3)),\"hkg\")","v":"hkg"},null,null,null,{"$f":"IF($CT$16>1,IF(VLOOKUP($CT$16,_Afg07,3)=\"\",\"hkg\",VLOOKUP($CT$16,_Afg07,3)),\"hkg\")","v":"hkg"},null,null,null,null,null,null,null,null,null,null,null,null,null,null,null,null,null,null,null,null,null,null,null,null,null,null,null,null,null,null,null,null,null,null,null,null,null,null,null,null,null,null,null,null,null,null,null,null,null,null,null,null,null,null,null,null,null,null,null,null,null,null,null,null,null,null,null,null,null,null,null,null,null,null,null,null,null,null,null,null,null,null,null,null,null,null,null,null,null,null,null,null,null,null,16,"80 kg N svin",0.8,{"$f":"DE19*$C$143*UdnytNsvin*0.01","v":60},{"$f":"DE19*$C$145","v":20},{"$f":"DE19*$C$147","v":40}]
[null,null,null,null,null,null,null,null,null,null,null,null,null,null,null,null,null,null,null,null,null,null,null,null,null,null,null,null,null,null,null,null,null,null,null,null,null,null,null,null,null,null,null,null,null,null,null,null,null,null,null,null,null,null,null,null,null,null,null,null,null,null,null,null,null,null,null,null,null,null,null,null,null,null,null,null,null,null,null,null,null,null,null,null,null,null,null,null,null,null,null,null,null,null,null,null,null,null,null,null,null,null,null,null,null,null,17,"80 kg N kvæg",0.8,{"$f":"DE20*$C$149*UdnytNkvæg*0.01","v":56},{"$f":"DE20*$C$151","v":13.600000000000001},{"$f":"DE20*$C$153","v":53.6}]
["Pris, standard pr. hkg",null,{"$f":"VLOOKUP(CR16,_Afg07,4)","v":0},"kr.",null,null,{"$f":"VLOOKUP(CS16,_Afg07,4)","v":0},"kr.",null,null,{"$f":"VLOOKUP(CT16,_Afg07,4)","v":0},"kr.",null,null,null,null,null,null,null,null,null,null,null,null,null,null,null,null,null,null,null,null,null,null,null,null,null,null,null,null,null,null,null,null,null,null,null,null,null,null,null,null,null,null,null,null,null,null,null,null,null,null,null,null,null,null,null,null,null,null,null,null,null,null,null,null,null,null,null,null,null,null,null,null,null,null,null,null,null,null,null,null,null,null,null,null,null,null,null,null,null,null,null,null,null,null,18,"90 kg N svin",0.9,{"$f":"DE21*$C$143*UdnytNsvin*0.01","v":67.5},{"$f":"DE21*$C$145","v":22.5},{"$f":"DE21*$C$147","v":45}]
["Pris forventet",null,null,"kr.",null,null,null,"kr.",null,null,null,"kr.",null,null,null,null,null,null,null,null,null,null,null,null,null,null,null,null,null,null,null,null,null,null,null,null,null,null,null,null,null,null,null,null,null,null,null,null,null,null,null,null,null,null,null,null,null,null,null,null,null,null,null,null,null,null,null,null,null,null,null,null,null,null,null,null,null,null,null,null,null,null,null,null,null,null,null,null,null,null,null,null,null,null,null,null,null,null,null,null,null,null,null,null,null,null,19,"90 kg N kvæg",0.9,{"$f":"DE22*$C$149*UdnytNkvæg*0.01","v":63},{"$f":"DE22*$C$151","v":15.3},{"$f":"DE22*$C$153","v":60.300000000000004}]
[null,null,null,null,null,null,null,null,null,null,null,null,null,null,null,null,null,null,null,null,null,null,null,null,null,null,null,null,null,null,null,null,null,null,null,null,null,null,null,null,null,null,null,null,null,null,null,null,null,null,null,null,null,null,null,null,null,null,null,null,null,null,null,null,null,null,null,null,null,null,null,null,null,null,null,null,null,null,null,null,null,null,null,null,null,null,null,null,null,null,null,null,null,null,null,null,null,null,null,null,null,null,null,null,null,null,20,"100 kg N svin",1,{"$f":"DE23*$C$143*UdnytNsvin*0.01","v":75},{"$f":"DE23*$C$145","v":25},{"$f":"DE23*$C$147","v":50}]
["Udskrift (side 1):",null,null,null,null,null,null,null,null,null,null,null,null,null,null,null,null,null,null,null,null,null,null,null,null,null,null,null,null,null,null,null,null,null,null,null,null,null,null,null,null,null,null,null,null,null,null,null,null,null,null,null,null,null,null,null,null,null,null,null,null,null,null,null,null,null,null,null,null,null,null,null,null,null,null,null,null,null,null,null,null,null,null,null,null,null,null,null,null,null,null,null,null,null,null,null,null,null,null,null,null,null,null,null,null,null,21,"100 kg N kvæg",1,{"$f":"DE24*$C$149*UdnytNkvæg*0.01","v":70},{"$f":"DE24*$C$151","v":17},{"$f":"DE24*$C$153","v":67}]
[null,null,null,null,null,null,null,null,null,null,null,null,null,null,null,null,null,null,null,null,null,null,null,null,null,null,null,null,null,null,null,null,null,null,null,null,null,null,null,null,null,null,null,null,null,null,null,null,null,null,null,null,null,null,null,null,null,null,null,null,null,null,null,null,null,null,null,null,null,null,null,null,null,null,null,null,null,null,null,null,null,null,null,null,null,null,null,null,null,null,null,null,null,null,null,null,null,null,null,null,null,null,null,null,null,null,22,"110 kg N svin",1.1000000000000001,{"$f":"DE25*$C$143*UdnytNsvin*0.01","v":82.500000000000014},{"$f":"DE25*$C$145","v":27.500000000000004},{"$f":"DE25*$C$147","v":55.000000000000007}]
[{"$f":"\"Økonomi i afgrøder og sædskifter \"&Aar","v":"Økonomi i afgrøder og sædskifter 2018"},null,null,null,null,null,null,null,null,null,null,null,null,null,null,null,null,null,null,null,null,null,null,null,null,null,null,null,null,null,null,null,null,null,null,null,null,null,null,null,null,null,null,null,null,null,null,null,null,null,null,null,null,null,null,null,null,null,null,null,null,null,null,null,null,null,null,null,null,null,null,null,null,null,null,null,null,null,null,null,null,null,null,null,null,null,null,null,null,null,null,null,null,null,null,null,null,null,null,null,null,null,null,null,null,null,23,"110 kg N kvæg",1.1000000000000001,{"$f":"DE26*$C$149*UdnytNkvæg*0.01","v":77.000000000000014},{"$f":"DE26*$C$151","v":18.700000000000003},{"$f":"DE26*$C$153","v":73.7}]
[null,null,null,null,null,null,null,null,null,null,null,null,null,null,null,null,null,null,null,null,null,null,null,null,null,null,null,null,null,null,null,null,null,null,null,null,null,null,null,null,null,null,null,null,null,null,null,null,null,null,null,null,null,null,null,null,null,null,null,null,null,null,null,null,null,null,null,null,null,null,null,null,null,null,null,null,null,null,null,null,null,null,null,null,null,null,null,null,null,null,null,null,null,null,null,null,null,null,null,null,null,null,null,null,null,null,24,"120 kg N svin",1.2,{"$f":"DE27*$C$143*UdnytNsvin*0.01","v":90},{"$f":"DE27*$C$145","v":30},{"$f":"DE27*$C$147","v":60}]
[null,null,null,null,{"$f":"IF(CR16>1,VLOOKUP(CR16,_Afg07,2),\"\")","v":""},null,null,{"$f":"IF(CS16>1,VLOOKUP(CS16,_Afg07,2),\"\")","v":""},null,null,null,{"$f":"IF(CT16>1,VLOOKUP(CT16,_Afg07,2),\"\")","v":""},null,null,null,null,null,null,null,null,null,null,null,null,null,null,null,null,null,null,null,null,null,null,null,null,null,null,null,null,null,null,null,null,null,null,null,null,null,null,null,null,null,null,null,null,null,null,null,null,null,null,null,null,null,null,null,null,null,null,null,null,null,null,null,null,null,null,null,null,null,null,null,null,null,null,null,null,null,null,null,null,null,null,null,null,null,null,null,null,null,null,null,null,null,null,25,"120 kg N kvæg",1.2,{"$f":"DE28*$C$149*UdnytNkvæg*0.01","v":84},{"$f":"DE28*$C$151","v":20.399999999999999},{"$f":"DE28*$C$153","v":80.399999999999991}]
["Udbytte pr. ha",null,{"$f":"IF(CR16>1,IF(C19=\"\",C18,C19),\"\")","v":""},{"$f":"IF(AND(C29<>\"\",C29>0),VLOOKUP(CR16,_Afg07,3),\"\")","v":""},null,null,{"$f":"IF(CS16>1,IF(G19=\"\",G18,G19),\"\")","v":""},{"$f":"IF(AND(G29<>\"\",G29>0),VLOOKUP(CS16,_Afg07,3),\"\")","v":""},null,null,{"$f":"IF(CT16>1,IF(K19=\"\",K18,K19),\"\")","v":""},{"$f":"IF(AND(K29<>\"\",K29>0),VLOOKUP(CT16,_Afg07,3),\"\")","v":""},null,null,null,"I nedenstående felter kan du overskrive tallene på udskriften.",null,null,null,null,null,null,null,null,null,null,null,null,null,null,null,null,null,null,null,null,null,null,null,null,null,null,null,null,null,null,null,null,null,null,null,null,null,null,null,null,null,null,null,null,null,null,null,null,null,null,null,null,null,null,null,null,null,null,null,null,null,null,null,null,null,null,null,null,null,null,null,null,null,null,null,null,null,null,null,null,null,null,null,null,null,null,null,null,null,null,26,"130 kg N svin",1.3,{"$f":"DE29*$C$143*UdnytNsvin*0.01","v":97.5},{"$f":"DE29*$C$145","v":32.5},{"$f":"DE29*$C$147","v":65}]
["Pris pr. hkg",null,{"$f":"IF(CR16>1,IF(C22=\"\",C21,C22),\"\")","v":""},{"$f":"IF(C30<>\"\",\"kr.\",\"\")","v":""},null,null,{"$f":"IF(CS16>1,IF(G22=\"\",G21,G22),\"\")","v":""},{"$f":"IF(G30<>\"\",\"kr.\",\"\")","v":""},null,null,{"$f":"IF(CT16>1,IF(K22=\"\",K21,K22),\"\")","v":""},{"$f":"IF(K30<>\"\",\"kr.\",\"\")","v":""},null,null,null,"Husk at slette tallene igen før ny beregning.",null,null,null,null,null,null,null,null,null,null,null,null,null,null,null,null,null,null,null,null,null,null,null,null,null,null,null,null,null,null,null,null,null,null,null,null,null,null,null,null,null,null,null,null,null,null,null,null,null,null,null,null,null,null,null,null,null,null,null,null,null,null,null,null,null,null,null,null,null,null,null,null,null,null,null,null,null,null,null,null,null,null,null,null,null,null,null,null,null,null,27,"130 kg N kvæg",1.3,{"$f":"DE30*$C$149*UdnytNkvæg*0.01","v":91},{"$f":"DE30*$C$151","v":22.1},{"$f":"DE30*$C$153","v":87.100000000000009},null,null,"Plov (Plo)",null,"Stubharve (Stu)",null,"Såbedsharve (Såb)",null,"Marksprøjte ",null,"Såmaskine (Såm)",null,"Mejetærsker (Mej)",null,"Halmpresser (Hal)",null,"Gylleudbringning",null,"Gødningsspreder",null,"Enkornsåmaskine",null,"Kartoffellægger",null,"Kartoffeloptager",null,"Roeoptager"]
[null,null,null,null,null,null,null,null,null,null,null,null,null,null,null,null,null,null,null,null,null,null,null,null,null,null,null,null,null,null,null,null,null,null,null,null,null,null,null,null,null,null,null,null,null,null,null,null,null,null,null,null,null,null,null,null,null,null,null,null,null,null,null,null,null,null,null,null,null,null,null,null,null,null,null,null,null,null,null,null,null,null,null,null,null,null,null,null,null,null,null,null,null,null,null,null,null,null,null,null,null,null,null,null,null,null,28,"140 kg N svin",1.4,{"$f":"DE31*$C$143*UdnytNsvin*0.01","v":105},{"$f":"DE31*$C$145","v":35},{"$f":"DE31*$C$147","v":70}]
["Udbytte, kerne/frø",null,{"$f":"IF(CR16>1,C29*C30,\"\")","v":""},{"$f":"IF(C32<>\"\",\"kr.\",\"\")","v":""},null,null,{"$f":"IF(CS16>1,G29*G30,\"\")","v":""},{"$f":"IF(G32<>\"\",\"kr.\",\"\")","v":""},null,null,{"$f":"IF(CT16>1,K29*K30,\"\")","v":""},{"$f":"IF(K32<>\"\",\"kr.\",\"\")","v":""},null,null,null,null,null,null,null,null,null,null,null,null,null,null,null,null,null,null,null,null,null,null,null,null,null,null,null,null,null,null,null,null,null,null,null,null,null,null,null,null,null,null,null,null,null,null,null,null,null,null,null,null,null,null,null,null,null,null,null,null,null,null,null,null,null,null,null,null,null,null,null,null,null,null,null,null,null,null,null,null,null,null,null,null,null,null,null,null,null,null,null,null,null,null,29,"140 kg N kvæg",1.4,{"$f":"DE32*$C$149*UdnytNkvæg*0.01","v":98},{"$f":"DE32*$C$151","v":23.799999999999997},{"$f":"DE32*$C$153","v":93.8},null,null,3,null,2,null,2,null,1,null,2,null,2,null,2,null,2,null,2,null,1,null,2,null,1,null,1]
["Udbytte, halm",null,{"$f":"IF(CR16>1,IF($CR$5=1,VLOOKUP(CR16,_Afg07,$CS$5,0)*Halmpris,\"\"),\"\")","v":""},{"$f":"IF(C33<>\"\",\"kr.\",\"\")","v":""},null,null,{"$f":"IF(CS16>1,IF($CR$5=1,VLOOKUP(CS16,_Afg07,$CS$5,0)*Halmpris,\"\"),\"\")","v":""},{"$f":"IF(G33<>\"\",\"kr.\",\"\")","v":""},null,null,{"$f":"IF(CT16>1,IF($CR$5=1,VLOOKUP(CT16,_Afg07,$CS$5,0)*Halmpris,\"\"),\"\")","v":""},{"$f":"IF(K33<>\"\",\"kr.\",\"\")","v":""},null,null,null,null,"Afgrøde",null,"Alternativ 1",null,"Alternativ 2",null,null,null,null,null,null,null,null,null,null,null,null,null,null,null,null,null,null,null,null,null,null,null,null,null,null,null,null,null,null,null,null,null,null,null,null,null,null,null,null,null,null,null,null,null,null,null,null,null,null,null,null,null,null,null,null,null,null,null,null,null,null,null,null,null,null,null,null,null,null,null,null,null,null,null,null,null,null,null,null,null,null,null,null,null,30,"150 kg N kvæg",1.5,{"$f":"DE33*$C$149*UdnytNkvæg*0.01","v":105},{"$f":"DE33*$C$151","v":25.5},{"$f":"DE33*$C$153","v":100.5},null,null,null,null,null,null,null,null,null,null,"Timer i alt"]
["Forfrugtsværdi",null,{"$f":"IF(CR16>1,IF($CR$11=1,(VLOOKUP(CR16,_Afg07,$CS$11)*ffvpris+VLOOKUP(CR16,_Afg07,20)*Npris),0),\"\")","v":""},{"$f":"IF(C34<>\"\",\"kr.\",\"\")","v":""},null,null,{"$f":"IF(CS16>1,IF($CR$11=1,(VLOOKUP(CS16,_Afg07,$CS$11)*ffvpris+VLOOKUP(CS16,_Afg07,20)*Npris),0),\"\")","v":""},{"$f":"IF(G34<>\"\",\"kr.\",\"\")","v":""},null,null,{"$f":"IF(CT16>1,IF($CR$11=1,(VLOOKUP(CT16,_Afg07,$CS$11)*ffvpris+VLOOKUP(CT16,_Afg07,20)*Npris),0),\"\")","v":""},{"$f":"IF(K34<>\"\",\"kr.\",\"\")","v":""},null,null,null,null,null,null,null,null,null,null,null,null,null,null,null,null,null,null,null,null,null,null,null,null,null,null,null,null,null,null,null,null,null,null,null,null,null,null,null,null,null,null,null,null,null,null,null,null,null,null,null,null,null,null,null,null,null,null,null,null,null,null,null,null,null,null,null,null,null,null,null,null,null,null,null,null,null,null,null,null,null,null,null,null,null,"Erstatningskorn,sædskifte","Udbytte, foderkorn","Areal, foderkorn",null,null,"Halm fra foderkorn",null,"Hovedafgrøde_areal",null,31,"160 kg N kvæg",1.6,{"$f":"DE34*$C$149*UdnytNkvæg*0.01","v":112},{"$f":"DE34*$C$151","v":27.200000000000003},{"$f":"DE34*$C$153","v":107.2},null,null,"Pløjning",null,"Harvning efter høst",null,"Såbedsharvning",null,"Glyphosatsprøjtning",null,"Pløjning vinter/forå","Pløjning august","Pløjning sept","Harvning e høst juli","Harvning e høst august","Harvning e høst oktober","Såbedsharvn forår","Såbedsharvn august","Såbedsharvn september","Glyphosat forår","Glyphosat august","Glyphosat september","Såning forår","Såning august","Såning september","Høst juli","Høst august","Høst oktober","Halm juli","Halm august","Enkornsåning forår","Kartof lægning forår","Kartof optag sept","Roeoptag","Planteværn","Gødning","Gylle"]
["Tilskud",null,{"$f":"IF(Q35<>\"\",Q35,\"\")","v":""},{"$f":"IF(C35<>\"\",\"kr.\",\"\")","v":""},null,null,{"$f":"IF(S35<>\"\",S35,\"\")","v":""},{"$f":"IF(G35<>\"\",\"kr.\",\"\")","v":""},null,null,{"$f":"IF(U35<>\"\",U35,\"\")","v":""},{"$f":"IF(K35<>\"\",\"kr.\",\"\")","v":""},null,null,null,"Tilskud"]
["Bruttoudbytte i alt",null,{"$f":"IF(CR16>1,SUM(C32:C35),\"\")","v":""},{"$f":"IF(C36<>\"\",\"kr.\",\"\")","v":""},null,null,{"$f":"IF(CS16>1,SUM(G32:G35),\"\")","v":""},{"$f":"IF(G36<>\"\",\"kr.\",\"\")","v":""},null,null,{"$f":"IF(CT16>1,SUM(K32:K35),\"\")","v":""},{"$f":"IF(K36<>\"\",\"kr.\",\"\")","v":""},null,null,null,null,null,null,null,null,null,null,null,null,null,null,null,null,null,null,null,null,null,null,null,null,null,null,null,null,null,null,null,null,null,null,null,null,null,null,null,null,null,null,null,null,null,null,null,null,null,null,null,null,null,null,null,null,null,null,null,null,null,null,null,null,null,null,null,null,null,null,null,null,null,null,null,null,null,null,null,null,null,null,null,1,null,{"$f":"IF(CR36>1,IF(VLOOKUP(CR36,_Afg07,$BR$131)=2,IF($CR$7=2,-VLOOKUP($O$169,_Afg07,$CS$7)*Erstatpris*C93,0),0),0)","v":0},{"$f":"IF(AND(CR36>1,VLOOKUP(CR36,_Afg07,$BR$131)=1),IF(E93<>\"\",E93,F93)*C93,0)","v":0},{"$f":"IF(AND(CR36>1,VLOOKUP(CR36,_Afg07,$BR$131)=1),C93,0)","v":0},null,null,{"$f":"IF(AND(CR36>1,VLOOKUP(CR36,_Afg07,$BR$131)=1),VLOOKUP(CR36,_Afg07,Halmnr)*C93,0)","v":0},null,null,null,32,"170 kg N kvæg",1.7,{"$f":"DE36*$C$149*UdnytNkvæg*0.01","v":119},{"$f":"DE36*$C$151","v":28.9},{"$f":"DE36*$C$153","v":113.89999999999999},null,null,true,null,false,null,false,null,false,null,{"$f":"IF(VLOOKUP($CR36,_Afg07,$BS$131)=1,IF($DK36,$C93/IF(_Plo2<>\"\",_Plo2,Plo),0),0)","v":0},{"$f":"IF(VLOOKUP($CR36,_Afg07,$BS$131)=2,IF($DK36,$C93/IF(_Plo2<>\"\",_Plo2,Plo),0),0)","v":0},{"$f":"IF(VLOOKUP($CR36,_Afg07,$BS$131)=3,IF($DK36,$C93/IF(_Plo2<>\"\",_Plo2,Plo),0),0)","v":0},{"$f":"IF(VLOOKUP($CR36,_Afg07,$BW$131)=1,IF($DM36,$C93/IF(_Stu2<>\"\",_Stu2,Stu),0),0)","v":0},{"$f":"IF(VLOOKUP($CR36,_Afg07,$BW$131)=2,IF($DM36,$C93/IF(_Stu2<>\"\",_Stu2,Stu),0),0)","v":0},{"$f":"IF(VLOOKUP($CR36,_Afg07,$BW$131)=3,IF($DM36,$C93/IF(_Stu2<>\"\",_Stu2,Stu),0),0)","v":0},{"$f":"IF(VLOOKUP($CR36,_Afg07,$BT$131)=1,IF($DO36,$C93/IF(Såb2<>\"\",Såb2,Såb),0),0)","v":0},{"$f":"IF(VLOOKUP($CR36,_Afg07,$BT$131)=2,IF($DO36,$C93/IF(Såb2<>\"\",Såb2,Såb),0),0)","v":0},{"$f":"IF(VLOOKUP($CR36,_Afg07,$BT$131)=3,IF($DO36,$C93/IF(Såb2<>\"\",Såb2,Såb),0),0)","v":0},{"$f":"IF(VLOOKUP($CR36,_Afg07,$BU$131)=1,IF($DQ36,$C93/IF(_Gly2<>\"\",_Gly2,Gly),0),0)","v":0},{"$f":"IF(VLOOKUP($CR36,_Afg07,$BU$131)=2,IF($DQ36,$C93/IF(_Gly2<>\"\",_Gly2,Gly),0),0)","v":0},{"$f":"IF(VLOOKUP($CR36,_Afg07,$BU$131)=3,IF($DQ36,$C93/IF(_Gly2<>\"\",_Gly2,Gly),0),0)","v":0},{"$f":"IF(VLOOKUP($CR36,_Afg07,$BV$131)=1,$C93/IF(Såm2<>\"\",Såm2,Såm),0)","v":0},{"$f":"IF(VLOOKUP($CR36,_Afg07,$BV$131)=2,$C93/IF(Såm2<>\"\",Såm2,Såm),0)","v":0},{"$f":"IF(VLOOKUP($CR36,_Afg07,$BV$131)=3,$C93/IF(Såm2<>\"\",Såm2,Såm),0)","v":0},{"$f":"IF(VLOOKUP($CR36,_Afg07,$BX$131)=1,$C93/IF(_Mej2<>\"\",_Mej2,Mej)*VLOOKUP($CR36,_Afg07,$BZ$131),0)","v":0},{"$f":"IF(VLOOKUP($CR36,_Afg07,$BX$131)=2,$C93/IF(_Mej2<>\"\",_Mej2,Mej)*VLOOKUP($CR36,_Afg07,$BZ$131),0)","v":0},{"$f":"IF(VLOOKUP($CR36,_Afg07,$BX$131)=3,$C93/IF(_Mej2<>\"\",_Mej2,Mej)*VLOOKUP($CR36,_Afg07,$BZ$131),0)","v":0},{"$f":"IF(HalmJa=1,IF(VLOOKUP($CR36,_Afg07,$BY$131)=1,$C93/IF(_Hal3<>\"\",_Hal3,Hal)+$C93/_Hal2,0),0)","v":0},{"$f":"IF(HalmJa=1,IF(VLOOKUP($CR36,_Afg07,$BY$131)=2,$C93/IF(_Hal3<>\"\",_Hal3,Hal)+$C93/_Hal2,0),0)","v":0},{"$f":"IF(VLOOKUP($CR36,_Afg07,$CA$131)=1,$C93/IF(_Enk2<>\"\",_Enk2,Enk),0)","v":0},{"$f":"IF(VLOOKUP($CR36,_Afg07,$CB$131)=1,$C93/IF(_Kar2<>\"\",_Kar2,Kar),0)","v":0},{"$f":"IF(VLOOKUP($CR36,_Afg07,$CC$131)=1,$C93/IF(Kopt2<>\"\",Kopt2,Kopt),0)","v":0},{"$f":"IF(VLOOKUP($CR36,_Afg07,$CD$131)=1,$C93/IF(Ropt2<>\"\",Ropt2,Ropt),0)","v":0},{"$f":"VLOOKUP($CR36,_Afg07,$CE$131)*$C93/IF(_Gly2<>\"\",_Gly2,Gly)","v":0},{"$f":"VLOOKUP($CR36,_Afg07,$CF$131)*$C93/IF(Gød2<>\"\",Gød2,Gød)","v":0}]
[null,null,null,null,null,null,null,null,null,null,null,null,null,null,null,null,null,null,null,null,null,null,null,null,null,null,null,null,null,null,null,null,null,null,null,null,null,null,null,null,null,null,null,null,null,null,null,null,null,null,null,null,null,null,null,null,null,null,null,null,null,null,null,null,null,null,null,null,null,null,null,null,null,null,null,null,null,null,null,null,null,null,null,null,null,null,null,null,null,null,null,null,null,null,null,1,null,{"$f":"IF(CR37>1,IF(VLOOKUP(CR37,_Afg07,$BR$131)=2,IF($CR$7=2,-VLOOKUP($O$169,_Afg07,$CS$7)*Erstatpris*C113,0),0),0)","v":0},{"$f":"IF(AND(CR37>1,VLOOKUP(CR37,_Afg07,$BR$131)=1),IF(E113<>\"\",E113,F113)*C113,0)","v":0},{"$f":"IF(AND(CR37>1,VLOOKUP(CR37,_Afg07,$BR$131)=1),C113,0)","v":0},null,null,{"$f":"IF(AND(CR37>1,VLOOKUP(CR37,_Afg07,$BR$131)=1),VLOOKUP(CR37,_Afg07,Halmnr)*C113,0)","v":0},null,null,null,33,"180 kg N kvæg",1.8,126,30.6,120.60000000000001,null,null,true,null,false,null,false,null,false,null,{"$f":"IF(VLOOKUP($CR37,_Afg07,$BS$131)=1,IF($DK37,$C113/IF(_Plo2<>\"\",_Plo2,Plo),0),0)","v":0},{"$f":"IF(VLOOKUP($CR37,_Afg07,$BS$131)=2,IF($DK37,$C113/IF(_Plo2<>\"\",_Plo2,Plo),0),0)","v":0},{"$f":"IF(VLOOKUP($CR37,_Afg07,$BS$131)=3,IF($DK37,$C113/IF(_Plo2<>\"\",_Plo2,Plo),0),0)","v":0},{"$f":"IF(VLOOKUP($CR37,_Afg07,$BW$131)=1,IF($DM37,$C113/IF(_Stu2<>\"\",_Stu2,Stu),0),0)","v":0},{"$f":"IF(VLOOKUP($CR37,_Afg07,$BW$131)=2,IF($DM37,$C113/IF(_Stu2<>\"\",_Stu2,Stu),0),0)","v":0},{"$f":"IF(VLOOKUP($CR37,_Afg07,$BW$131)=3,IF($DM37,$C113/IF(_Stu2<>\"\",_Stu2,Stu),0),0)","v":0},{"$f":"IF(VLOOKUP($CR37,_Afg07,$BT$131)=1,IF($DO37,$C113/IF(Såb2<>\"\",Såb2,Såb),0),0)","v":0},{"$f":"IF(VLOOKUP($CR37,_Afg07,$BT$131)=2,IF($DO37,$C113/IF(Såb2<>\"\",Såb2,Såb),0),0)","v":0},{"$f":"IF(VLOOKUP($CR37,_Afg07,$BT$131)=3,IF($DO37,$C113/IF(Såb2<>\"\",Såb2,Såb),0),0)","v":0},{"$f":"IF(VLOOKUP($CR37,_Afg07,$BU$131)=1,IF($DQ37,$C113/IF(_Gly2<>\"\",_Gly2,Gly),0),0)","v":0},{"$f":"IF(VLOOKUP($CR37,_Afg07,$BU$131)=2,IF($DQ37,$C113/IF(_Gly2<>\"\",_Gly2,Gly),0),0)","v":0},{"$f":"IF(VLOOKUP($CR37,_Afg07,$BU$131)=3,IF($DQ37,$C113/IF(_Gly2<>\"\",_Gly2,Gly),0),0)","v":0},{"$f":"IF(VLOOKUP($CR37,_Afg07,$BV$131)=1,$C113/IF(Såm2<>\"\",Såm2,Såm),0)","v":0},{"$f":"IF(VLOOKUP($CR37,_Afg07,$BV$131)=2,$C113/IF(Såm2<>\"\",Såm2,Såm),0)","v":0},{"$f":"IF(VLOOKUP($CR37,_Afg07,$BV$131)=3,$C113/IF(Såm2<>\"\",Såm2,Såm),0)","v":0},{"$f":"IF(VLOOKUP($CR37,_Afg07,$BX$131)=1,$C113/IF(_Mej2<>\"\",_Mej2,Mej)*VLOOKUP($CR37,_Afg07,$BZ$131),0)","v":0},{"$f":"IF(VLOOKUP($CR37,_Afg07,$BX$131)=2,$C113/IF(_Mej2<>\"\",_Mej2,Mej)*VLOOKUP($CR37,_Afg07,$BZ$131),0)","v":0},{"$f":"IF(VLOOKUP($CR37,_Afg07,$BX$131)=3,$C113/IF(_Mej2<>\"\",_Mej2,Mej)*VLOOKUP($CR37,_Afg07,$BZ$131),0)","v":0},{"$f":"IF(HalmJa=1,IF(VLOOKUP($CR37,_Afg07,$BY$131)=1,$C113/IF(_Hal3<>\"\",_Hal3,Hal)+$C113/_Hal2,0),0)","v":0},{"$f":"IF(HalmJa=1,IF(VLOOKUP($CR37,_Afg07,$BY$131)=2,$C113/IF(_Hal3<>\"\",_Hal3,Hal)+$C113/_Hal2,0),0)","v":0},{"$f":"IF(VLOOKUP($CR37,_Afg07,$CA$131)=1,$C113/IF(_Enk2<>\"\",_Enk2,Enk),0)","v":0},{"$f":"IF(VLOOKUP($CR37,_Afg07,$CB$131)=1,$C113/IF(_Kar2<>\"\",_Kar2,Kar),0)","v":0},{"$f":"IF(VLOOKUP($CR37,_Afg07,$CC$131)=1,$C113/IF(Kopt2<>\"\",Kopt2,Kopt),0)","v":0},{"$f":"IF(VLOOKUP($CR37,_Afg07,$CD$131)=1,$C113/IF(Ropt2<>\"\",Ropt2,Ropt),0)","v":0},{"$f":"VLOOKUP($CR37,_Afg07,$CE$131)*$C113/IF(_Gly2<>\"\",_Gly2,Gly)","v":0},{"$f":"VLOOKUP($CR37,_Afg07,$CF$131)*$C113/IF(Gød2<>\"\",Gød2,Gød)","v":0}]
["Udsæd",null,{"$f":"IF(CR16>1,IF(Q38<>\"\",Q38,-VLOOKUP(CR16,_Afg07,AI131)),\"\")","v":""},{"$f":"IF(C38<>\"\",\"kr.\",\"\")","v":""},null,null,{"$f":"IF(CS16>1,IF(S38<>\"\",S38,-VLOOKUP(CS16,_Afg07,AI131)),\"\")","v":""},{"$f":"IF(G38<>\"\",\"kr.\",\"\")","v":""},null,null,{"$f":"IF(CT16>1,IF(U38<>\"\",U38,-VLOOKUP(CT16,_Afg07,AI131)),\"\")","v":""},{"$f":"IF(K38<>\"\",\"kr.\",\"\")","v":""},null,null,null,"Udsæd",null,null,null,null,null,null,null,null,null,null,null,null,null,null,null,null,null,null,null,null,null,null,null,null,null,null,null,null,null,null,null,null,null,null,null,null,null,null,null,null,null,null,null,null,null,null,null,null,null,null,null,null,null,null,null,null,null,null,null,null,null,null,null,null,null,null,null,null,null,null,null,null,null,null,null,null,null,null,null,1,null,{"$f":"IF(CR38>1,IF(VLOOKUP(CR38,_Afg07,$BR$131)=2,IF($CR$7=2,-VLOOKUP($O$169,_Afg07,$CS$7)*Erstatpris*C95,0),0),0)","v":0},{"$f":"IF(AND(CR38>1,VLOOKUP(CR38,_Afg07,$BR$131)=1),IF(E95<>\"\",E95,F95)*C95,0)","v":0},{"$f":"IF(AND(CR38>1,VLOOKUP(CR38,_Afg07,$BR$131)=1),C95,0)","v":0},null,null,{"$f":"IF(AND(CR38>1,VLOOKUP(CR38,_Afg07,$BR$131)=1),VLOOKUP(CR38,_Afg07,Halmnr)*C95,0)","v":0},null,null,null,34,"190 kg N kvæg",1.9,133,32.299999999999997,127.3,null,null,true,null,false,null,false,null,false,null,{"$f":"IF(VLOOKUP($CR38,_Afg07,$BS$131)=1,IF($DK38,$C95/IF(_Plo2<>\"\",_Plo2,Plo),0),0)","v":0},{"$f":"IF(VLOOKUP($CR38,_Afg07,$BS$131)=2,IF($DK38,$C95/IF(_Plo2<>\"\",_Plo2,Plo),0),0)","v":0},{"$f":"IF(VLOOKUP($CR38,_Afg07,$BS$131)=3,IF($DK38,$C95/IF(_Plo2<>\"\",_Plo2,Plo),0),0)","v":0},{"$f":"IF(VLOOKUP($CR38,_Afg07,$BW$131)=1,IF($DM38,$C95/IF(_Stu2<>\"\",_Stu2,Stu),0),0)","v":0},{"$f":"IF(VLOOKUP($CR38,_Afg07,$BW$131)=2,IF($DM38,$C95/IF(_Stu2<>\"\",_Stu2,Stu),0),0)","v":0},{"$f":"IF(VLOOKUP($CR38,_Afg07,$BW$131)=3,IF($DM38,$C95/IF(_Stu2<>\"\",_Stu2,Stu),0),0)","v":0},{"$f":"IF(VLOOKUP($CR38,_Afg07,$BT$131)=1,IF($DO38,$C95/IF(Såb2<>\"\",Såb2,Såb),0),0)","v":0},{"$f":"IF(VLOOKUP($CR38,_Afg07,$BT$131)=2,IF($DO38,$C95/IF(Såb2<>\"\",Såb2,Såb),0),0)","v":0},{"$f":"IF(VLOOKUP($CR38,_Afg07,$BT$131)=3,IF($DO38,$C95/IF(Såb2<>\"\",Såb2,Såb),0),0)","v":0},{"$f":"IF(VLOOKUP($CR38,_Afg07,$BU$131)=1,IF($DQ38,$C95/IF(_Gly2<>\"\",_Gly2,Gly),0),0)","v":0},{"$f":"IF(VLOOKUP($CR38,_Afg07,$BU$131)=2,IF($DQ38,$C95/IF(_Gly2<>\"\",_Gly2,Gly),0),0)","v":0},{"$f":"IF(VLOOKUP($CR38,_Afg07,$BU$131)=3,IF($DQ38,$C95/IF(_Gly2<>\"\",_Gly2,Gly),0),0)","v":0},{"$f":"IF(VLOOKUP($CR38,_Afg07,$BV$131)=1,$C95/IF(Såm2<>\"\",Såm2,Såm),0)","v":0},{"$f":"IF(VLOOKUP($CR38,_Afg07,$BV$131)=2,$C95/IF(Såm2<>\"\",Såm2,Såm),0)","v":0},{"$f":"IF(VLOOKUP($CR38,_Afg07,$BV$131)=3,$C95/IF(Såm2<>\"\",Såm2,Såm),0)","v":0},{"$f":"IF(VLOOKUP($CR38,_Afg07,$BX$131)=1,$C95/IF(_Mej2<>\"\",_Mej2,Mej)*VLOOKUP($CR38,_Afg07,$BZ$131),0)","v":0},{"$f":"IF(VLOOKUP($CR38,_Afg07,$BX$131)=2,$C95/IF(_Mej2<>\"\",_Mej2,Mej)*VLOOKUP($CR38,_Afg07,$BZ$131),0)","v":0},{"$f":"IF(VLOOKUP($CR38,_Afg07,$BX$131)=3,$C95/IF(_Mej2<>\"\",_Mej2,Mej)*VLOOKUP($CR38,_Afg07,$BZ$131),0)","v":0},{"$f":"IF(HalmJa=1,IF(VLOOKUP($CR38,_Afg07,$BY$131)=1,$C95/IF(_Hal3<>\"\",_Hal3,Hal)+$C95/_Hal2,0),0)","v":0},{"$f":"IF(HalmJa=1,IF(VLOOKUP($CR38,_Afg07,$BY$131)=2,$C95/IF(_Hal3<>\"\",_Hal3,Hal)+$C95/_Hal2,0),0)","v":0},{"$f":"IF(VLOOKUP($CR38,_Afg07,$CA$131)=1,$C95/IF(_Enk2<>\"\",_Enk2,Enk),0)","v":0},{"$f":"IF(VLOOKUP($CR38,_Afg07,$CB$131)=1,$C95/IF(_Kar2<>\"\",_Kar2,Kar),0)","v":0},{"$f":"IF(VLOOKUP($CR38,_Afg07,$CC$131)=1,$C95/IF(Kopt2<>\"\",Kopt2,Kopt),0)","v":0},{"$f":"IF(VLOOKUP($CR38,_Afg07,$CD$131)=1,$C95/IF(Ropt2<>\"\",Ropt2,Ropt),0)","v":0},{"$f":"VLOOKUP($CR38,_Afg07,$CE$131)*$C95/IF(_Gly2<>\"\",_Gly2,Gly)","v":0},{"$f":"VLOOKUP($CR38,_Afg07,$CF$131)*$C95/IF(Gød2<>\"\",Gød2,Gød)","v":0}]
["Gødning",null,{"$f":"IF(Afgnr>1,IF(Q39<>\"\",Q39,-C421),\"\")","v":""},{"$f":"IF(C39<>\"\",\"kr.\",\"\")","v":""},null,null,{"$f":"IF(Alt1nr>1,IF(S39<>\"\",S39,-G421),\"\")","v":""},{"$f":"IF(G39<>\"\",\"kr.\",\"\")","v":""},null,null,{"$f":"IF(Alt2nr>1,IF(U39<>\"\",U39,-K421),\"\")","v":""},{"$f":"IF(K39<>\"\",\"kr.\",\"\")","v":""},null,null,null,"Gødning",null,null,null,null,null,null,null,null,null,null,null,null,null,null,null,null,null,null,null,null,null,null,null,null,null,null,null,null,null,null,null,null,null,null,null,null,null,null,null,null,null,null,null,null,null,null,null,null,null,null,null,null,null,null,null,null,null,null,null,null,null,null,null,null,null,null,null,null,null,null,null,null,null,null,null,null,null,null,null,1,null,{"$f":"IF(CR39>1,IF(VLOOKUP(CR39,_Afg07,$BR$131)=2,IF($CR$7=2,-VLOOKUP($O$169,_Afg07,$CS$7)*Erstatpris*C115,0),0),0)","v":0},{"$f":"IF(AND(CR39>1,VLOOKUP(CR39,_Afg07,$BR$131)=1),IF(E115<>\"\",E115,F115)*C115,0)","v":0},{"$f":"IF(AND(CR39>1,VLOOKUP(CR39,_Afg07,$BR$131)=1),C115,0)","v":0},null,null,{"$f":"IF(AND(CR39>1,VLOOKUP(CR39,_Afg07,$BR$131)=1),VLOOKUP(CR39,_Afg07,Halmnr)*C115,0)","v":0},null,null,null,35,"200 kg N kvæg",2,140,34,134,null,null,true,null,false,null,false,null,false,null,{"$f":"IF(VLOOKUP($CR39,_Afg07,$BS$131)=1,IF($DK39,$C115/IF(_Plo2<>\"\",_Plo2,Plo),0),0)","v":0},{"$f":"IF(VLOOKUP($CR39,_Afg07,$BS$131)=2,IF($DK39,$C115/IF(_Plo2<>\"\",_Plo2,Plo),0),0)","v":0},{"$f":"IF(VLOOKUP($CR39,_Afg07,$BS$131)=3,IF($DK39,$C115/IF(_Plo2<>\"\",_Plo2,Plo),0),0)","v":0},{"$f":"IF(VLOOKUP($CR39,_Afg07,$BW$131)=1,IF($DM39,$C115/IF(_Stu2<>\"\",_Stu2,Stu),0),0)","v":0},{"$f":"IF(VLOOKUP($CR39,_Afg07,$BW$131)=2,IF($DM39,$C115/IF(_Stu2<>\"\",_Stu2,Stu),0),0)","v":0},{"$f":"IF(VLOOKUP($CR39,_Afg07,$BW$131)=3,IF($DM39,$C115/IF(_Stu2<>\"\",_Stu2,Stu),0),0)","v":0},{"$f":"IF(VLOOKUP($CR39,_Afg07,$BT$131)=1,IF($DO39,$C115/IF(Såb2<>\"\",Såb2,Såb),0),0)","v":0},{"$f":"IF(VLOOKUP($CR39,_Afg07,$BT$131)=2,IF($DO39,$C115/IF(Såb2<>\"\",Såb2,Såb),0),0)","v":0},{"$f":"IF(VLOOKUP($CR39,_Afg07,$BT$131)=3,IF($DO39,$C115/IF(Såb2<>\"\",Såb2,Såb),0),0)","v":0},{"$f":"IF(VLOOKUP($CR39,_Afg07,$BU$131)=1,IF($DQ39,$C115/IF(_Gly2<>\"\",_Gly2,Gly),0),0)","v":0},{"$f":"IF(VLOOKUP($CR39,_Afg07,$BU$131)=2,IF($DQ39,$C115/IF(_Gly2<>\"\",_Gly2,Gly),0),0)","v":0},{"$f":"IF(VLOOKUP($CR39,_Afg07,$BU$131)=3,IF($DQ39,$C115/IF(_Gly2<>\"\",_Gly2,Gly),0),0)","v":0},{"$f":"IF(VLOOKUP($CR39,_Afg07,$BV$131)=1,$C115/IF(Såm2<>\"\",Såm2,Såm),0)","v":0},{"$f":"IF(VLOOKUP($CR39,_Afg07,$BV$131)=2,$C115/IF(Såm2<>\"\",Såm2,Såm),0)","v":0},{"$f":"IF(VLOOKUP($CR39,_Afg07,$BV$131)=3,$C115/IF(Såm2<>\"\",Såm2,Såm),0)","v":0},{"$f":"IF(VLOOKUP($CR39,_Afg07,$BX$131)=1,$C115/IF(_Mej2<>\"\",_Mej2,Mej)*VLOOKUP($CR39,_Afg07,$BZ$131),0)","v":0},{"$f":"IF(VLOOKUP($CR39,_Afg07,$BX$131)=2,$C115/IF(_Mej2<>\"\",_Mej2,Mej)*VLOOKUP($CR39,_Afg07,$BZ$131),0)","v":0},{"$f":"IF(VLOOKUP($CR39,_Afg07,$BX$131)=3,$C115/IF(_Mej2<>\"\",_Mej2,Mej)*VLOOKUP($CR39,_Afg07,$BZ$131),0)","v":0},{"$f":"IF(HalmJa=1,IF(VLOOKUP($CR39,_Afg07,$BY$131)=1,$C115/IF(_Hal3<>\"\",_Hal3,Hal)+$C115/_Hal2,0),0)","v":0},{"$f":"IF(HalmJa=1,IF(VLOOKUP($CR39,_Afg07,$BY$131)=2,$C115/IF(_Hal3<>\"\",_Hal3,Hal)+$C115/_Hal2,0),0)","v":0},{"$f":"IF(VLOOKUP($CR39,_Afg07,$CA$131)=1,$C115/IF(_Enk2<>\"\",_Enk2,Enk),0)","v":0},{"$f":"IF(VLOOKUP($CR39,_Afg07,$CB$131)=1,$C115/IF(_Kar2<>\"\",_Kar2,Kar),0)","v":0},{"$f":"IF(VLOOKUP($CR39,_Afg07,$CC$131)=1,$C115/IF(Kopt2<>\"\",Kopt2,Kopt),0)","v":0},{"$f":"IF(VLOOKUP($CR39,_Afg07,$CD$131)=1,$C115/IF(Ropt2<>\"\",Ropt2,Ropt),0)","v":0},{"$f":"VLOOKUP($CR39,_Afg07,$CE$131)*$C115/IF(_Gly2<>\"\",_Gly2,Gly)","v":0},{"$f":"VLOOKUP($CR39,_Afg07,$CF$131)*$C115/IF(Gød2<>\"\",Gød2,Gød)","v":0}]
["Planteværn",null,{"$f":"IF(CR16>1,IF(Q40<>\"\",Q40,-VLOOKUP(CR16,_Afg07,AJ131)),\"\")","v":""},{"$f":"IF(C40<>\"\",\"kr.\",\"\")","v":""},null,null,{"$f":"IF(CS16>1,IF(S40<>\"\",S40,-VLOOKUP(CS16,_Afg07,AJ131)),\"\")","v":""},{"$f":"IF(G40<>\"\",\"kr.\",\"\")","v":""},null,null,{"$f":"IF(CT16>1,IF(U40<>\"\",U40,-VLOOKUP(CT16,_Afg07,AJ131)),\"\")","v":""},{"$f":"IF(K40<>\"\",\"kr.\",\"\")","v":""},null,null,null,"Planteværn",null,null,null,null,null,null,null,null,null,null,null,null,null,null,null,null,null,null,null,null,null,null,null,null,null,null,null,null,null,null,null,null,null,null,null,null,null,null,null,null,null,null,null,null,null,null,null,null,null,null,null,null,null,null,null,null,null,null,null,null,null,null,null,null,null,null,null,null,null,null,null,null,null,null,null,null,null,null,null,1,null,{"$f":"IF(CR40>1,IF(VLOOKUP(CR40,_Afg07,$BR$131)=2,IF($CR$7=2,-VLOOKUP($O$169,_Afg07,$CS$7)*Erstatpris*C97,0),0),0)","v":0},{"$f":"IF(AND(CR40>1,VLOOKUP(CR40,_Afg07,$BR$131)=1),IF(E97<>\"\",E97,F97)*C97,0)","v":0},{"$f":"IF(AND(CR40>1,VLOOKUP(CR40,_Afg07,$BR$131)=1),C97,0)","v":0},null,null,{"$f":"IF(AND(CR40>1,VLOOKUP(CR40,_Afg07,$BR$131)=1),VLOOKUP(CR40,_Afg07,Halmnr)*C97,0)","v":0},null,null,null,36,"210 kg N kvæg",2.1,147,35.700000000000003,140.70000000000002,null,null,true,null,false,null,false,null,false,null,{"$f":"IF(VLOOKUP($CR40,_Afg07,$BS$131)=1,IF($DK40,$C97/IF(_Plo2<>\"\",_Plo2,Plo),0),0)","v":0},{"$f":"IF(VLOOKUP($CR40,_Afg07,$BS$131)=2,IF($DK40,$C97/IF(_Plo2<>\"\",_Plo2,Plo),0),0)","v":0},{"$f":"IF(VLOOKUP($CR40,_Afg07,$BS$131)=3,IF($DK40,$C97/IF(_Plo2<>\"\",_Plo2,Plo),0),0)","v":0},{"$f":"IF(VLOOKUP($CR40,_Afg07,$BW$131)=1,IF($DM40,$C97/IF(_Stu2<>\"\",_Stu2,Stu),0),0)","v":0},{"$f":"IF(VLOOKUP($CR40,_Afg07,$BW$131)=2,IF($DM40,$C97/IF(_Stu2<>\"\",_Stu2,Stu),0),0)","v":0},{"$f":"IF(VLOOKUP($CR40,_Afg07,$BW$131)=3,IF($DM40,$C97/IF(_Stu2<>\"\",_Stu2,Stu),0),0)","v":0},{"$f":"IF(VLOOKUP($CR40,_Afg07,$BT$131)=1,IF($DO40,$C97/IF(Såb2<>\"\",Såb2,Såb),0),0)","v":0},{"$f":"IF(VLOOKUP($CR40,_Afg07,$BT$131)=2,IF($DO40,$C97/IF(Såb2<>\"\",Såb2,Såb),0),0)","v":0},{"$f":"IF(VLOOKUP($CR40,_Afg07,$BT$131)=3,IF($DO40,$C97/IF(Såb2<>\"\",Såb2,Såb),0),0)","v":0},{"$f":"IF(VLOOKUP($CR40,_Afg07,$BU$131)=1,IF($DQ40,$C97/IF(_Gly2<>\"\",_Gly2,Gly),0),0)","v":0},{"$f":"IF(VLOOKUP($CR40,_Afg07,$BU$131)=2,IF($DQ40,$C97/IF(_Gly2<>\"\",_Gly2,Gly),0),0)","v":0},{"$f":"IF(VLOOKUP($CR40,_Afg07,$BU$131)=3,IF($DQ40,$C97/IF(_Gly2<>\"\",_Gly2,Gly),0),0)","v":0},{"$f":"IF(VLOOKUP($CR40,_Afg07,$BV$131)=1,$C97/IF(Såm2<>\"\",Såm2,Såm),0)","v":0},{"$f":"IF(VLOOKUP($CR40,_Afg07,$BV$131)=2,$C97/IF(Såm2<>\"\",Såm2,Såm),0)","v":0},{"$f":"IF(VLOOKUP($CR40,_Afg07,$BV$131)=3,$C97/IF(Såm2<>\"\",Såm2,Såm),0)","v":0},{"$f":"IF(VLOOKUP($CR40,_Afg07,$BX$131)=1,$C97/IF(_Mej2<>\"\",_Mej2,Mej)*VLOOKUP($CR40,_Afg07,$BZ$131),0)","v":0},{"$f":"IF(VLOOKUP($CR40,_Afg07,$BX$131)=2,$C97/IF(_Mej2<>\"\",_Mej2,Mej)*VLOOKUP($CR40,_Afg07,$BZ$131),0)","v":0},{"$f":"IF(VLOOKUP($CR40,_Afg07,$BX$131)=3,$C97/IF(_Mej2<>\"\",_Mej2,Mej)*VLOOKUP($CR40,_Afg07,$BZ$131),0)","v":0},{"$f":"IF(HalmJa=1,IF(VLOOKUP($CR40,_Afg07,$BY$131)=1,$C97/IF(_Hal3<>\"\",_Hal3,Hal)+$C97/_Hal2,0),0)","v":0},{"$f":"IF(HalmJa=1,IF(VLOOKUP($CR40,_Afg07,$BY$131)=2,$C97/IF(_Hal3<>\"\",_Hal3,Hal)+$C97/_Hal2,0),0)","v":0},{"$f":"IF(VLOOKUP($CR40,_Afg07,$CA$131)=1,$C97/IF(_Enk2<>\"\",_Enk2,Enk),0)","v":0},{"$f":"IF(VLOOKUP($CR40,_Afg07,$CB$131)=1,$C97/IF(_Kar2<>\"\",_Kar2,Kar),0)","v":0},{"$f":"IF(VLOOKUP($CR40,_Afg07,$CC$131)=1,$C97/IF(Kopt2<>\"\",Kopt2,Kopt),0)","v":0},{"$f":"IF(VLOOKUP($CR40,_Afg07,$CD$131)=1,$C97/IF(Ropt2<>\"\",Ropt2,Ropt),0)","v":0},{"$f":"VLOOKUP($CR40,_Afg07,$CE$131)*$C97/IF(_Gly2<>\"\",_Gly2,Gly)","v":0},{"$f":"VLOOKUP($CR40,_Afg07,$CF$131)*$C97/IF(Gød2<>\"\",Gød2,Gød)","v":0}]
["Diverse",null,{"$f":"IF(Afgnr>1,IF(Q41<>\"\",Q41,-VLOOKUP(Afgnr,_Afg07,$AK$131)-C$29*VLOOKUP(Afgnr,_Afg07,$AY$131)),\"\")","v":""},{"$f":"IF(C41<>\"\",\"kr.\",\"\")","v":""},null,null,{"$f":"IF(CS16>1,IF(S41<>\"\",S41,-VLOOKUP(CS16,_Afg07,AK131)-G29*VLOOKUP(CS16,_Afg07,AY131)),\"\")","v":""},{"$f":"IF(G41<>\"\",\"kr.\",\"\")","v":""},null,null,{"$f":"IF(CT16>1,IF(U41<>\"\",U41,-VLOOKUP(CT16,_Afg07,AK131)-K29*VLOOKUP(CT16,_Afg07,AY131)),\"\")","v":""},{"$f":"IF(K41<>\"\",\"kr.\",\"\")","v":""},null,null,null,"Diverse",null,null,null,null,null,null,null,null,null,null,null,null,null,null,null,null,null,null,null,null,null,null,null,null,null,null,null,null,null,null,null,null,null,null,null,null,null,null,null,null,null,null,null,null,null,null,null,null,null,null,null,null,null,null,null,null,null,null,null,null,null,null,null,null,null,null,null,null,null,null,null,null,null,null,null,null,null,null,null,1,null,{"$f":"IF(CR41>1,IF(VLOOKUP(CR41,_Afg07,$BR$131)=2,IF($CR$7=2,-VLOOKUP($O$169,_Afg07,$CS$7)*Erstatpris*C117,0),0),0)","v":0},{"$f":"IF(AND(CR41>1,VLOOKUP(CR41,_Afg07,$BR$131)=1),IF(E117<>\"\",E117,F117)*C117,0)","v":0},{"$f":"IF(AND(CR41>1,VLOOKUP(CR41,_Afg07,$BR$131)=1),C117,0)","v":0},null,null,{"$f":"IF(AND(CR41>1,VLOOKUP(CR41,_Afg07,$BR$131)=1),VLOOKUP(CR41,_Afg07,Halmnr)*C117,0)","v":0},null,null,null,37,"220 kg N kvæg",2.2000000000000002,154.00000000000003,37.400000000000006,147.4,null,null,true,null,false,null,false,null,false,null,{"$f":"IF(VLOOKUP($CR41,_Afg07,$BS$131)=1,IF($DK41,$C117/IF(_Plo2<>\"\",_Plo2,Plo),0),0)","v":0},{"$f":"IF(VLOOKUP($CR41,_Afg07,$BS$131)=2,IF($DK41,$C117/IF(_Plo2<>\"\",_Plo2,Plo),0),0)","v":0},{"$f":"IF(VLOOKUP($CR41,_Afg07,$BS$131)=3,IF($DK41,$C117/IF(_Plo2<>\"\",_Plo2,Plo),0),0)","v":0},{"$f":"IF(VLOOKUP($CR41,_Afg07,$BW$131)=1,IF($DM41,$C117/IF(_Stu2<>\"\",_Stu2,Stu),0),0)","v":0},{"$f":"IF(VLOOKUP($CR41,_Afg07,$BW$131)=2,IF($DM41,$C117/IF(_Stu2<>\"\",_Stu2,Stu),0),0)","v":0},{"$f":"IF(VLOOKUP($CR41,_Afg07,$BW$131)=3,IF($DM41,$C117/IF(_Stu2<>\"\",_Stu2,Stu),0),0)","v":0},{"$f":"IF(VLOOKUP($CR41,_Afg07,$BT$131)=1,IF($DO41,$C117/IF(Såb2<>\"\",Såb2,Såb),0),0)","v":0},{"$f":"IF(VLOOKUP($CR41,_Afg07,$BT$131)=2,IF($DO41,$C117/IF(Såb2<>\"\",Såb2,Såb),0),0)","v":0},{"$f":"IF(VLOOKUP($CR41,_Afg07,$BT$131)=3,IF($DO41,$C117/IF(Såb2<>\"\",Såb2,Såb),0),0)","v":0},{"$f":"IF(VLOOKUP($CR41,_Afg07,$BU$131)=1,IF($DQ41,$C117/IF(_Gly2<>\"\",_Gly2,Gly),0),0)","v":0},{"$f":"IF(VLOOKUP($CR41,_Afg07,$BU$131)=2,IF($DQ41,$C117/IF(_Gly2<>\"\",_Gly2,Gly),0),0)","v":0},{"$f":"IF(VLOOKUP($CR41,_Afg07,$BU$131)=3,IF($DQ41,$C117/IF(_Gly2<>\"\",_Gly2,Gly),0),0)","v":0},{"$f":"IF(VLOOKUP($CR41,_Afg07,$BV$131)=1,$C117/IF(Såm2<>\"\",Såm2,Såm),0)","v":0},{"$f":"IF(VLOOKUP($CR41,_Afg07,$BV$131)=2,$C117/IF(Såm2<>\"\",Såm2,Såm),0)","v":0},{"$f":"IF(VLOOKUP($CR41,_Afg07,$BV$131)=3,$C117/IF(Såm2<>\"\",Såm2,Såm),0)","v":0},{"$f":"IF(VLOOKUP($CR41,_Afg07,$BX$131)=1,$C117/IF(_Mej2<>\"\",_Mej2,Mej)*VLOOKUP($CR41,_Afg07,$BZ$131),0)","v":0},{"$f":"IF(VLOOKUP($CR41,_Afg07,$BX$131)=2,$C117/IF(_Mej2<>\"\",_Mej2,Mej)*VLOOKUP($CR41,_Afg07,$BZ$131),0)","v":0},{"$f":"IF(VLOOKUP($CR41,_Afg07,$BX$131)=3,$C117/IF(_Mej2<>\"\",_Mej2,Mej)*VLOOKUP($CR41,_Afg07,$BZ$131),0)","v":0},{"$f":"IF(HalmJa=1,IF(VLOOKUP($CR41,_Afg07,$BY$131)=1,$C117/IF(_Hal3<>\"\",_Hal3,Hal)+$C117/_Hal2,0),0)","v":0},{"$f":"IF(HalmJa=1,IF(VLOOKUP($CR41,_Afg07,$BY$131)=2,$C117/IF(_Hal3<>\"\",_Hal3,Hal)+$C117/_Hal2,0),0)","v":0},{"$f":"IF(VLOOKUP($CR41,_Afg07,$CA$131)=1,$C117/IF(_Enk2<>\"\",_Enk2,Enk),0)","v":0},{"$f":"IF(VLOOKUP($CR41,_Afg07,$CB$131)=1,$C117/IF(_Kar2<>\"\",_Kar2,Kar),0)","v":0},{"$f":"IF(VLOOKUP($CR41,_Afg07,$CC$131)=1,$C117/IF(Kopt2<>\"\",Kopt2,Kopt),0)","v":0},{"$f":"IF(VLOOKUP($CR41,_Afg07,$CD$131)=1,$C117/IF(Ropt2<>\"\",Ropt2,Ropt),0)","v":0},{"$f":"VLOOKUP($CR41,_Afg07,$CE$131)*$C117/IF(_Gly2<>\"\",_Gly2,Gly)","v":0},{"$f":"VLOOKUP($CR41,_Afg07,$CF$131)*$C117/IF(Gød2<>\"\",Gød2,Gød)","v":0}]
["Stykomkostninger i alt",null,{"$f":"IF(Afgnr>1,C38+C39+C40+C41,\"\")","v":""},{"$f":"IF(C42<>\"\",\"kr.\",\"\")","v":""},null,null,{"$f":"IF(Alt1nr>1,G38+G39+G40+G41,\"\")","v":""},{"$f":"IF(G42<>\"\",\"kr.\",\"\")","v":""},null,null,{"$f":"IF(Alt2nr>1,K38+K39+K40+K41,\"\")","v":""},{"$f":"IF(K42<>\"\",\"kr.\",\"\")","v":""},null,null,null,null,{"$f":"IF(OR(Q38>0,Q39>0,Q40>0,Q41>0),\"Husk minus foran\",\"\")","v":""},null,{"$f":"IF(OR(S38>0,S39>0,S40>0,S41>0),\"Husk minus foran\",\"\")","v":""},null,{"$f":"IF(OR(U38>0,U39>0,U40>0,U41>0),\"Husk minus foran\",\"\")","v":""},null,null,null,null,null,null,null,null,null,null,null,null,null,null,null,null,null,null,null,null,null,null,null,null,null,null,null,null,null,null,null,null,null,null,null,null,null,null,null,null,null,null,null,null,null,null,null,null,null,null,null,null,null,null,null,null,null,null,null,null,null,null,null,null,null,null,null,null,null,null,null,null,null,null,1,null,{"$f":"IF(CR42>1,IF(VLOOKUP(CR42,_Afg07,$BR$131)=2,IF($CR$7=2,-VLOOKUP($O$169,_Afg07,$CS$7)*Erstatpris*C99,0),0),0)","v":0},{"$f":"IF(AND(CR42>1,VLOOKUP(CR42,_Afg07,$BR$131)=1),IF(E99<>\"\",E99,F99)*C99,0)","v":0},{"$f":"IF(AND(CR42>1,VLOOKUP(CR42,_Afg07,$BR$131)=1),C99,0)","v":0},null,null,{"$f":"IF(AND(CR42>1,VLOOKUP(CR42,_Afg07,$BR$131)=1),VLOOKUP(CR42,_Afg07,Halmnr)*C99,0)","v":0},null,null,null,38,"230 kg N kvæg",2.2999999999999998,160.99999999999997,39.099999999999994,154.1,null,null,true,null,false,null,false,null,false,null,{"$f":"IF(VLOOKUP($CR42,_Afg07,$BS$131)=1,IF($DK42,$C99/IF(_Plo2<>\"\",_Plo2,Plo),0),0)","v":0},{"$f":"IF(VLOOKUP($CR42,_Afg07,$BS$131)=2,IF($DK42,$C99/IF(_Plo2<>\"\",_Plo2,Plo),0),0)","v":0},{"$f":"IF(VLOOKUP($CR42,_Afg07,$BS$131)=3,IF($DK42,$C99/IF(_Plo2<>\"\",_Plo2,Plo),0),0)","v":0},{"$f":"IF(VLOOKUP($CR42,_Afg07,$BW$131)=1,IF($DM42,$C99/IF(_Stu2<>\"\",_Stu2,Stu),0),0)","v":0},{"$f":"IF(VLOOKUP($CR42,_Afg07,$BW$131)=2,IF($DM42,$C99/IF(_Stu2<>\"\",_Stu2,Stu),0),0)","v":0},{"$f":"IF(VLOOKUP($CR42,_Afg07,$BW$131)=3,IF($DM42,$C99/IF(_Stu2<>\"\",_Stu2,Stu),0),0)","v":0},{"$f":"IF(VLOOKUP($CR42,_Afg07,$BT$131)=1,IF($DO42,$C99/IF(Såb2<>\"\",Såb2,Såb),0),0)","v":0},{"$f":"IF(VLOOKUP($CR42,_Afg07,$BT$131)=2,IF($DO42,$C99/IF(Såb2<>\"\",Såb2,Såb),0),0)","v":0},{"$f":"IF(VLOOKUP($CR42,_Afg07,$BT$131)=3,IF($DO42,$C99/IF(Såb2<>\"\",Såb2,Såb),0),0)","v":0},{"$f":"IF(VLOOKUP($CR42,_Afg07,$BU$131)=1,IF($DQ42,$C99/IF(_Gly2<>\"\",_Gly2,Gly),0),0)","v":0},{"$f":"IF(VLOOKUP($CR42,_Afg07,$BU$131)=2,IF($DQ42,$C99/IF(_Gly2<>\"\",_Gly2,Gly),0),0)","v":0},{"$f":"IF(VLOOKUP($CR42,_Afg07,$BU$131)=3,IF($DQ42,$C99/IF(_Gly2<>\"\",_Gly2,Gly),0),0)","v":0},{"$f":"IF(VLOOKUP($CR42,_Afg07,$BV$131)=1,$C99/IF(Såm2<>\"\",Såm2,Såm),0)","v":0},{"$f":"IF(VLOOKUP($CR42,_Afg07,$BV$131)=2,$C99/IF(Såm2<>\"\",Såm2,Såm),0)","v":0},{"$f":"IF(VLOOKUP($CR42,_Afg07,$BV$131)=3,$C99/IF(Såm2<>\"\",Såm2,Såm),0)","v":0},{"$f":"IF(VLOOKUP($CR42,_Afg07,$BX$131)=1,$C99/IF(_Mej2<>\"\",_Mej2,Mej)*VLOOKUP($CR42,_Afg07,$BZ$131),0)","v":0},{"$f":"IF(VLOOKUP($CR42,_Afg07,$BX$131)=2,$C99/IF(_Mej2<>\"\",_Mej2,Mej)*VLOOKUP($CR42,_Afg07,$BZ$131),0)","v":0},{"$f":"IF(VLOOKUP($CR42,_Afg07,$BX$131)=3,$C99/IF(_Mej2<>\"\",_Mej2,Mej)*VLOOKUP($CR42,_Afg07,$BZ$131),0)","v":0},{"$f":"IF(HalmJa=1,IF(VLOOKUP($CR42,_Afg07,$BY$131)=1,$C99/IF(_Hal3<>\"\",_Hal3,Hal)+$C99/_Hal2,0),0)","v":0},{"$f":"IF(HalmJa=1,IF(VLOOKUP($CR42,_Afg07,$BY$131)=2,$C99/IF(_Hal3<>\"\",_Hal3,Hal)+$C99/_Hal2,0),0)","v":0},{"$f":"IF(VLOOKUP($CR42,_Afg07,$CA$131)=1,$C99/IF(_Enk2<>\"\",_Enk2,Enk),0)","v":0},{"$f":"IF(VLOOKUP($CR42,_Afg07,$CB$131)=1,$C99/IF(_Kar2<>\"\",_Kar2,Kar),0)","v":0},{"$f":"IF(VLOOKUP($CR42,_Afg07,$CC$131)=1,$C99/IF(Kopt2<>\"\",Kopt2,Kopt),0)","v":0},{"$f":"IF(VLOOKUP($CR42,_Afg07,$CD$131)=1,$C99/IF(Ropt2<>\"\",Ropt2,Ropt),0)","v":0},{"$f":"VLOOKUP($CR42,_Afg07,$CE$131)*$C99/IF(_Gly2<>\"\",_Gly2,Gly)","v":0},{"$f":"VLOOKUP($CR42,_Afg07,$CF$131)*$C99/IF(Gød2<>\"\",Gød2,Gød)","v":0}]
[null,null,null,null,null,null,null,null,null,null,null,null,null,null,null,null,null,null,null,null,null,null,null,null,null,null,null,null,null,null,null,null,null,null,null,null,null,null,null,null,null,null,null,null,null,null,null,null,null,null,null,null,null,null,null,null,null,null,null,null,null,null,null,null,null,null,null,null,null,null,null,null,null,null,null,null,null,null,null,null,null,null,null,null,null,null,null,null,null,null,null,null,null,null,null,1,null,{"$f":"IF(CR43>1,IF(VLOOKUP(CR43,_Afg07,$BR$131)=2,IF($CR$7=2,-VLOOKUP($O$169,_Afg07,$CS$7)*Erstatpris*C119,0),0),0)","v":0},{"$f":"IF(AND(CR43>1,VLOOKUP(CR43,_Afg07,$BR$131)=1),IF(E119<>\"\",E119,F119)*C119,0)","v":0},{"$f":"IF(AND(CR43>1,VLOOKUP(CR43,_Afg07,$BR$131)=1),C119,0)","v":0},null,null,{"$f":"IF(AND(CR43>1,VLOOKUP(CR43,_Afg07,$BR$131)=1),VLOOKUP(CR43,_Afg07,Halmnr)*C119,0)","v":0},null,null,null,null,null,null,null,null,null,null,null,true,null,false,null,false,null,false,null,{"$f":"IF(VLOOKUP($CR43,_Afg07,$BS$131)=1,IF($DK43,$C119/IF(_Plo2<>\"\",_Plo2,Plo),0),0)","v":0},{"$f":"IF(VLOOKUP($CR43,_Afg07,$BS$131)=2,IF($DK43,$C119/IF(_Plo2<>\"\",_Plo2,Plo),0),0)","v":0},{"$f":"IF(VLOOKUP($CR43,_Afg07,$BS$131)=3,IF($DK43,$C119/IF(_Plo2<>\"\",_Plo2,Plo),0),0)","v":0},{"$f":"IF(VLOOKUP($CR43,_Afg07,$BW$131)=1,IF($DM43,$C119/IF(_Stu2<>\"\",_Stu2,Stu),0),0)","v":0},{"$f":"IF(VLOOKUP($CR43,_Afg07,$BW$131)=2,IF($DM43,$C119/IF(_Stu2<>\"\",_Stu2,Stu),0),0)","v":0},{"$f":"IF(VLOOKUP($CR43,_Afg07,$BW$131)=3,IF($DM43,$C119/IF(_Stu2<>\"\",_Stu2,Stu),0),0)","v":0},{"$f":"IF(VLOOKUP($CR43,_Afg07,$BT$131)=1,IF($DO43,$C119/IF(Såb2<>\"\",Såb2,Såb),0),0)","v":0},{"$f":"IF(VLOOKUP($CR43,_Afg07,$BT$131)=2,IF($DO43,$C119/IF(Såb2<>\"\",Såb2,Såb),0),0)","v":0},{"$f":"IF(VLOOKUP($CR43,_Afg07,$BT$131)=3,IF($DO43,$C119/IF(Såb2<>\"\",Såb2,Såb),0),0)","v":0},{"$f":"IF(VLOOKUP($CR43,_Afg07,$BU$131)=1,IF($DQ43,$C119/IF(_Gly2<>\"\",_Gly2,Gly),0),0)","v":0},{"$f":"IF(VLOOKUP($CR43,_Afg07,$BU$131)=2,IF($DQ43,$C119/IF(_Gly2<>\"\",_Gly2,Gly),0),0)","v":0},{"$f":"IF(VLOOKUP($CR43,_Afg07,$BU$131)=3,IF($DQ43,$C119/IF(_Gly2<>\"\",_Gly2,Gly),0),0)","v":0},{"$f":"IF(VLOOKUP($CR43,_Afg07,$BV$131)=1,$C119/IF(Såm2<>\"\",Såm2,Såm),0)","v":0},{"$f":"IF(VLOOKUP($CR43,_Afg07,$BV$131)=2,$C119/IF(Såm2<>\"\",Såm2,Såm),0)","v":0},{"$f":"IF(VLOOKUP($CR43,_Afg07,$BV$131)=3,$C119/IF(Såm2<>\"\",Såm2,Såm),0)","v":0},{"$f":"IF(VLOOKUP($CR43,_Afg07,$BX$131)=1,$C119/IF(_Mej2<>\"\",_Mej2,Mej)*VLOOKUP($CR43,_Afg07,$BZ$131),0)","v":0},{"$f":"IF(VLOOKUP($CR43,_Afg07,$BX$131)=2,$C119/IF(_Mej2<>\"\",_Mej2,Mej)*VLOOKUP($CR43,_Afg07,$BZ$131),0)","v":0},{"$f":"IF(VLOOKUP($CR43,_Afg07,$BX$131)=3,$C119/IF(_Mej2<>\"\",_Mej2,Mej)*VLOOKUP($CR43,_Afg07,$BZ$131),0)","v":0},{"$f":"IF(HalmJa=1,IF(VLOOKUP($CR43,_Afg07,$BY$131)=1,$C119/IF(_Hal3<>\"\",_Hal3,Hal)+$C119/_Hal2,0),0)","v":0},{"$f":"IF(HalmJa=1,IF(VLOOKUP($CR43,_Afg07,$BY$131)=2,$C119/IF(_Hal3<>\"\",_Hal3,Hal)+$C119/_Hal2,0),0)","v":0},{"$f":"IF(VLOOKUP($CR43,_Afg07,$CA$131)=1,$C119/IF(_Enk2<>\"\",_Enk2,Enk),0)","v":0},{"$f":"IF(VLOOKUP($CR43,_Afg07,$CB$131)=1,$C119/IF(_Kar2<>\"\",_Kar2,Kar),0)","v":0},{"$f":"IF(VLOOKUP($CR43,_Afg07,$CC$131)=1,$C119/IF(Kopt2<>\"\",Kopt2,Kopt),0)","v":0},{"$f":"IF(VLOOKUP($CR43,_Afg07,$CD$131)=1,$C119/IF(Ropt2<>\"\",Ropt2,Ropt),0)","v":0},{"$f":"VLOOKUP($CR43,_Afg07,$CE$131)*$C119/IF(_Gly2<>\"\",_Gly2,Gly)","v":0},{"$f":"VLOOKUP($CR43,_Afg07,$CF$131)*$C119/IF(Gød2<>\"\",Gød2,Gød)","v":0}]
["Dækningsbidrag",null,{"$f":"IF(Afgnr>1,(C36+C42),\"\")","v":""},{"$f":"IF(C46<>\"\",\"kr.\",\"\")","v":{"$error":"#VALUE!"}},null,null,{"$f":"IF(Alt1nr>1,(G36+G42),\"\")","v":""},{"$f":"IF(G44<>\"\",\"kr.\",\"\")","v":""},null,null,{"$f":"IF(Alt2nr>1,(K36+K42),\"\")","v":""},{"$f":"IF(K44<>\"\",\"kr.\",\"\")","v":""},null,null,null,null,null,null,null,null,null,null,null,null,null,null,null,null,null,null,null,null,null,null,null,null,null,null,null,null,null,null,null,null,null,null,null,null,null,null,null,null,null,null,null,null,null,null,null,null,null,null,null,null,null,null,null,null,null,null,null,null,null,null,null,null,null,null,null,null,null,null,null,null,null,null,null,null,null,null,null,null,null,null,null,1,null,{"$f":"IF(CR44>1,IF(VLOOKUP(CR44,_Afg07,$BR$131)=2,IF($CR$7=2,-VLOOKUP($O$169,_Afg07,$CS$7)*Erstatpris*C101,0),0),0)","v":0},{"$f":"IF(AND(CR44>1,VLOOKUP(CR44,_Afg07,$BR$131)=1),IF(E101<>\"\",E101,F101)*C101,0)","v":0},{"$f":"IF(AND(CR44>1,VLOOKUP(CR44,_Afg07,$BR$131)=1),C101,0)","v":0},null,null,{"$f":"IF(AND(CR44>1,VLOOKUP(CR44,_Afg07,$BR$131)=1),VLOOKUP(CR44,_Afg07,Halmnr)*C101,0)","v":0},null,null,null,null,null,null,null,null,null,null,null,true,null,false,null,false,null,false,null,{"$f":"IF(VLOOKUP($CR44,_Afg07,$BS$131)=1,IF($DK44,$C101/IF(_Plo2<>\"\",_Plo2,Plo),0),0)","v":0},{"$f":"IF(VLOOKUP($CR44,_Afg07,$BS$131)=2,IF($DK44,$C101/IF(_Plo2<>\"\",_Plo2,Plo),0),0)","v":0},{"$f":"IF(VLOOKUP($CR44,_Afg07,$BS$131)=3,IF($DK44,$C101/IF(_Plo2<>\"\",_Plo2,Plo),0),0)","v":0},{"$f":"IF(VLOOKUP($CR44,_Afg07,$BW$131)=1,IF($DM44,$C101/IF(_Stu2<>\"\",_Stu2,Stu),0),0)","v":0},{"$f":"IF(VLOOKUP($CR44,_Afg07,$BW$131)=2,IF($DM44,$C101/IF(_Stu2<>\"\",_Stu2,Stu),0),0)","v":0},{"$f":"IF(VLOOKUP($CR44,_Afg07,$BW$131)=3,IF($DM44,$C101/IF(_Stu2<>\"\",_Stu2,Stu),0),0)","v":0},{"$f":"IF(VLOOKUP($CR44,_Afg07,$BT$131)=1,IF($DO44,$C101/IF(Såb2<>\"\",Såb2,Såb),0),0)","v":0},{"$f":"IF(VLOOKUP($CR44,_Afg07,$BT$131)=2,IF($DO44,$C101/IF(Såb2<>\"\",Såb2,Såb),0),0)","v":0},{"$f":"IF(VLOOKUP($CR44,_Afg07,$BT$131)=3,IF($DO44,$C101/IF(Såb2<>\"\",Såb2,Såb),0),0)","v":0},{"$f":"IF(VLOOKUP($CR44,_Afg07,$BU$131)=1,IF($DQ44,$C101/IF(_Gly2<>\"\",_Gly2,Gly),0),0)","v":0},{"$f":"IF(VLOOKUP($CR44,_Afg07,$BU$131)=2,IF($DQ44,$C101/IF(_Gly2<>\"\",_Gly2,Gly),0),0)","v":0},{"$f":"IF(VLOOKUP($CR44,_Afg07,$BU$131)=3,IF($DQ44,$C101/IF(_Gly2<>\"\",_Gly2,Gly),0),0)","v":0},{"$f":"IF(VLOOKUP($CR44,_Afg07,$BV$131)=1,$C101/IF(Såm2<>\"\",Såm2,Såm),0)","v":0},{"$f":"IF(VLOOKUP($CR44,_Afg07,$BV$131)=2,$C101/IF(Såm2<>\"\",Såm2,Såm),0)","v":0},{"$f":"IF(VLOOKUP($CR44,_Afg07,$BV$131)=3,$C101/IF(Såm2<>\"\",Såm2,Såm),0)","v":0},{"$f":"IF(VLOOKUP($CR44,_Afg07,$BX$131)=1,$C101/IF(_Mej2<>\"\",_Mej2,Mej)*VLOOKUP($CR44,_Afg07,$BZ$131),0)","v":0},{"$f":"IF(VLOOKUP($CR44,_Afg07,$BX$131)=2,$C101/IF(_Mej2<>\"\",_Mej2,Mej)*VLOOKUP($CR44,_Afg07,$BZ$131),0)","v":0},{"$f":"IF(VLOOKUP($CR44,_Afg07,$BX$131)=3,$C101/IF(_Mej2<>\"\",_Mej2,Mej)*VLOOKUP($CR44,_Afg07,$BZ$131),0)","v":0},{"$f":"IF(HalmJa=1,IF(VLOOKUP($CR44,_Afg07,$BY$131)=1,$C101/IF(_Hal3<>\"\",_Hal3,Hal)+$C101/_Hal2,0),0)","v":0},{"$f":"IF(HalmJa=1,IF(VLOOKUP($CR44,_Afg07,$BY$131)=2,$C101/IF(_Hal3<>\"\",_Hal3,Hal)+$C101/_Hal2,0),0)","v":0},{"$f":"IF(VLOOKUP($CR44,_Afg07,$CA$131)=1,$C101/IF(_Enk2<>\"\",_Enk2,Enk),0)","v":0},{"$f":"IF(VLOOKUP($CR44,_Afg07,$CB$131)=1,$C101/IF(_Kar2<>\"\",_Kar2,Kar),0)","v":0},{"$f":"IF(VLOOKUP($CR44,_Afg07,$CC$131)=1,$C101/IF(Kopt2<>\"\",Kopt2,Kopt),0)","v":0},{"$f":"IF(VLOOKUP($CR44,_Afg07,$CD$131)=1,$C101/IF(Ropt2<>\"\",Ropt2,Ropt),0)","v":0},{"$f":"VLOOKUP($CR44,_Afg07,$CE$131)*$C101/IF(_Gly2<>\"\",_Gly2,Gly)","v":0},{"$f":"VLOOKUP($CR44,_Afg07,$CF$131)*$C101/IF(Gød2<>\"\",Gød2,Gød)","v":0}]
[null,null,null,null,null,null,null,null,null,null,null,null,null,null,null,null,null,null,null,null,null,null,null,null,null,null,null,null,null,null,null,null,null,null,null,null,null,null,null,null,null,null,null,null,null,null,null,null,null,null,null,null,null,null,null,null,null,null,null,null,null,null,null,null,null,null,null,null,null,null,null,null,null,null,null,null,null,null,null,null,null,null,null,null,null,null,null,null,null,null,null,null,null,null,null,1,null,{"$f":"IF(CR45>1,IF(VLOOKUP(CR45,_Afg07,$BR$131)=2,IF($CR$7=2,-VLOOKUP($O$169,_Afg07,$CS$7)*Erstatpris*C121,0),0),0)","v":0},{"$f":"IF(AND(CR45>1,VLOOKUP(CR45,_Afg07,$BR$131)=1),IF(E121<>\"\",E121,F121)*C121,0)","v":0},{"$f":"IF(AND(CR45>1,VLOOKUP(CR45,_Afg07,$BR$131)=1),C121,0)","v":0},null,null,{"$f":"IF(AND(CR45>1,VLOOKUP(CR45,_Afg07,$BR$131)=1),VLOOKUP(CR45,_Afg07,Halmnr)*C121,0)","v":0},null,null,null,null,null,null,null,null,null,null,null,true,null,false,null,false,null,false,null,{"$f":"IF(VLOOKUP($CR45,_Afg07,$BS$131)=1,IF($DK45,$C121/IF(_Plo2<>\"\",_Plo2,Plo),0),0)","v":0},{"$f":"IF(VLOOKUP($CR45,_Afg07,$BS$131)=2,IF($DK45,$C121/IF(_Plo2<>\"\",_Plo2,Plo),0),0)","v":0},{"$f":"IF(VLOOKUP($CR45,_Afg07,$BS$131)=3,IF($DK45,$C121/IF(_Plo2<>\"\",_Plo2,Plo),0),0)","v":0},{"$f":"IF(VLOOKUP($CR45,_Afg07,$BW$131)=1,IF($DM45,$C121/IF(_Stu2<>\"\",_Stu2,Stu),0),0)","v":0},{"$f":"IF(VLOOKUP($CR45,_Afg07,$BW$131)=2,IF($DM45,$C121/IF(_Stu2<>\"\",_Stu2,Stu),0),0)","v":0},{"$f":"IF(VLOOKUP($CR45,_Afg07,$BW$131)=3,IF($DM45,$C121/IF(_Stu2<>\"\",_Stu2,Stu),0),0)","v":0},{"$f":"IF(VLOOKUP($CR45,_Afg07,$BT$131)=1,IF($DO45,$C121/IF(Såb2<>\"\",Såb2,Såb),0),0)","v":0},{"$f":"IF(VLOOKUP($CR45,_Afg07,$BT$131)=2,IF($DO45,$C121/IF(Såb2<>\"\",Såb2,Såb),0),0)","v":0},{"$f":"IF(VLOOKUP($CR45,_Afg07,$BT$131)=3,IF($DO45,$C121/IF(Såb2<>\"\",Såb2,Såb),0),0)","v":0},{"$f":"IF(VLOOKUP($CR45,_Afg07,$BU$131)=1,IF($DQ45,$C121/IF(_Gly2<>\"\",_Gly2,Gly),0),0)","v":0},{"$f":"IF(VLOOKUP($CR45,_Afg07,$BU$131)=2,IF($DQ45,$C121/IF(_Gly2<>\"\",_Gly2,Gly),0),0)","v":0},{"$f":"IF(VLOOKUP($CR45,_Afg07,$BU$131)=3,IF($DQ45,$C121/IF(_Gly2<>\"\",_Gly2,Gly),0),0)","v":0},{"$f":"IF(VLOOKUP($CR45,_Afg07,$BV$131)=1,$C121/IF(Såm2<>\"\",Såm2,Såm),0)","v":0},{"$f":"IF(VLOOKUP($CR45,_Afg07,$BV$131)=2,$C121/IF(Såm2<>\"\",Såm2,Såm),0)","v":0},{"$f":"IF(VLOOKUP($CR45,_Afg07,$BV$131)=3,$C121/IF(Såm2<>\"\",Såm2,Såm),0)","v":0},{"$f":"IF(VLOOKUP($CR45,_Afg07,$BX$131)=1,$C121/IF(_Mej2<>\"\",_Mej2,Mej)*VLOOKUP($CR45,_Afg07,$BZ$131),0)","v":0},{"$f":"IF(VLOOKUP($CR45,_Afg07,$BX$131)=2,$C121/IF(_Mej2<>\"\",_Mej2,Mej)*VLOOKUP($CR45,_Afg07,$BZ$131),0)","v":0},{"$f":"IF(VLOOKUP($CR45,_Afg07,$BX$131)=3,$C121/IF(_Mej2<>\"\",_Mej2,Mej)*VLOOKUP($CR45,_Afg07,$BZ$131),0)","v":0},{"$f":"IF(HalmJa=1,IF(VLOOKUP($CR45,_Afg07,$BY$131)=1,$C121/IF(_Hal3<>\"\",_Hal3,Hal)+$C121/_Hal2,0),0)","v":0},{"$f":"IF(HalmJa=1,IF(VLOOKUP($CR45,_Afg07,$BY$131)=2,$C121/IF(_Hal3<>\"\",_Hal3,Hal)+$C121/_Hal2,0),0)","v":0},{"$f":"IF(VLOOKUP($CR45,_Afg07,$CA$131)=1,$C121/IF(_Enk2<>\"\",_Enk2,Enk),0)","v":0},{"$f":"IF(VLOOKUP($CR45,_Afg07,$CB$131)=1,$C121/IF(_Kar2<>\"\",_Kar2,Kar),0)","v":0},{"$f":"IF(VLOOKUP($CR45,_Afg07,$CC$131)=1,$C121/IF(Kopt2<>\"\",Kopt2,Kopt),0)","v":0},{"$f":"IF(VLOOKUP($CR45,_Afg07,$CD$131)=1,$C121/IF(Ropt2<>\"\",Ropt2,Ropt),0)","v":0},{"$f":"VLOOKUP($CR45,_Afg07,$CE$131)*$C121/IF(_Gly2<>\"\",_Gly2,Gly)","v":0},{"$f":"VLOOKUP($CR45,_Afg07,$CF$131)*$C121/IF(Gød2<>\"\",Gød2,Gød)","v":0}]
["Maskiner og arbejde",null,{"$f":"IF(Afgnr>1,IF(Q46<>\"\",Q46,-VLOOKUP(Afgnr,_Afg07,$CT$5)),\"\")-IF(Hdgnr>1,VLOOKUP(Afgnr,_Afg07,51,FALSE)*VLOOKUP(Afgnr,_Afg07,71,FALSE),0)","v":{"$error":"#VALUE!"}},{"$f":"IF(C46<>\"\",\"kr.\",\"\")","v":{"$error":"#VALUE!"}},null,null,{"$f":"IF(CS16>1,IF(S46<>\"\",S46,-VLOOKUP(CS16,_Afg07,$CT$5)),\"\")-IF(CS16>1,VLOOKUP(CS16,_Afg07,51,FALSE)*VLOOKUP(Afgnr,_Afg07,71,FALSE),0)","v":{"$error":"#VALUE!"}},{"$f":"IF(G46<>\"\",\"kr.\",\"\")","v":{"$error":"#VALUE!"}},null,null,{"$f":"IF(CT16>1,IF(U46<>\"\",U46,-VLOOKUP(CT16,_Afg07,$CT$5)),\"\")","v":""},{"$f":"IF(K46<>\"\",\"kr.\",\"\")","v":""},null,null,null,"Maskiner og arbejde",null,null,null,null,null,null,null,null,null,null,null,null,null,null,null,null,null,null,null,null,null,null,null,null,null,null,null,null,null,null,null,null,null,null,null,null,null,null,null,null,null,null,null,null,null,null,null,null,null,null,null,null,null,null,null,null,null,null,null,null,null,null,null,null,null,null,null,null,null,null,null,null,null,null,null,null,null,null,null,1,null,{"$f":"IF(CR46>1,IF(VLOOKUP(CR46,_Afg07,$BR$131)=2,IF($CR$7=2,-VLOOKUP($O$169,_Afg07,$CS$7)*Erstatpris*C103,0),0),0)","v":0},{"$f":"IF(AND(CR46>1,VLOOKUP(CR46,_Afg07,$BR$131)=1),IF(E103<>\"\",E103,F103)*C103,0)","v":0},{"$f":"IF(AND(CR46>1,VLOOKUP(CR46,_Afg07,$BR$131)=1),C103,0)","v":0},null,null,{"$f":"IF(AND(CR46>1,VLOOKUP(CR46,_Afg07,$BR$131)=1),VLOOKUP(CR46,_Afg07,Halmnr)*C103,0)","v":0},null,null,null,null,"Lager til korn",null,null,null,null,null,null,true,null,false,null,false,null,false,null,{"$f":"IF(VLOOKUP($CR46,_Afg07,$BS$131)=1,IF($DK46,$C103/IF(_Plo2<>\"\",_Plo2,Plo),0),0)","v":0},{"$f":"IF(VLOOKUP($CR46,_Afg07,$BS$131)=2,IF($DK46,$C103/IF(_Plo2<>\"\",_Plo2,Plo),0),0)","v":0},{"$f":"IF(VLOOKUP($CR46,_Afg07,$BS$131)=3,IF($DK46,$C103/IF(_Plo2<>\"\",_Plo2,Plo),0),0)","v":0},{"$f":"IF(VLOOKUP($CR46,_Afg07,$BW$131)=1,IF($DM46,$C103/IF(_Stu2<>\"\",_Stu2,Stu),0),0)","v":0},{"$f":"IF(VLOOKUP($CR46,_Afg07,$BW$131)=2,IF($DM46,$C103/IF(_Stu2<>\"\",_Stu2,Stu),0),0)","v":0},{"$f":"IF(VLOOKUP($CR46,_Afg07,$BW$131)=3,IF($DM46,$C103/IF(_Stu2<>\"\",_Stu2,Stu),0),0)","v":0},{"$f":"IF(VLOOKUP($CR46,_Afg07,$BT$131)=1,IF($DO46,$C103/IF(Såb2<>\"\",Såb2,Såb),0),0)","v":0},{"$f":"IF(VLOOKUP($CR46,_Afg07,$BT$131)=2,IF($DO46,$C103/IF(Såb2<>\"\",Såb2,Såb),0),0)","v":0},{"$f":"IF(VLOOKUP($CR46,_Afg07,$BT$131)=3,IF($DO46,$C103/IF(Såb2<>\"\",Såb2,Såb),0),0)","v":0},{"$f":"IF(VLOOKUP($CR46,_Afg07,$BU$131)=1,IF($DQ46,$C103/IF(_Gly2<>\"\",_Gly2,Gly),0),0)","v":0},{"$f":"IF(VLOOKUP($CR46,_Afg07,$BU$131)=2,IF($DQ46,$C103/IF(_Gly2<>\"\",_Gly2,Gly),0),0)","v":0},{"$f":"IF(VLOOKUP($CR46,_Afg07,$BU$131)=3,IF($DQ46,$C103/IF(_Gly2<>\"\",_Gly2,Gly),0),0)","v":0},{"$f":"IF(VLOOKUP($CR46,_Afg07,$BV$131)=1,$C103/IF(Såm2<>\"\",Såm2,Såm),0)","v":0},{"$f":"IF(VLOOKUP($CR46,_Afg07,$BV$131)=2,$C103/IF(Såm2<>\"\",Såm2,Såm),0)","v":0},{"$f":"IF(VLOOKUP($CR46,_Afg07,$BV$131)=3,$C103/IF(Såm2<>\"\",Såm2,Såm),0)","v":0},{"$f":"IF(VLOOKUP($CR46,_Afg07,$BX$131)=1,$C103/IF(_Mej2<>\"\",_Mej2,Mej)*VLOOKUP($CR46,_Afg07,$BZ$131),0)","v":0},{"$f":"IF(VLOOKUP($CR46,_Afg07,$BX$131)=2,$C103/IF(_Mej2<>\"\",_Mej2,Mej)*VLOOKUP($CR46,_Afg07,$BZ$131),0)","v":0},{"$f":"IF(VLOOKUP($CR46,_Afg07,$BX$131)=3,$C103/IF(_Mej2<>\"\",_Mej2,Mej)*VLOOKUP($CR46,_Afg07,$BZ$131),0)","v":0},{"$f":"IF(HalmJa=1,IF(VLOOKUP($CR46,_Afg07,$BY$131)=1,$C103/IF(_Hal3<>\"\",_Hal3,Hal)+$C103/_Hal2,0),0)","v":0},{"$f":"IF(HalmJa=1,IF(VLOOKUP($CR46,_Afg07,$BY$131)=2,$C103/IF(_Hal3<>\"\",_Hal3,Hal)+$C103/_Hal2,0),0)","v":0},{"$f":"IF(VLOOKUP($CR46,_Afg07,$CA$131)=1,$C103/IF(_Enk2<>\"\",_Enk2,Enk),0)","v":0},{"$f":"IF(VLOOKUP($CR46,_Afg07,$CB$131)=1,$C103/IF(_Kar2<>\"\",_Kar2,Kar),0)","v":0},{"$f":"IF(VLOOKUP($CR46,_Afg07,$CC$131)=1,$C103/IF(Kopt2<>\"\",Kopt2,Kopt),0)","v":0},{"$f":"IF(VLOOKUP($CR46,_Afg07,$CD$131)=1,$C103/IF(Ropt2<>\"\",Ropt2,Ropt),0)","v":0},{"$f":"VLOOKUP($CR46,_Afg07,$CE$131)*$C103/IF(_Gly2<>\"\",_Gly2,Gly)","v":0},{"$f":"VLOOKUP($CR46,_Afg07,$CF$131)*$C103/IF(Gød2<>\"\",Gød2,Gød)","v":0}]
[{"$f":"IF(Tørringnr=1,\"Tørring (løntørring)\",\"Tørring (korn i eget tørreri)\")","v":"Tørring (korn i eget tørreri)"},null,{"$f":"IF(Afgnr>1,IF(Q47<>\"\",Q47,IF(VLOOKUP(Afgnr,_Afg07,$BR$131)=2,-VLOOKUP(Afgnr,_Afg07,$BK$131)*C$29,IF(AND(VLOOKUP(Afgnr,_Afg07,$BR$131)=1,$CU$3=4),0,IF($CU$5=1,-VLOOKUP(Afgnr,_Afg07,$BK$131)*C$29,-VLOOKUP(Afgnr,_Afg07,$BL$131)*C$29)))),\"\")","v":""},{"$f":"IF(C47<>\"\",\"kr.\",\"\")","v":""},null,null,{"$f":"IF(Alt1nr>1,IF(S47<>\"\",S47,IF(VLOOKUP(Alt1nr,_Afg07,$BR$131)=2,-VLOOKUP(Alt1nr,_Afg07,$BK$131)*G29,IF(AND(VLOOKUP(Alt1nr,_Afg07,$BR$131)=1,$CU$3=4),0,IF($CU$5=1,-VLOOKUP(Alt1nr,_Afg07,$BK$131)*G29,-VLOOKUP(Alt1nr,_Afg07,$BL$131)*G29)))),\"\")","v":""},{"$f":"IF(G47<>\"\",\"kr.\",\"\")","v":""},null,null,{"$f":"IF(Alt2nr>1,IF(U47<>\"\",U47,IF(VLOOKUP(Alt2nr,_Afg07,$BR$131)=2,-VLOOKUP(Alt2nr,_Afg07,$BK$131)*K29,IF(AND(VLOOKUP(Alt2nr,_Afg07,$BR$131)=1,$CU$3=4),0,IF($CU$5=1,-VLOOKUP(Alt2nr,_Afg07,$BK$131)*K29,-VLOOKUP(Alt2nr,_Afg07,$BL$131)*K29)))),\"\")","v":""},{"$f":"IF(K47<>\"\",\"kr.\",\"\")","v":""},null,null,null,{"$f":"A47","v":"Tørring (korn i eget tørreri)"},null,null,null,null,null,null,null,null,null,null,null,null,null,null,null,null,null,null,null,null,null,null,null,null,null,null,null,null,null,null,null,null,null,null,null,null,null,null,null,null,null,null,null,null,null,null,null,null,null,null,null,null,null,null,null,null,null,null,null,null,null,null,null,null,null,null,null,null,null,null,null,null,null,null,null,null,null,null,null,1,null,{"$f":"IF(CR47>1,IF(VLOOKUP(CR47,_Afg07,$BR$131)=2,IF($CR$7=2,-VLOOKUP($O$169,_Afg07,$CS$7)*Erstatpris*C123,0),0),0)","v":0},{"$f":"IF(AND(CR47>1,VLOOKUP(CR47,_Afg07,$BR$131)=1),IF(E123<>\"\",E123,F123)*C123,0)","v":0},{"$f":"IF(AND(CR47>1,VLOOKUP(CR47,_Afg07,$BR$131)=1),C123,0)","v":0},null,null,{"$f":"IF(AND(CR47>1,VLOOKUP(CR47,_Afg07,$BR$131)=1),VLOOKUP(CR47,_Afg07,Halmnr)*C123,0)","v":0},null,null,null,1,null,null,null,null,null,null,null,true,null,false,null,false,null,false,null,{"$f":"IF(VLOOKUP($CR47,_Afg07,$BS$131)=1,IF($DK47,$C123/IF(_Plo2<>\"\",_Plo2,Plo),0),0)","v":0},{"$f":"IF(VLOOKUP($CR47,_Afg07,$BS$131)=2,IF($DK47,$C123/IF(_Plo2<>\"\",_Plo2,Plo),0),0)","v":0},{"$f":"IF(VLOOKUP($CR47,_Afg07,$BS$131)=3,IF($DK47,$C123/IF(_Plo2<>\"\",_Plo2,Plo),0),0)","v":0},{"$f":"IF(VLOOKUP($CR47,_Afg07,$BW$131)=1,IF($DM47,$C123/IF(_Stu2<>\"\",_Stu2,Stu),0),0)","v":0},{"$f":"IF(VLOOKUP($CR47,_Afg07,$BW$131)=2,IF($DM47,$C123/IF(_Stu2<>\"\",_Stu2,Stu),0),0)","v":0},{"$f":"IF(VLOOKUP($CR47,_Afg07,$BW$131)=3,IF($DM47,$C123/IF(_Stu2<>\"\",_Stu2,Stu),0),0)","v":0},{"$f":"IF(VLOOKUP($CR47,_Afg07,$BT$131)=1,IF($DO47,$C123/IF(Såb2<>\"\",Såb2,Såb),0),0)","v":0},{"$f":"IF(VLOOKUP($CR47,_Afg07,$BT$131)=2,IF($DO47,$C123/IF(Såb2<>\"\",Såb2,Såb),0),0)","v":0},{"$f":"IF(VLOOKUP($CR47,_Afg07,$BT$131)=3,IF($DO47,$C123/IF(Såb2<>\"\",Såb2,Såb),0),0)","v":0},{"$f":"IF(VLOOKUP($CR47,_Afg07,$BU$131)=1,IF($DQ47,$C123/IF(_Gly2<>\"\",_Gly2,Gly),0),0)","v":0},{"$f":"IF(VLOOKUP($CR47,_Afg07,$BU$131)=2,IF($DQ47,$C123/IF(_Gly2<>\"\",_Gly2,Gly),0),0)","v":0},{"$f":"IF(VLOOKUP($CR47,_Afg07,$BU$131)=3,IF($DQ47,$C123/IF(_Gly2<>\"\",_Gly2,Gly),0),0)","v":0},{"$f":"IF(VLOOKUP($CR47,_Afg07,$BV$131)=1,$C123/IF(Såm2<>\"\",Såm2,Såm),0)","v":0},{"$f":"IF(VLOOKUP($CR47,_Afg07,$BV$131)=2,$C123/IF(Såm2<>\"\",Såm2,Såm),0)","v":0},{"$f":"IF(VLOOKUP($CR47,_Afg07,$BV$131)=3,$C123/IF(Såm2<>\"\",Såm2,Såm),0)","v":0},{"$f":"IF(VLOOKUP($CR47,_Afg07,$BX$131)=1,$C123/IF(_Mej2<>\"\",_Mej2,Mej)*VLOOKUP($CR47,_Afg07,$BZ$131),0)","v":0},{"$f":"IF(VLOOKUP($CR47,_Afg07,$BX$131)=2,$C123/IF(_Mej2<>\"\",_Mej2,Mej)*VLOOKUP($CR47,_Afg07,$BZ$131),0)","v":0},{"$f":"IF(VLOOKUP($CR47,_Afg07,$BX$131)=3,$C123/IF(_Mej2<>\"\",_Mej2,Mej)*VLOOKUP($CR47,_Afg07,$BZ$131),0)","v":0},{"$f":"IF(HalmJa=1,IF(VLOOKUP($CR47,_Afg07,$BY$131)=1,$C123/IF(_Hal3<>\"\",_Hal3,Hal)+$C123/_Hal2,0),0)","v":0},{"$f":"IF(HalmJa=1,IF(VLOOKUP($CR47,_Afg07,$BY$131)=2,$C123/IF(_Hal3<>\"\",_Hal3,Hal)+$C123/_Hal2,0),0)","v":0},{"$f":"IF(VLOOKUP($CR47,_Afg07,$CA$131)=1,$C123/IF(_Enk2<>\"\",_Enk2,Enk),0)","v":0},{"$f":"IF(VLOOKUP($CR47,_Afg07,$CB$131)=1,$C123/IF(_Kar2<>\"\",_Kar2,Kar),0)","v":0},{"$f":"IF(VLOOKUP($CR47,_Afg07,$CC$131)=1,$C123/IF(Kopt2<>\"\",Kopt2,Kopt),0)","v":0},{"$f":"IF(VLOOKUP($CR47,_Afg07,$CD$131)=1,$C123/IF(Ropt2<>\"\",Ropt2,Ropt),0)","v":0},{"$f":"VLOOKUP($CR47,_Afg07,$CE$131)*$C123/IF(_Gly2<>\"\",_Gly2,Gly)","v":0},{"$f":"VLOOKUP($CR47,_Afg07,$CF$131)*$C123/IF(Gød2<>\"\",Gød2,Gød)","v":0}]
[{"$f":"IF(Købernr=2,\"Erstatningskorn\",\"\")","v":""},null,{"$f":"IF(CR16>1,IF($CR$7=2,IF(VLOOKUP(CR16,_Afg07,BR131)=2,(-VLOOKUP($O$169,_Afg07,$CS$7)*Erstatpris),IF(VLOOKUP(CR16,_Afg07,BR131)=3,$CT$50,IF(VLOOKUP(CR16,_Afg07,BR131)=4,$CT$51,\"\"))),\"\"),\"\")","v":""},{"$f":"IF(C48<>\"\",\"kr.\",\"\")","v":""},null,null,{"$f":"IF(CS16>1,IF($CR$7=2,IF(VLOOKUP(CS16,_Afg07,BR131)=2,(-VLOOKUP($O$169,_Afg07,$CS$7)*Erstatpris),IF(VLOOKUP(CS16,_Afg07,BR131)=3,$CT$50,IF(VLOOKUP(CS16,_Afg07,BR131)=4,$CT$51,\"\"))),\"\"),\"\")","v":""},{"$f":"IF(G48<>\"\",\"kr.\",\"\")","v":""},null,null,{"$f":"IF(CT16>1,IF($CR$7=2,IF(VLOOKUP(CT16,_Afg07,BR131)=2,(-VLOOKUP($O$169,_Afg07,$CS$7)*Erstatpris),IF(VLOOKUP(CT16,_Afg07,BR131)=3,$CT$50,IF(VLOOKUP(CT16,_Afg07,BR131)=4,$CT$51,\"\"))),\"\"),\"\")","v":""},{"$f":"IF(K48<>\"\",\"kr.\",\"\")","v":""},null,null,null,null,{"$f":"IF(OR(Q46>0,Q47>0),\"Husk minus foran\",\"\")","v":""},null,{"$f":"IF(OR(S46>0,S47>0),\"Husk minus foran\",\"\")","v":""},null,{"$f":"IF(OR(U46>0,U47>0),\"Husk minus foran\",\"\")","v":""},null,null,null,null,null,null,null,null,null,null,null,null,null,null,null,null,null,null,null,null,null,null,null,null,null,null,null,null,null,null,null,null,null,null,null,null,null,null,null,null,null,null,null,null,null,null,null,null,null,null,null,null,null,null,null,null,null,null,null,null,null,null,null,null,null,null,null,null,null,null,null,null,null,null,1,null,{"$f":"IF(CR48>1,IF(VLOOKUP(CR48,_Afg07,$BR$131)=2,IF($CR$7=2,-VLOOKUP($O$169,_Afg07,$CS$7)*Erstatpris*C105,0),0),0)","v":0},{"$f":"IF(AND(CR48>1,VLOOKUP(CR48,_Afg07,$BR$131)=1),IF(E105<>\"\",E105,F105)*C105,0)","v":0},{"$f":"IF(AND(CR48>1,VLOOKUP(CR48,_Afg07,$BR$131)=1),C105,0)","v":0},null,null,{"$f":"IF(AND(CR48>1,VLOOKUP(CR48,_Afg07,$BR$131)=1),VLOOKUP(CR48,_Afg07,Halmnr)*C105,0)","v":0},null,null,null,2,"Planlager",null,null,null,null,null,null,true,null,false,null,false,null,false,null,{"$f":"IF(VLOOKUP($CR48,_Afg07,$BS$131)=1,IF($DK48,$C105/IF(_Plo2<>\"\",_Plo2,Plo),0),0)","v":0},{"$f":"IF(VLOOKUP($CR48,_Afg07,$BS$131)=2,IF($DK48,$C105/IF(_Plo2<>\"\",_Plo2,Plo),0),0)","v":0},{"$f":"IF(VLOOKUP($CR48,_Afg07,$BS$131)=3,IF($DK48,$C105/IF(_Plo2<>\"\",_Plo2,Plo),0),0)","v":0},{"$f":"IF(VLOOKUP($CR48,_Afg07,$BW$131)=1,IF($DM48,$C105/IF(_Stu2<>\"\",_Stu2,Stu),0),0)","v":0},{"$f":"IF(VLOOKUP($CR48,_Afg07,$BW$131)=2,IF($DM48,$C105/IF(_Stu2<>\"\",_Stu2,Stu),0),0)","v":0},{"$f":"IF(VLOOKUP($CR48,_Afg07,$BW$131)=3,IF($DM48,$C105/IF(_Stu2<>\"\",_Stu2,Stu),0),0)","v":0},{"$f":"IF(VLOOKUP($CR48,_Afg07,$BT$131)=1,IF($DO48,$C105/IF(Såb2<>\"\",Såb2,Såb),0),0)","v":0},{"$f":"IF(VLOOKUP($CR48,_Afg07,$BT$131)=2,IF($DO48,$C105/IF(Såb2<>\"\",Såb2,Såb),0),0)","v":0},{"$f":"IF(VLOOKUP($CR48,_Afg07,$BT$131)=3,IF($DO48,$C105/IF(Såb2<>\"\",Såb2,Såb),0),0)","v":0},{"$f":"IF(VLOOKUP($CR48,_Afg07,$BU$131)=1,IF($DQ48,$C105/IF(_Gly2<>\"\",_Gly2,Gly),0),0)","v":0},{"$f":"IF(VLOOKUP($CR48,_Afg07,$BU$131)=2,IF($DQ48,$C105/IF(_Gly2<>\"\",_Gly2,Gly),0),0)","v":0},{"$f":"IF(VLOOKUP($CR48,_Afg07,$BU$131)=3,IF($DQ48,$C105/IF(_Gly2<>\"\",_Gly2,Gly),0),0)","v":0},{"$f":"IF(VLOOKUP($CR48,_Afg07,$BV$131)=1,$C105/IF(Såm2<>\"\",Såm2,Såm),0)","v":0},{"$f":"IF(VLOOKUP($CR48,_Afg07,$BV$131)=2,$C105/IF(Såm2<>\"\",Såm2,Såm),0)","v":0},{"$f":"IF(VLOOKUP($CR48,_Afg07,$BV$131)=3,$C105/IF(Såm2<>\"\",Såm2,Såm),0)","v":0},{"$f":"IF(VLOOKUP($CR48,_Afg07,$BX$131)=1,$C105/IF(_Mej2<>\"\",_Mej2,Mej)*VLOOKUP($CR48,_Afg07,$BZ$131),0)","v":0},{"$f":"IF(VLOOKUP($CR48,_Afg07,$BX$131)=2,$C105/IF(_Mej2<>\"\",_Mej2,Mej)*VLOOKUP($CR48,_Afg07,$BZ$131),0)","v":0},{"$f":"IF(VLOOKUP($CR48,_Afg07,$BX$131)=3,$C105/IF(_Mej2<>\"\",_Mej2,Mej)*VLOOKUP($CR48,_Afg07,$BZ$131),0)","v":0},{"$f":"IF(HalmJa=1,IF(VLOOKUP($CR48,_Afg07,$BY$131)=1,$C105/IF(_Hal3<>\"\",_Hal3,Hal)+$C105/_Hal2,0),0)","v":0},{"$f":"IF(HalmJa=1,IF(VLOOKUP($CR48,_Afg07,$BY$131)=2,$C105/IF(_Hal3<>\"\",_Hal3,Hal)+$C105/_Hal2,0),0)","v":0},{"$f":"IF(VLOOKUP($CR48,_Afg07,$CA$131)=1,$C105/IF(_Enk2<>\"\",_Enk2,Enk),0)","v":0},{"$f":"IF(VLOOKUP($CR48,_Afg07,$CB$131)=1,$C105/IF(_Kar2<>\"\",_Kar2,Kar),0)","v":0},{"$f":"IF(VLOOKUP($CR48,_Afg07,$CC$131)=1,$C105/IF(Kopt2<>\"\",Kopt2,Kopt),0)","v":0},{"$f":"IF(VLOOKUP($CR48,_Afg07,$CD$131)=1,$C105/IF(Ropt2<>\"\",Ropt2,Ropt),0)","v":0},{"$f":"VLOOKUP($CR48,_Afg07,$CE$131)*$C105/IF(_Gly2<>\"\",_Gly2,Gly)","v":0},{"$f":"VLOOKUP($CR48,_Afg07,$CF$131)*$C105/IF(Gød2<>\"\",Gød2,Gød)","v":0}]
[null,null,null,null,null,null,null,null,null,null,null,null,null,null,null,null,null,null,null,null,null,null,null,null,null,null,null,null,null,null,null,null,null,null,null,null,null,null,null,null,null,null,null,null,null,null,null,null,null,null,null,null,null,null,null,null,null,null,null,null,null,null,null,null,null,null,null,null,null,null,null,null,null,null,null,null,null,null,null,null,null,null,null,null,null,null,null,null,null,null,null,null,null,null,null,1,null,{"$f":"IF(CR49>1,IF(VLOOKUP(CR49,_Afg07,$BR$131)=2,IF($CR$7=2,-VLOOKUP($O$169,_Afg07,$CS$7)*Erstatpris*C125,0),0),0)","v":0},{"$f":"IF(AND(CR49>1,VLOOKUP(CR49,_Afg07,$BR$131)=1),IF(E125<>\"\",E125,F125)*C125,0)","v":0},{"$f":"IF(AND(CR49>1,VLOOKUP(CR49,_Afg07,$BR$131)=1),C125,0)","v":0},"Kornudbytte i gns pr. ha af alle ha i sædskiftet","Udbytte foderkorn i gns pr. ha med foderkorn",{"$f":"IF(AND(CR49>1,VLOOKUP(CR49,_Afg07,$BR$131)=1),VLOOKUP(CR49,_Afg07,Halmnr)*C125,0)","v":0},null,null,null,3,"Stålsilo",null,null,null,null,null,null,true,null,false,null,false,null,false,null,{"$f":"IF(VLOOKUP($CR49,_Afg07,$BS$131)=1,IF($DK49,$C125/IF(_Plo2<>\"\",_Plo2,Plo),0),0)","v":0},{"$f":"IF(VLOOKUP($CR49,_Afg07,$BS$131)=2,IF($DK49,$C125/IF(_Plo2<>\"\",_Plo2,Plo),0),0)","v":0},{"$f":"IF(VLOOKUP($CR49,_Afg07,$BS$131)=3,IF($DK49,$C125/IF(_Plo2<>\"\",_Plo2,Plo),0),0)","v":0},{"$f":"IF(VLOOKUP($CR49,_Afg07,$BW$131)=1,IF($DM49,$C125/IF(_Stu2<>\"\",_Stu2,Stu),0),0)","v":0},{"$f":"IF(VLOOKUP($CR49,_Afg07,$BW$131)=2,IF($DM49,$C125/IF(_Stu2<>\"\",_Stu2,Stu),0),0)","v":0},{"$f":"IF(VLOOKUP($CR49,_Afg07,$BW$131)=3,IF($DM49,$C125/IF(_Stu2<>\"\",_Stu2,Stu),0),0)","v":0},{"$f":"IF(VLOOKUP($CR49,_Afg07,$BT$131)=1,IF($DO49,$C125/IF(Såb2<>\"\",Såb2,Såb),0),0)","v":0},{"$f":"IF(VLOOKUP($CR49,_Afg07,$BT$131)=2,IF($DO49,$C125/IF(Såb2<>\"\",Såb2,Såb),0),0)","v":0},{"$f":"IF(VLOOKUP($CR49,_Afg07,$BT$131)=3,IF($DO49,$C125/IF(Såb2<>\"\",Såb2,Såb),0),0)","v":0},{"$f":"IF(VLOOKUP($CR49,_Afg07,$BU$131)=1,IF($DQ49,$C125/IF(_Gly2<>\"\",_Gly2,Gly),0),0)","v":0},{"$f":"IF(VLOOKUP($CR49,_Afg07,$BU$131)=2,IF($DQ49,$C125/IF(_Gly2<>\"\",_Gly2,Gly),0),0)","v":0},{"$f":"IF(VLOOKUP($CR49,_Afg07,$BU$131)=3,IF($DQ49,$C125/IF(_Gly2<>\"\",_Gly2,Gly),0),0)","v":0},{"$f":"IF(VLOOKUP($CR49,_Afg07,$BV$131)=1,$C125/IF(Såm2<>\"\",Såm2,Såm),0)","v":0},{"$f":"IF(VLOOKUP($CR49,_Afg07,$BV$131)=2,$C125/IF(Såm2<>\"\",Såm2,Såm),0)","v":0},{"$f":"IF(VLOOKUP($CR49,_Afg07,$BV$131)=3,$C125/IF(Såm2<>\"\",Såm2,Såm),0)","v":0},{"$f":"IF(VLOOKUP($CR49,_Afg07,$BX$131)=1,$C125/IF(_Mej2<>\"\",_Mej2,Mej)*VLOOKUP($CR49,_Afg07,$BZ$131),0)","v":0},{"$f":"IF(VLOOKUP($CR49,_Afg07,$BX$131)=2,$C125/IF(_Mej2<>\"\",_Mej2,Mej)*VLOOKUP($CR49,_Afg07,$BZ$131),0)","v":0},{"$f":"IF(VLOOKUP($CR49,_Afg07,$BX$131)=3,$C125/IF(_Mej2<>\"\",_Mej2,Mej)*VLOOKUP($CR49,_Afg07,$BZ$131),0)","v":0},{"$f":"IF(HalmJa=1,IF(VLOOKUP($CR49,_Afg07,$BY$131)=1,$C125/IF(_Hal3<>\"\",_Hal3,Hal)+$C125/_Hal2,0),0)","v":0},{"$f":"IF(HalmJa=1,IF(VLOOKUP($CR49,_Afg07,$BY$131)=2,$C125/IF(_Hal3<>\"\",_Hal3,Hal)+$C125/_Hal2,0),0)","v":0},{"$f":"IF(VLOOKUP($CR49,_Afg07,$CA$131)=1,$C125/IF(_Enk2<>\"\",_Enk2,Enk),0)","v":0},{"$f":"IF(VLOOKUP($CR49,_Afg07,$CB$131)=1,$C125/IF(_Kar2<>\"\",_Kar2,Kar),0)","v":0},{"$f":"IF(VLOOKUP($CR49,_Afg07,$CC$131)=1,$C125/IF(Kopt2<>\"\",Kopt2,Kopt),0)","v":0},{"$f":"IF(VLOOKUP($CR49,_Afg07,$CD$131)=1,$C125/IF(Ropt2<>\"\",Ropt2,Ropt),0)","v":0},{"$f":"VLOOKUP($CR49,_Afg07,$CE$131)*$C125/IF(_Gly2<>\"\",_Gly2,Gly)","v":0},{"$f":"VLOOKUP($CR49,_Afg07,$CF$131)*$C125/IF(Gød2<>\"\",Gød2,Gød)","v":0}]
["Resultat",null,{"$f":"IF(Afgnr>1,IF(C48=\"\",C44+C46+C47,C44+C46+C47+C48),\"\")","v":""},{"$f":"IF(C50<>\"\",\"kr.\",\"\")","v":""},null,null,{"$f":"IF(Alt1nr>1,IF(G48=\"\",G44+G46+G47,G44+G46+G47+G48),\"\")","v":""},{"$f":"IF(G50<>\"\",\"kr.\",\"\")","v":""},null,null,{"$f":"IF(Alt2nr>1,IF(K48=\"\",K44+K46+K47,K44+K46+K47+K48),\"\")","v":""},{"$f":"IF(K50<>\"\",\"kr.\",\"\")","v":""},null,null,null,null,null,null,null,null,null,null,null,null,null,null,null,null,null,null,null,null,null,null,null,null,null,null,null,null,null,null,null,null,null,null,null,null,null,null,null,null,null,null,null,null,null,null,null,null,null,null,null,null,null,null,null,null,null,null,null,null,null,null,null,null,null,null,null,null,null,null,null,null,null,null,null,null,null,null,null,null,null,null,null,null,"Erstatkorn 1, gns.",{"$f":"(CT36+CT38+CT40+CT42+CT44+CT46+CT48)/C107","v":{"$error":"#DIV/0!"}},{"$f":"CU36+CU38+CU40+CU42+CU44+CU46+CU48","v":0},{"$f":"CV36+CV38+CV40+CV42+CV44+CV46+CV48","v":0},{"$f":"CU50/C107","v":{"$error":"#DIV/0!"}},{"$f":"CU50/CV50","v":{"$error":"#DIV/0!"}},{"$f":"CY36+CY38+CY40+CY42+CY44+CY46+CY48","v":0},null,null,null,4,"Gastæt silo",null,null,null,null,null,null,null,null,null,null,null,null,null,"Sædskifte 1",{"$f":"DS36+DS38+DS40+DS42+DS44+DS46+DS48","v":0},{"$f":"DT36+DT38+DT40+DT42+DT44+DT46+DT48","v":0},0,0,0,0,0,0,0,0,0,0,0,0,0,0,0,0,0,0,{"$f":"EM36+EM38+EM40+EM42+EM44+EM46+EM48","v":0},0,0,0,0,0,{"$f":"C107*DE_ha*ton_DE/IF(_Gyl2<>\"\",_Gyl2,Gyl)","v":0}]
[null,null,null,null,null,null,null,null,null,null,null,null,null,null,null,null,null,null,null,null,null,null,null,null,null,null,null,null,null,null,null,null,null,null,null,null,null,null,null,null,null,null,null,null,null,null,null,null,null,null,null,null,null,null,null,null,null,null,null,null,null,null,null,null,null,null,null,null,null,null,null,null,null,null,null,null,null,null,null,null,null,null,null,null,null,null,null,null,null,null,null,null,null,null,null,null,"Erstatkorn 2, gns.",{"$f":"(CT37+CT39+CT41+CT43+CT45+CT47+CT49)/C127","v":{"$error":"#DIV/0!"}},{"$f":"CU37+CU39+CU41+CU43+CU45+CU47+CU49","v":0},{"$f":"CV37+CV39+CV41+CV43+CV45+CV47+CV49","v":0},{"$f":"CU51/C127","v":{"$error":"#DIV/0!"}},{"$f":"CU51/CV51","v":{"$error":"#DIV/0!"}},{"$f":"CY37+CY39+CY41+CY43+CY45+CY47+CY49","v":0},null,null,null,null,null,null,null,null,null,null,null,null,null,null,null,null,null,null,"Sædskifte 2",{"$f":"DS37+DS39+DS41+DS43+DS45+DS47+DS49","v":0},{"$f":"DT37+DT39+DT41+DT43+DT45+DT47+DT49","v":0},0,0,0,0,0,0,0,0,0,0,0,0,0,0,0,0,0,0,0,0,0,0,0,0,{"$f":"C127*DE_ha*ton_DE/IF(_Gyl2<>\"\",_Gyl2,Gyl)","v":0}]
[null,null,null,null,null,null,null,null,null,null,null,null,null,null,null,null,null,null,null,null,null,null,null,null,null,null,null,null,null,null,null,null,null,null,null,null,null,null,null,null,null,null,null,null,null,null,null,null,null,null,null,null,null,null,null,null,null,null,null,null,null,null,null,null,null,null,null,null,null,null,null,null,null,null,null,null,null,null,null,null,null,null,null,null,null,null,null,null,null,null,null,null,null,null,null,null,null,null,null,null,null,null,null,null,null,null,null,"Tørring korn"]
["Ligevægtspris",null,null,null,null,null,{"$f":"IF(ISERROR(IF(AND(CS16>1,CS16<O185,CR16>1),(($C$50-G50)/G29)+G30,\"\")),\"\",IF(AND(CS16>1,CS16<O185,CR16>1),(($C$50-G50)/G29)+G30,\"\"))","v":""},{"$f":"IF(G53<>\"\",\"kr.\",\"\")","v":""},null,null,{"$f":"IF(ISERROR(IF(AND(CT16>1,CT16<O185,CR16>1),(($C$50-K50)/K29)+K30,\"\")),\"\",IF(AND(CT16>1,CT16<O185,CR16>1),(($C$50-K50)/K29)+K30,\"\"))","v":""},{"$f":"IF(K53<>\"\",\"kr.\",\"\")","v":""},null,null,null,null,null,null,null,null,null,null,null,null,null,null,null,null,null,null,null,null,null,null,null,null,null,null,null,null,null,null,null,null,null,null,null,null,null,null,null,null,null,null,null,null,null,null,null,null,null,null,null,null,null,null,null,null,null,null,null,null,null,null,null,null,null,null,null,null,null,null,null,null,null,null,null,null,null,null,null,null,null,null,null,null,null,null,null,null,null,null,null,null,null,null,1,"Løntørring",null,null,null,null,null,null,null,null,null,null,null,null,null,null,"Forår","August","Sept","Juli","August","Oktober","Forår","August","Sept","Forår","August","Sept","Forår","August","Sept","Juli","August","Oktober","Juli","August","Forår","Forår","Sept.","Oktober","Hele året","Hele året","Hele året"]
["Ligevægtsudbytte",null,null,null,null,null,{"$f":"IF(ISERROR(IF(AND(CS16>1,CS16<O185,CR16>1),(($C$50-G50)/G30)+G29,\"\")),\"\",IF(AND(CS16>1,CS16<O185,CR16>1),(($C$50-G50)/G30)+G29,\"\"))","v":""},{"$f":"IF(G54<>\"\",VLOOKUP(CS16,_Afg07,3),\"\")","v":""},null,null,{"$f":"IF(ISERROR(IF(AND(CT16>1,CT16<O185,CR16>1),(($C$50-K50)/K30)+K29,\"\")),\"\",IF(AND(CT16>1,CT16<O185,CR16>1),(($C$50-K50)/K30)+K29,\"\"))","v":""},{"$f":"IF(K54<>\"\",VLOOKUP(CT16,_Afg07,3),\"\")","v":""},null,null,null,null,null,null,null,null,null,null,null,null,null,null,null,null,null,null,null,null,null,null,null,null,null,null,null,null,null,null,null,null,null,null,null,null,null,null,null,null,null,null,null,null,null,null,null,null,null,null,null,null,null,null,null,null,null,null,null,null,null,null,null,null,null,null,null,null,null,null,null,null,null,null,null,null,null,null,null,null,null,null,null,null,null,null,null,null,null,null,null,null,null,null,2,"Eget tørreri"]
[null,null,null,null,null,null,null,null,null,null,null,null,null,null,null,null,null,null,null,null,null,null,null,null,null,null,null,null,null,null,null,null,null,null,null,null,null,null,null,null,null,null,null,null,null,null,null,null,null,null,null,null,null,null,null,null,null,null,null,null,null,null,null,null,null,null,null,null,null,null,null,null,null,null,null,null,null,null,null,null,null,null,null,null,null,null,null,null,null,null,null,null,null,null,null,null,"Jordtyper"]
[null,null,null,null,null,null,null,null,null,null,null,null,null,null,null,null,null,null,null,null,null,null,null,null,null,null,null,null,null,null,null,null,null,null,null,null,null,null,null,null,null,null,null,null,null,null,null,null,null,null,null,null,null,null,null,null,null,null,null,null,null,null,null,null,null,null,null,null,null,null,null,null,null,null,null,null,null,null,null,null,null,null,null,null,null,null,null,null,null,null,null,null,null,null,null,null,1,"JB 1+3",null,null,null,null,null,null,null,null,null,"Foderenheder"]
[{"$f":"IF(FEnr=1,\"Foderenheder pr. ha\",\"\")","v":"Foderenheder pr. ha"},null,{"$f":"IF(AND(Afgnr>1,FEnr=1),IF(VLOOKUP(Afgnr,_Afg07,$BR$131)=1,C29*VLOOKUP(Afgnr,_Afg07,$BQ$131),IF(VLOOKUP(Afgnr,_Afg07,$BR$131)=3,$CW$50*VLOOKUP(1,Foderkorn,$BQ$131),IF(VLOOKUP(Afgnr,_Afg07,$BR$131)=4,$CW$51*VLOOKUP(2,Foderkorn,$BQ$131),\"\"))),\"\")","v":""},{"$f":"IF(C57<>\"\",\"FEsv\",\"\")","v":""},null,null,{"$f":"IF(AND(Alt1nr>1,FEnr=1),IF(VLOOKUP(Alt1nr,_Afg07,$BR$131)=1,G29*VLOOKUP(Alt1nr,_Afg07,$BQ$131),IF(VLOOKUP(Alt1nr,_Afg07,$BR$131)=3,$CW$50*VLOOKUP(1,Foderkorn,$BQ$131),IF(VLOOKUP(Alt1nr,_Afg07,$BR$131)=4,$CW$51*VLOOKUP(2,Foderkorn,$BQ$131),\"\"))),\"\")","v":""},{"$f":"IF(G57<>\"\",\"FEsv\",\"\")","v":""},null,null,{"$f":"IF(AND(Alt2nr>1,FEnr=1),IF(VLOOKUP(Alt2nr,_Afg07,$BR$131)=1,K29*VLOOKUP(Alt2nr,_Afg07,$BQ$131),IF(VLOOKUP(Alt2nr,_Afg07,$BR$131)=3,$CW$50*VLOOKUP(1,Foderkorn,$BQ$131),IF(VLOOKUP(Alt2nr,_Afg07,$BR$131)=4,$CW$51*VLOOKUP(2,Foderkorn,$BQ$131),\"\"))),\"\")","v":""},{"$f":"IF(K57<>\"\",\"FEsv\",\"\")","v":""},null,null,null,null,null,null,null,null,null,null,null,null,null,null,null,null,null,null,null,null,null,null,null,null,null,null,null,null,null,null,null,null,null,null,null,null,null,null,null,null,null,null,null,null,null,null,null,null,null,null,null,null,null,null,null,null,null,null,null,null,null,null,null,null,null,null,null,null,null,null,null,null,null,null,null,null,null,null,null,null,null,null,null,null,2,"JB 2+4",null,null,null,null,null,null,null,null,1,"Vis"]
[{"$f":"IF(OR(Lagernr=1,FEnr=2),\"\",IF(Lagernr=BN131,\"Lager (planlager)\",IF(Lagernr=BO131,\"Lager (stålsilo)\",\"Lager (gastæt silo)\")))","v":"Lager (planlager)"},null,{"$f":"IF(AND(Afgnr>1,FEnr=1,Lagernr<>1),IF(VLOOKUP(Afgnr,_Afg07,$BR$131)=1,-C29*VLOOKUP(Afgnr,_Afg07,Lagernr)/C57,IF(VLOOKUP(Afgnr,_Afg07,$BR$131)=3,-$CW$50*VLOOKUP(1,Foderkorn,Lagernr)/C57,IF(VLOOKUP(Afgnr,_Afg07,$BR$131)=4,-$CW$51*VLOOKUP(2,Foderkorn,Lagernr)/C57,\"\"))),\"\")","v":""},{"$f":"IF(C58<>\"\",\"kr./FEsv\",\"\")","v":""},null,null,{"$f":"IF(AND(Alt1nr>1,FEnr=1,Lagernr<>1),IF(VLOOKUP(Alt1nr,_Afg07,$BR$131)=1,-G29*VLOOKUP(Alt1nr,_Afg07,Lagernr)/G57,IF(VLOOKUP(Alt1nr,_Afg07,$BR$131)=3,-$CW$50*VLOOKUP(1,Foderkorn,Lagernr)/G57,IF(VLOOKUP(Alt1nr,_Afg07,$BR$131)=4,-$CW$51*VLOOKUP(2,Foderkorn,Lagernr)/G57,\"\"))),\"\")","v":""},{"$f":"IF(G58<>\"\",\"kr./FEsv\",\"\")","v":""},null,null,{"$f":"IF(AND(Alt2nr>1,FEnr=1,Lagernr<>1),IF(VLOOKUP(Alt2nr,_Afg07,$BR$131)=1,-K29*VLOOKUP(Alt2nr,_Afg07,Lagernr)/K57,IF(VLOOKUP(Alt2nr,_Afg07,$BR$131)=3,-$CW$50*VLOOKUP(1,Foderkorn,Lagernr)/K57,IF(VLOOKUP(Alt2nr,_Afg07,$BR$131)=4,-$CW$51*VLOOKUP(2,Foderkorn,Lagernr)/K57,\"\"))),\"\")","v":""},{"$f":"IF(K58<>\"\",\"kr./FEsv\",\"\")","v":""},null,null,null,null,null,null,null,null,null,null,null,null,null,null,null,null,null,null,null,null,null,null,null,null,null,null,null,null,null,null,null,null,null,null,null,null,null,null,null,null,null,null,null,null,null,null,null,null,null,null,null,null,null,null,null,null,null,null,null,null,null,null,null,null,null,null,null,null,null,null,null,null,null,null,null,null,null,null,null,null,null,null,null,null,3,"JB 1-4 vandet",null,null,null,null,null,null,null,null,2,"Vis ikke"]
[{"$f":"IF(AND(FEnr=1,Lagernr<>1),\"Omkostninger ab lager\",\"\")","v":"Omkostninger ab lager"},null,{"$f":"IF(AND(Afgnr>1,FEnr=1,Lagernr<>1,VLOOKUP(Afgnr,_Afg07,$BR$131,)=1),(C42+C46+C47)/C57+C58,IF(AND(Afgnr>1,FEnr=1,Lagernr<>1,VLOOKUP(Afgnr,_Afg07,$BR$131,)=3),-C$452*$CV$50/$C$107/C$57+C58,IF(AND(Afgnr>1,FEnr=1,Lagernr<>1,VLOOKUP(Afgnr,_Afg07,$BR$131,)=4),-C$452*$CV$51/$C$127/C$57+C58,\"\")))","v":""},{"$f":"IF(C59<>\"\",\"kr./FEsv\",\"\")","v":""},null,null,{"$f":"IF(AND(Alt1nr>1,FEnr=1,Lagernr<>1,VLOOKUP(Alt1nr,_Afg07,$BR$131,)=1),(G42+G46+G47)/G57+G58,IF(AND(Alt1nr>1,FEnr=1,Lagernr<>1,VLOOKUP(Alt1nr,_Afg07,$BR$131,)=3),-G$452*$CV$50/$C$107/G$57+G58,IF(AND(Alt1nr>1,FEnr=1,Lagernr<>1,VLOOKUP(Alt1nr,_Afg07,$BR$131,)=4),-G$452*$CV$51/$C$127/G$57+G58,\"\")))","v":""},{"$f":"IF(G59<>\"\",\"kr./FEsv\",\"\")","v":""},null,null,{"$f":"IF(AND(Alt2nr>1,FEnr=1,Lagernr<>1,VLOOKUP(Alt2nr,_Afg07,$BR$131,)=1),(K42+K46+K47)/K57+K58,IF(AND(Alt2nr>1,FEnr=1,Lagernr<>1,VLOOKUP(Alt2nr,_Afg07,$BR$131,)=3),-K$452*$CV$50/$C$107/K$57+K58,IF(AND(Alt2nr>1,FEnr=1,Lagernr<>1,VLOOKUP(Alt2nr,_Afg07,$BR$131,)=4),-K$452*$CV$51/$C$127/K$57+K58,\"\")))","v":""},{"$f":"IF(K59<>\"\",\"kr./FEsv\",\"\")","v":""},null,null,null,null,null,null,null,null,null,null,null,null,null,null,null,null,null,null,null,null,null,null,null,null,null,null,null,null,null,null,null,null,null,null,null,null,null,null,null,null,null,null,null,null,null,null,null,null,null,null,null,null,null,null,null,null,null,null,null,null,null,null,null,null,null,null,null,null,null,null,null,null,null,null,null,null,null,null,null,null,null,null,null,null,4,"JB 5-6"]
[null,null,null,null,null,null,null,null,null,null,null,null,null,null,null,null,null,null,null,null,null,null,null,null,null,null,null,null,null,null,null,null,null,null,null,null,null,null,null,null,null,null,null,null,null,null,null,null,null,null,null,null,null,null,null,null,null,null,null,null,null,null,null,null,null,null,null,null,null,null,null,null,null,null,null,null,null,null,null,null,null,null,null,null,null,null,null,null,null,null,null,null,null,null,null,null,5,"JB 7-9"]
[]
["Kvælstof (normtilførsel)",null,{"$f":"IF(Afgnr>1,VLOOKUP(Afgnr,_Afg07,Nnr),\"\")","v":""},{"$f":"IF(C62<>\"\",\"kg N\",\"\")","v":""},null,null,{"$f":"IF(Alt1nr>1,VLOOKUP(Alt1nr,_Afg07,Nnr),\"\")","v":""},{"$f":"IF(G62<>\"\",\"kg N\",\"\")","v":""},null,null,{"$f":"IF(Alt2nr>1,VLOOKUP(Alt2nr,_Afg07,Nnr),\"\")","v":""},{"$f":"IF(K62<>\"\",\"kg N\",\"\")","v":""},null,null,null,null,null,null,null,null,null,null,null,null,null,null,null,null,null,null,null,null,null,null,null,null,null,null,null,null,null,null,null,null,null,null,null,null,null,null,null,null,null,null,null,null,null,null,null,null,null,null,null,null,null,null,null,null,null,null,null,null,null,null,null,null,null,null,null,null,null,null,null,null,null,null,null,null,null,null,null,null,null,null,null,null,"Halm anvendelse"]
["Fosfor (bortførsel + startgødn.)",null,{"$f":"IF(Afgnr>1,(C408+C409+C410+C411)/Ppris,\"\")","v":""},{"$f":"IF(C63<>\"\",\"kg P\",\"\")","v":""},null,null,{"$f":"IF(Alt1nr>1,(G408+G409+G410+G411)/Ppris,\"\")","v":""},{"$f":"IF(G63<>\"\",\"kg P\",\"\")","v":""},null,null,{"$f":"IF(Alt2nr>1,(K408+K409+K410+K411)/Ppris,\"\")","v":""},{"$f":"IF(K63<>\"\",\"kg P\",\"\")","v":""},null,null,null,null,null,null,null,null,null,null,null,null,null,null,null,null,null,null,null,null,null,null,null,null,null,null,null,null,null,null,null,null,null,null,null,null,null,null,null,null,null,null,null,null,null,null,null,null,null,null,null,null,null,null,null,null,null,null,null,null,null,null,null,null,null,null,null,null,null,null,null,null,null,null,null,null,null,null,null,null,null,null,null,null,null,"Bjærges"]
["Kalium (bortførsel)",null,{"$f":"IF(Afgnr>1,(C415+C416+C417)/Kpris,\"\")","v":""},{"$f":"IF(C64<>\"\",\"kg K\",\"\")","v":""},null,null,{"$f":"IF(Alt1nr>1,(G415+G416+G417)/Kpris,\"\")","v":""},{"$f":"IF(G64<>\"\",\"kg K\",\"\")","v":""},null,null,{"$f":"IF(Alt2nr>1,(K415+K416+K417)/Kpris,\"\")","v":""},{"$f":"IF(K64<>\"\",\"kg K\",\"\")","v":""},null,null,null,null,null,null,null,null,null,null,null,null,null,null,null,null,null,null,null,null,null,null,null,null,null,null,null,null,null,null,null,null,null,null,null,null,null,null,null,null,null,null,null,null,null,null,null,null,null,null,null,null,null,null,null,null,null,null,null,null,null,null,null,null,null,null,null,null,null,null,null,null,null,null,null,null,null,null,null,null,null,null,null,null,null,"Nedmuldes"]
[]
[null,null,null,null,null,null,null,null,null,null,null,null,null,null,null,null,null,null,null,null,null,null,null,null,null,null,null,null,null,null,null,null,null,null,null,null,null,null,null,null,null,null,null,null,null,null,null,null,null,null,null,null,null,null,null,null,null,null,null,null,null,null,null,null,null,null,null,null,null,null,null,null,null,null,null,null,null,null,null,null,null,null,null,null,null,null,null,null,null,null,null,null,null,null,null,null,"Kornsælger eller -køber"]
[null,null,null,null,null,{"$f":"IF(OR($CR$16=$O$185,$CS$16=$O$185,$CT$16=$O$185,$CU$16=$O$185),$P$185,\"\")","v":""},null,null,null,null,null,null,null,null,null,null,null,null,null,null,null,null,null,null,null,null,null,null,null,null,null,null,null,null,null,null,null,null,null,null,null,null,null,null,null,null,null,null,null,null,null,null,null,null,null,null,null,null,null,null,null,null,null,null,null,null,null,null,null,null,null,null,null,null,null,null,null,null,null,null,null,null,null,null,null,null,null,null,null,null,null,null,null,null,null,null,null,"Sælger",null,null,null,null,null,null,null,null,"Plove",null,null,null,null,null,"Stubharver",null,null,null,null,"Mejetærsker",null,null,"Såmaskiner",null,null,null,"Halmpresser",null,null,null,null,"Kartoffellægger",null,null,"ha/time"]
[null,null,null,null,null,{"$f":"IF($F$67=\"Sædskifte 1\",IF($CR$36>1,VLOOKUP($CR$36,_Afg07,2),\"\"),\"\")","v":""},null,{"$f":"IF($F$67=\"Sædskifte 1\",IF($CR$36>1,$C$93,\"\"),\"\")","v":""},{"$f":"IF(H68<>\"\",\"ha\",\"\")","v":""},{"$f":"IF($F$67=\"Sædskifte 1\",IF($CR$36>1,IF($E$93<>\"\",$E$93,$F$93),\"\"),\"\")","v":""},{"$f":"IF(J68<>\"\",G93,\"\")","v":""},{"$f":"IF($F$67=\"Sædskifte 1\",IF($CR$36>1,IF($H$93<>\"\",$H$93,$J$93),\"\"),\"\")","v":""},{"$f":"IF(L68<>\"\",\"kr.\",\"\")","v":""},null,null,null,null,null,null,null,null,null,null,null,null,null,null,null,null,null,null,null,null,null,null,null,null,null,null,null,null,null,null,null,null,null,null,null,null,null,null,null,null,null,null,null,null,null,null,null,null,null,null,null,null,null,null,null,null,null,null,null,null,null,null,null,null,null,null,null,null,null,null,null,null,null,null,null,null,null,null,null,null,null,null,null,null,"Køber",null,null,null,null,null,null,null,null,null,"Type","Kapacitet, ha/time","Lav-høj anvendelse, antal ha",null,null,null,"Type","Kapacitet, ha/time","Lav-høj anvendelse, antal ha",null,null,"Type",null,null,"Type","Kapacitet, ha/time",null,null,"Type","Kapacitet, ha/time","Transport, ha/time",null,1,"4 rækker u/ gødningsudstyr ",null,0.7]
[null,null,null,null,null,{"$f":"IF($F$67=\"Sædskifte 1\",IF($CR$38>1,VLOOKUP($CR$38,_Afg07,2),\"\"),\"\")","v":""},null,{"$f":"IF($F$67=\"Sædskifte 1\",IF($CR$38>1,$C$95,\"\"),\"\")","v":""},"",{"$f":"IF($F$67=\"Sædskifte 1\",IF($CR$38>1,IF($E$95<>\"\",$E$95,$F$95),\"\"),\"\")","v":""},{"$f":"IF(J69<>\"\",G95,\"\")","v":""},{"$f":"IF($F$67=\"Sædskifte 1\",IF($CR$38>1,IF($H$95<>\"\",$H$95,$J$95),\"\"),\"\")","v":""},"",null,null,null,null,null,null,null,null,null,null,null,null,null,null,null,null,null,null,null,null,null,null,null,null,null,null,null,null,null,null,null,null,null,null,null,null,null,null,null,null,null,null,null,null,null,null,null,null,null,null,null,null,null,null,null,null,null,null,null,null,null,null,null,null,null,null,null,null,null,null,null,null,null,null,null,null,null,null,null,null,null,null,null,null,null,null,null,null,null,null,null,null,null,1,"Vendeplov 4 fure ",0.9,"70-140 ha",null,null,1,"Stubharve 4 m (let) ",2.9,"200-400 ha",null,1,"Mejetærsker 5,4 m",1.7,1,"Kombiharve/såmaskine 3,0 m",2.4,null,1,"Minibigballer 1,5 kbm",4.9000000000000004,2,null,2,"4 rækker m/ gødningsudstyr ",null,0.7]
[null,null,null,null,null,{"$f":"IF($F$67=\"Sædskifte 1\",IF($CR$40>1,VLOOKUP($CR$40,_Afg07,2),\"\"),\"\")","v":""},null,{"$f":"IF($F$67=\"Sædskifte 1\",IF($CR$40>1,$C$97,\"\"),\"\")","v":""},"",{"$f":"IF($F$67=\"Sædskifte 1\",IF($CR$40>1,IF($E$97<>\"\",$E$97,$F$97),\"\"),\"\")","v":""},{"$f":"IF(J70<>\"\",G97,\"\")","v":""},{"$f":"IF($F$67=\"Sædskifte 1\",IF($CR$40>1,IF($H$97<>\"\",$H$97,$J$97),\"\"),\"\")","v":""},"",null,null,null,null,null,null,null,null,null,null,null,null,null,null,null,null,null,null,null,null,null,null,null,null,null,null,null,null,null,null,null,null,null,null,null,null,null,null,null,null,null,null,null,null,null,null,null,null,null,null,null,null,null,null,null,null,null,null,null,null,null,null,null,null,null,null,null,null,null,null,null,null,null,null,null,null,null,null,null,null,null,null,null,"Husdyrgødning",null,null,null,null,null,null,null,null,null,2,"Vendeplov 5 fure",1.1000000000000001,"85-170 ha",null,null,2,"Stubharve 4 m (tung)",2.7,"200-400 ha",null,2,"Mejetærsker 6,0 m",1.9,2,"Kombiharve/såmaskine  4,0 m",2.9,null,2,"Bigballer 3,5 kbm",5.3,3.2]
[null,null,null,null,null,{"$f":"IF($F$67=\"Sædskifte 1\",IF($CR$42>1,VLOOKUP($CR$42,_Afg07,2),\"\"),\"\")","v":""},null,{"$f":"IF($F$67=\"Sædskifte 1\",IF($CR$42>1,$C$99,\"\"),\"\")","v":""},"",{"$f":"IF($F$67=\"Sædskifte 1\",IF($CR$42>1,IF($E$99<>\"\",$E$99,$F$99),\"\"),\"\")","v":""},{"$f":"IF(J71<>\"\",G99,\"\")","v":""},{"$f":"IF($F$67=\"Sædskifte 1\",IF($CR$42>1,IF($H$99<>\"\",$H$99,$J$99),\"\"),\"\")","v":""},"",null,null,null,null,null,null,null,null,null,null,null,null,null,null,null,null,null,null,null,null,null,null,null,null,null,null,null,null,null,null,null,null,null,null,null,null,null,null,null,null,null,null,null,null,null,null,null,null,null,null,null,null,null,null,null,null,null,null,null,null,null,null,null,null,null,null,null,null,null,null,null,null,null,null,null,null,null,null,null,null,null,null,null,null,"Uden",null,null,null,null,null,null,null,null,3,"Vendeplov 8 fure",1.6,"120-240 ha",null,null,3,"Stubharve 6 m (tung)",4,"400-800 ha",null,3,"Mejetærsker 7,5 m",2.7,3,"Radsåmaskine 3,0 m",1.7,null,null,null,null,null,null,"Kartoffeloptager",null,null,"ha/time"]
[null,null,null,null,null,{"$f":"IF($F$67=\"Sædskifte 1\",IF($CR$44>1,VLOOKUP($CR$44,_Afg07,2),\"\"),\"\")","v":""},null,{"$f":"IF($F$67=\"Sædskifte 1\",IF($CR$44>1,$C$101,\"\"),\"\")","v":""},"",{"$f":"IF($F$67=\"Sædskifte 1\",IF($CR$44>1,IF($E$101<>\"\",$E$101,$F$101),\"\"),\"\")","v":""},{"$f":"IF(J72<>\"\",G101,\"\")","v":""},{"$f":"IF($F$67=\"Sædskifte 1\",IF($CR$44>1,IF($H$101<>\"\",$H$101,$J$101),\"\"),\"\")","v":""},"",null,null,null,null,null,null,null,null,null,null,null,null,null,null,null,null,null,null,null,null,null,null,null,null,null,null,null,null,null,null,null,null,null,null,null,null,null,null,null,null,null,null,null,null,null,null,null,null,null,null,null,null,null,null,null,null,null,null,null,null,null,null,null,null,null,null,null,null,null,null,null,null,null,null,null,null,null,null,null,null,null,null,null,null,"Med",null,null,null,null,null,null,null,null,4,"Vendeplov 12 fure",2.2999999999999998,"175-350 ha",null,null,4,"Tallerken / disc 4 m",2.8,"280-560 ha",null,4,"Mejetærsker 9,0 m",3.3,4,"Radsåmaskine 4,0 m",2.1,null,"Gyllevogn",null,null,"ton/time",null,1,"2 rk frilægger",null,0.8]
[null,null,null,null,null,{"$f":"IF($F$67=\"Sædskifte 1\",IF($CR$46>1,VLOOKUP($CR$46,_Afg07,2),\"\"),\"\")","v":""},null,{"$f":"IF($F$67=\"Sædskifte 1\",IF($CR$46>1,$C$103,\"\"),\"\")","v":""},"",{"$f":"IF($F$67=\"Sædskifte 1\",IF($CR$46>1,IF($E$103<>\"\",$E$103,$F$103),\"\"),\"\")","v":""},{"$f":"IF(J73<>\"\",G103,\"\")","v":""},{"$f":"IF($F$67=\"Sædskifte 1\",IF($CR$46>1,IF($H$103<>\"\",$H$103,$J$103),\"\"),\"\")","v":""},"",null,null,null,null,null,null,null,null,null,null,null,null,null,null,null,null,null,null,null,null,null,null,null,null,null,null,null,null,null,null,null,null,null,null,null,null,null,null,null,null,null,null,null,null,null,null,null,null,null,null,null,null,null,null,null,null,null,null,null,null,null,null,null,null,null,null,null,null,null,null,null,null,null,null,null,null,null,null,null,null,null,null,null,null,null,null,null,null,null,null,null,null,null,null,null,null,null,null,null,5,"Tallerken / disc 6 m",4.0999999999999996,"410-820 ha",null,5,"Mejetærsker 10,5 m",4,5,"Rotorharve/såmaskine 4,0 m",1.5,null,1,"Slæbeslanger 16 m / 15 ton ",null,51,null,2,"1 rk m/ tank/stensep.",null,0.3]
[null,null,null,null,null,{"$f":"IF($F$67=\"Sædskifte 1\",IF($CR$48>1,VLOOKUP($CR$48,_Afg07,2),\"\"),\"\")","v":""},null,{"$f":"IF($F$67=\"Sædskifte 1\",IF($CR$48>1,$C$105,\"\"),\"\")","v":""},"",{"$f":"IF($F$67=\"Sædskifte 1\",IF($CR$48>1,IF($E$105<>\"\",$E$105,$F$105),\"\"),\"\")","v":""},{"$f":"IF(J74<>\"\",G105,\"\")","v":""},{"$f":"IF($F$67=\"Sædskifte 1\",IF($CR$48>1,IF($H$105<>\"\",$H$105,$J$105),\"\"),\"\")","v":""},"",null,null,null,null,null,null,null,null,null,null,null,null,null,null,null,null,null,null,null,null,null,null,null,null,null,null,null,null,null,null,null,null,null,null,null,null,null,null,null,null,null,null,null,null,null,null,null,null,null,null,null,null,null,null,null,null,null,null,null,null,null,null,null,null,null,null,null,null,null,null,null,null,null,null,null,null,null,null,null,null,null,null,null,"Forfrugtsværdi",null,null,null,null,null,null,null,null,null,"Såbedsharver",null,null,null,null,null,"Marksprøjte",null,null,null,null,null,null,null,6,"Rotorharve/såmaskine 6,0 m",2.6,null,2,"Slæbeslanger 24 m / 20 ton ",null,60,null,3,"Selvkørende 2 rk m/ tank",null,0.9]
[null,null,null,null,null,null,null,null,null,null,null,null,null,null,null,null,null,null,null,null,null,null,null,null,null,null,null,null,null,null,null,null,null,null,null,null,null,null,null,null,null,null,null,null,null,null,null,null,null,null,null,null,null,null,null,null,null,null,null,null,null,null,null,null,null,null,null,null,null,null,null,null,null,null,null,null,null,null,null,null,null,null,null,null,null,null,null,null,null,null,null,null,null,null,null,null,null,"Ja",null,null,null,null,null,null,null,null,null,"Type","Kapacitet, ha/time",null,null,null,null,"Type","Kapacitet, ha/time",null,null,null,null,null,7,"Skiveskærmaskine 4 m",2.8,null,3,"Slæbeslanger 24 m / 25 ton ",null,66]
[null,null,null,null,null,{"$f":"IF(OR(CR16=O186,CS16=O186,CT16=O186,CU16=O186),P186,\"\")","v":""},null,null,null,null,null,null,null,null,null,null,null,null,null,null,null,null,null,null,null,null,null,null,null,null,null,null,null,null,null,null,null,null,null,null,null,null,null,null,null,null,null,null,null,null,null,null,null,null,null,null,null,null,null,null,null,null,null,null,null,null,null,null,null,null,null,null,null,null,null,null,null,null,null,null,null,null,null,null,null,null,null,null,null,null,null,null,null,null,null,null,null,"Nej",null,null,null,null,null,null,null,null,1,"Såbedsharve 4,5 m",3.3,null,null,null,1,"Sprøjte 24 m, 2800 liter ",5.3,null,null,null,null,null,8,"Skiveskærmaskine 6 m",3.8,null,4,"Nedfælder 6,0 m / 25 ton ",null,54]
[null,null,null,null,null,{"$f":"IF($F$76=\"Sædskifte 2\",IF(CR37>1,VLOOKUP(CR37,_Afg07,2),\"\"),\"\")","v":""},null,{"$f":"IF($F$76=\"Sædskifte 2\",IF(CR37>1,C113,\"\"),\"\")","v":""},{"$f":"IF(H77<>\"\",\"ha\",\"\")","v":""},{"$f":"IF($F$76=\"Sædskifte 2\",IF($CR37>1,IF(E113<>\"\",E113,F113),\"\"),\"\")","v":""},{"$f":"IF(J77<>\"\",G113,\"\")","v":""},{"$f":"IF($F$76=\"Sædskifte 2\",IF($CR37>1,IF(H113<>\"\",H113,J113),\"\"),\"\")","v":""},{"$f":"IF(L77<>\"\",\"kr.\",\"\")","v":""},null,null,null,null,null,null,null,null,null,null,null,null,null,null,null,null,null,null,null,null,null,null,null,null,null,null,null,null,null,null,null,null,null,null,null,null,null,null,null,null,null,null,null,null,null,null,null,null,null,null,null,null,null,null,null,null,null,null,null,null,null,null,null,null,null,null,null,null,null,null,null,null,null,null,null,null,null,null,null,null,null,null,null,null,null,null,null,null,null,null,null,null,null,2,"Såbedsharve 6,4 m ",4.7,null,null,null,2,"Sprøjte 24 m, 4000 liter",7,null,null,null,null,null,9,"Tandskærsmaskine 4 m ",2.1,null,5,"Nedfælder 7,5 m / 25 ton",null,60]
[null,null,null,null,null,{"$f":"IF($F$76=\"Sædskifte 2\",IF(CR39>1,VLOOKUP(CR39,_Afg07,2),\"\"),\"\")","v":""},null,{"$f":"IF($F$76=\"Sædskifte 2\",IF(CR39>1,C115,\"\"),\"\")","v":""},"",{"$f":"IF($F$76=\"Sædskifte 2\",IF($CR39>1,IF(E115<>\"\",E115,F115),\"\"),\"\")","v":""},{"$f":"IF(J78<>\"\",G115,\"\")","v":""},{"$f":"IF($F$76=\"Sædskifte 2\",IF($CR39>1,IF(H115<>\"\",H115,J115),\"\"),\"\")","v":""},{"$f":"IF(L78<>\"\",\"kr.\",\"\")","v":""},null,null,null,null,null,null,null,null,null,null,null,null,null,null,null,null,null,null,null,null,null,null,null,null,null,null,null,null,null,null,null,null,null,null,null,null,null,null,null,null,null,null,null,null,null,null,null,null,null,null,null,null,null,null,null,null,null,null,null,null,null,null,null,null,null,null,null,null,null,null,null,null,null,null,null,null,null,null,null,null,null,null,null,null,null,null,null,null,null,null,null,null,null,3,"Såbedsharve 9,1 m",6.6,null,null,null,3,"Sprøjte 36 m, 4000 liter",9,null,null,null,null,null,10,"Tandskærsmaskine 6 m ",2.8,null,6,"Selvkør. nedfælder 9 m/16 ton ",null,51,null,"Roeoptager",null,null,"ha/time"]
[null,null,null,null,null,{"$f":"IF($F$76=\"Sædskifte 2\",IF(CR41>1,VLOOKUP(CR41,_Afg07,2),\"\"),\"\")","v":""},null,{"$f":"IF($F$76=\"Sædskifte 2\",IF(CR41>1,C117,\"\"),\"\")","v":""},"",{"$f":"IF($F$76=\"Sædskifte 2\",IF($CR41>1,IF(E117<>\"\",E117,F117),\"\"),\"\")","v":""},{"$f":"IF(J79<>\"\",G117,\"\")","v":""},{"$f":"IF($F$76=\"Sædskifte 2\",IF($CR41>1,IF(H117<>\"\",H117,J117),\"\"),\"\")","v":""},"",null,null,null,null,null,null,null,null,null,null,null,null,null,null,null,null,null,null,null,null,null,null,null,null,null,null,null,null,null,null,null,null,null,null,null,null,null,null,null,null,null,null,null,null,null,null,null,null,null,null,null,null,null,null,null,null,null,null,null,null,null,null,null,null,null,null,null,null,null,null,null,null,null,null,null,null,null,null,null,null,null,null,null,null,null,null,null,null,null,null,null,null,null,4,"Tallerken / disc 4 m",2.8,null,null,null,4,"Sprøjte m/luft 24 m, 4400 liter",8,null,null,null,null,null,null,null,null,null,null,null,null,null,null,1,"Selvkørende 6 rk > 40 kbm tank ",null,1.3]
[null,null,null,null,null,{"$f":"IF($F$76=\"Sædskifte 2\",IF(CR43>1,VLOOKUP(CR43,_Afg07,2),\"\"),\"\")","v":""},null,{"$f":"IF($F$76=\"Sædskifte 2\",IF(CR43>1,C119,\"\"),\"\")","v":""},"",{"$f":"IF($F$76=\"Sædskifte 2\",IF($CR43>1,IF(E119<>\"\",E119,F119),\"\"),\"\")","v":""},{"$f":"IF(J80<>\"\",G119,\"\")","v":""},{"$f":"IF($F$76=\"Sædskifte 2\",IF($CR43>1,IF(H119<>\"\",H119,J119),\"\"),\"\")","v":""},"",null,null,null,null,null,null,null,null,null,null,null,null,null,null,null,null,null,null,null,null,null,null,null,null,null,null,null,null,null,null,null,null,null,null,null,null,null,null,null,null,null,null,null,null,null,null,null,null,null,null,null,null,null,null,null,null,null,null,null,null,null,null,null,null,null,null,null,null,null,null,null,null,null,null,null,null,null,null,null,null,null,null,null,null,null,null,null,null,null,null,null,null,null,5,"Tallerken / disc 6 m",4.0999999999999996,null,null,null,null,null,null,null,null,null,null,null,"Enkorn",null,"ha/time",null,"Gødningsspreder",null,null,"ha/time",null,2,"3 rk 12 kbm tank",null,0.7]
[null,null,null,null,null,{"$f":"IF($F$76=\"Sædskifte 2\",IF(CR45>1,VLOOKUP(CR45,_Afg07,2),\"\"),\"\")","v":""},null,{"$f":"IF($F$76=\"Sædskifte 2\",IF(CR45>1,C121,\"\"),\"\")","v":""},"",{"$f":"IF($F$76=\"Sædskifte 2\",IF($CR45>1,IF(E121<>\"\",E121,F121),\"\"),\"\")","v":""},{"$f":"IF(J81<>\"\",G121,\"\")","v":""},{"$f":"IF($F$76=\"Sædskifte 2\",IF($CR45>1,IF(H121<>\"\",H121,J121),\"\"),\"\")","v":""},"",null,null,null,null,null,null,null,null,null,null,null,null,null,null,null,null,null,null,null,null,null,null,null,null,null,null,null,null,null,null,null,null,null,null,null,null,null,null,null,null,null,null,null,null,null,null,null,null,null,null,null,null,null,null,null,null,null,null,null,null,null,null,null,null,null,null,null,null,null,null,null,null,null,null,null,null,null,null,null,null,null,null,null,null,null,null,null,null,null,null,null,null,null,null,null,null,null,null,null,null,null,null,null,null,null,null,null,1,"12 rækker",2.6,null,1,"Liftophængt 24 m / 3 ton ",null,6]
[null,null,null,null,null,{"$f":"IF($F$76=\"Sædskifte 2\",IF(CR47>1,VLOOKUP(CR47,_Afg07,2),\"\"),\"\")","v":""},null,{"$f":"IF($F$76=\"Sædskifte 2\",IF(CR47>1,C123,\"\"),\"\")","v":""},"",{"$f":"IF($F$76=\"Sædskifte 2\",IF($CR47>1,IF(E123<>\"\",E123,F123),\"\"),\"\")","v":""},{"$f":"IF(J82<>\"\",G123,\"\")","v":""},{"$f":"IF($F$76=\"Sædskifte 2\",IF($CR47>1,IF(H123<>\"\",H123,J123),\"\"),\"\")","v":""},"",null,null,null,null,null,null,null,null,null,null,null,null,null,null,null,null,null,null,null,null,null,null,null,null,null,null,null,null,null,null,null,null,null,null,null,null,null,null,null,null,null,null,null,null,null,null,null,null,null,null,null,null,null,null,null,null,null,null,null,null,null,null,null,null,null,null,null,null,null,null,null,null,null,null,null,null,null,null,null,null,null,null,null,null,null,null,null,null,null,null,null,null,null,null,null,null,null,null,null,null,null,null,null,null,null,null,null,null,null,null,null,2,"Bugseret 20 m / 10 ton ",null,9]
[null,null,null,null,null,{"$f":"IF($F$76=\"Sædskifte 2\",IF(CR49>1,VLOOKUP(CR49,_Afg07,2),\"\"),\"\")","v":""},null,{"$f":"IF($F$76=\"Sædskifte 2\",IF(CR49>1,C125,\"\"),\"\")","v":""},"",{"$f":"IF($F$76=\"Sædskifte 2\",IF($CR49>1,IF(E125<>\"\",E125,F125),\"\"),\"\")","v":""},{"$f":"IF(J83<>\"\",G125,\"\")","v":""},{"$f":"IF($F$76=\"Sædskifte 2\",IF($CR49>1,IF(H125<>\"\",H125,J125),\"\"),\"\")","v":""},"",null,null,null,null,null,null,null,null,null,null,null,null,null,null,null,null,null,null,null,null,null,null,null,null,null,null,null,null,null,null,null,null,null,null,null,null,null,null,null,null,null,null,null,null,null,null,null,null,null,null,null,null,null,null,null,null,null,null,null,null,null,null,null,null,null,null,null,null,null,null,null,null,null,null,null,null,null,null,null,null,null,null,null,null,null,null,null,null,null,null,null,null,null,null,null,null,null,null,null,null,null,null,null,null,null,null,null,null,null,null,null,3,"Bugseret 16 m / 5 ton",null,7.8]
[]
[]
[{"$f":"\"Jordtypen er \"&IF(JBnr=1,\"JB 1+3\",IF(JBnr=2,\"JB 2+4\",IF(JBnr=3,\"JB 1-4, vandet\",IF(JBnr=4,\"JB 5-6\",\"JB 7-9\"))))","v":"Jordtypen er JB 5-6"},null,{"$f":"IF(Hdgnr=1,\"Ingen husdyrgødning\",\"Husdyrgødning fra \"&VLOOKUP(Hdgnr,_Hdg2,2))","v":"Ingen husdyrgødning"}]
[{"$f":"IF(HalmJa=1,\"Halmen bjærges\",\"Halmen nedmuldes\")","v":"Halmen nedmuldes"},null,{"$f":"IF(Købernr=1,\"Bedriften er netto kornsælger\",\"Bedriften er netto kornkøber\")","v":"Bedriften er netto kornsælger"}]
[]
[]
["Sædskifte 1",null,"Antal",null,"Eget"," Udbytte-",null,"Egen",null,"Standard"]
[null,null,"ha",null,"udbytte","norm",null,"pris",null," pris"]
[]
[null,null,null,null,null,{"$f":"IF(E93<>\"\",\"\",IF(VLOOKUP($CR36,_Afg07,$CS$3)=0,\"\",VLOOKUP($CR36,_Afg07,$CS$3)))","v":""},{"$f":"IF($CR36>1,IF(VLOOKUP($CR36,_Afg07,3)<>\"\",VLOOKUP($CR36,_Afg07,3),\"\"),\"\")","v":""},null,null,{"$f":"IF(H93<>\"\",\"\",IF(VLOOKUP($CR36,_Afg07,$R$131)=0,\"\",VLOOKUP($CR36,_Afg07,$R$131)))","v":""},{"$f":"IF($CR36>1,\"kr.\",\"\")","v":""},null,null,null,{"$f":"IF(AND(CR36>1,VLOOKUP(CR36,_Afg07,3)=\"\"),\"Areal med efterafgrøder tælles ikke med i dyrket areal i alt\",\"\")","v":""},"Her kan du angive, hvilke afgrøder der skal indgå i sædskifte 1 samt arealer, udbytter og priser.\nFor at få sædskifte 1 vist på udskriften skal det vælges i række 16 (nederst i rullelisten)"]
[]
[null,null,null,null,null,{"$f":"IF(E95<>\"\",\"\",IF(VLOOKUP(CR38,_Afg07,$CS$3)=0,\"\",VLOOKUP(CR38,_Afg07,$CS$3)))","v":""},{"$f":"IF($CR38>1,IF(VLOOKUP($CR38,_Afg07,3)<>\"\",VLOOKUP($CR38,_Afg07,3),\"\"),\"\")","v":""},null,null,{"$f":"IF(H95<>\"\",\"\",IF(VLOOKUP($CR38,_Afg07,$R$131)=0,\"\",VLOOKUP($CR38,_Afg07,$R$131)))","v":""},{"$f":"IF($CR38>1,\"kr.\",\"\")","v":""},null,null,null,{"$f":"IF(AND(CR38>1,VLOOKUP(CR38,_Afg07,3)=\"\"),\"Areal med efterafgrøder tælles ikke med i dyrket areal i alt\",\"\")","v":""}]
[]
[null,null,null,null,null,{"$f":"IF(E97<>\"\",\"\",IF(VLOOKUP(CR40,_Afg07,$CS$3)=0,\"\",VLOOKUP(CR40,_Afg07,$CS$3)))","v":""},{"$f":"IF($CR40>1,IF(VLOOKUP($CR40,_Afg07,3)<>\"\",VLOOKUP($CR40,_Afg07,3),\"\"),\"\")","v":""},null,null,{"$f":"IF(H97<>\"\",\"\",IF(VLOOKUP($CR40,_Afg07,$R$131)=0,\"\",VLOOKUP($CR40,_Afg07,$R$131)))","v":""},{"$f":"IF($CR40>1,\"kr.\",\"\")","v":""},null,null,null,{"$f":"IF(AND(CR40>1,VLOOKUP(CR40,_Afg07,3)=\"\"),\"Areal med efterafgrøder tælles ikke med i dyrket areal i alt\",\"\")","v":""}]
[]
[null,null,null,null,null,{"$f":"IF(E99<>\"\",\"\",IF(VLOOKUP(CR42,_Afg07,$CS$3)=0,\"\",VLOOKUP(CR42,_Afg07,$CS$3)))","v":""},{"$f":"IF($CR42>1,IF(VLOOKUP($CR42,_Afg07,3)<>\"\",VLOOKUP($CR42,_Afg07,3),\"\"),\"\")","v":""},null,null,{"$f":"IF(H99<>\"\",\"\",IF(VLOOKUP($CR42,_Afg07,$R$131)=0,\"\",VLOOKUP($CR42,_Afg07,$R$131)))","v":""},{"$f":"IF($CR42>1,\"kr.\",\"\")","v":""},null,null,null,{"$f":"IF(AND(CR42>1,VLOOKUP(CR42,_Afg07,3)=\"\"),\"Areal med efterafgrøder tælles ikke med i dyrket areal i alt\",\"\")","v":""}]
[]
[null,null,null,null,null,{"$f":"IF(E101<>\"\",\"\",IF(VLOOKUP(CR44,_Afg07,$CS$3)=0,\"\",VLOOKUP(CR44,_Afg07,$CS$3)))","v":""},{"$f":"IF($CR44>1,IF(VLOOKUP($CR44,_Afg07,3)<>\"\",VLOOKUP($CR44,_Afg07,3),\"\"),\"\")","v":""},null,null,{"$f":"IF(H101<>\"\",\"\",IF(VLOOKUP($CR44,_Afg07,$R$131)=0,\"\",VLOOKUP($CR44,_Afg07,$R$131)))","v":""},{"$f":"IF($CR44>1,\"kr.\",\"\")","v":""},null,null,null,{"$f":"IF(AND(CR44>1,VLOOKUP(CR44,_Afg07,3)=\"\"),\"Areal med efterafgrøder tælles ikke med i dyrket areal i alt\",\"\")","v":""}]
[]
[null,null,null,null,null,{"$f":"IF(E103<>\"\",\"\",IF(VLOOKUP(CR46,_Afg07,$CS$3)=0,\"\",VLOOKUP(CR46,_Afg07,$CS$3)))","v":""},{"$f":"IF($CR46>1,IF(VLOOKUP($CR46,_Afg07,3)<>\"\",VLOOKUP($CR46,_Afg07,3),\"\"),\"\")","v":""},null,null,{"$f":"IF(H103<>\"\",\"\",IF(VLOOKUP($CR46,_Afg07,$R$131)=0,\"\",VLOOKUP($CR46,_Afg07,$R$131)))","v":""},{"$f":"IF($CR46>1,\"kr.\",\"\")","v":""},null,null,null,{"$f":"IF(AND(CR46>1,VLOOKUP(CR46,_Afg07,3)=\"\"),\"Areal med efterafgrøder tælles ikke med i dyrket areal i alt\",\"\")","v":""}]
[]
[null,null,null,null,null,{"$f":"IF(E105<>\"\",\"\",IF(VLOOKUP(CR48,_Afg07,$CS$3)=0,\"\",VLOOKUP(CR48,_Afg07,$CS$3)))","v":""},{"$f":"IF($CR48>1,IF(VLOOKUP($CR48,_Afg07,3)<>\"\",VLOOKUP($CR48,_Afg07,3),\"\"),\"\")","v":""},null,null,{"$f":"IF(H105<>\"\",\"\",IF(VLOOKUP($CR48,_Afg07,$R$131)=0,\"\",VLOOKUP($CR48,_Afg07,$R$131)))","v":""},{"$f":"IF($CR48>1,\"kr.\",\"\")","v":""},null,null,null,{"$f":"IF(AND(CR48>1,VLOOKUP(CR48,_Afg07,3)=\"\"),\"Areal med efterafgrøder tælles ikke med i dyrket areal i alt\",\"\")","v":""}]
[]
["Dyrket areal i alt",null,{"$f":"IF(AND(CR36>1,VLOOKUP(CR36,_Afg07,3)<>\"\"),C93,0)+IF(AND(CR38>1,VLOOKUP(CR38,_Afg07,3)<>\"\"),C95,0)+IF(AND(CR40>1,VLOOKUP(CR40,_Afg07,3)<>\"\"),C97,0)+IF(AND(CR42>1,VLOOKUP(CR42,_Afg07,3)<>\"\"),C99,0)+IF(AND(CR44>1,VLOOKUP(CR44,_Afg07,3)<>\"\"),C101,0)+IF(AND(CR46>1,VLOOKUP(CR46,_Afg07,3)<>\"\"),C103,0)+IF(AND(CR48>1,VLOOKUP(CR48,_Afg07,3)<>\"\"),C105,0)","v":0}]
[]
[]
["Sædskifte 2",null,"Antal",null,"Eget"," Udbytte-",null,"Egen",null,"Standard"]
[null,null,"ha",null,"udbytte","norm",null,"pris",null," pris"]
[]
[null,null,null,null,null,{"$f":"IF(E113<>\"\",\"\",IF(VLOOKUP(CR37,_Afg07,$CS$3)=0,\"\",VLOOKUP(CR37,_Afg07,$CS$3)))","v":""},{"$f":"IF(CR37>1,IF(VLOOKUP(CR37,_Afg07,3)<>\"\",VLOOKUP(CR37,_Afg07,3),\"\"),\"\")","v":""},null,null,{"$f":"IF(H113<>\"\",\"\",IF(VLOOKUP($CR37,_Afg07,$R$131)=0,\"\",VLOOKUP($CR37,_Afg07,$R$131)))","v":""},{"$f":"IF($CR37>1,\"kr.\",\"\")","v":""},null,null,null,{"$f":"IF(AND(CR37>1,VLOOKUP(CR37,_Afg07,3)=\"\"),\"Areal med efterafgrøder tælles ikke med i dyrket areal i alt\",\"\")","v":""},"Her kan du angive, hvilke afgrøder der skal indgå i sædskifte 2 samt arealer, udbytter og priser.\nFor at få sædskifte 2 vist på udskriften skal det vælges i række 16 (nederst i rullelisten)"]
[]
[null,null,null,null,null,{"$f":"IF(E115<>\"\",\"\",IF(VLOOKUP(CR39,_Afg07,$CS$3)=0,\"\",VLOOKUP(CR39,_Afg07,$CS$3)))","v":""},{"$f":"IF(CR39>1,IF(VLOOKUP(CR39,_Afg07,3)<>\"\",VLOOKUP(CR39,_Afg07,3),\"\"),\"\")","v":""},null,null,{"$f":"IF(H115<>\"\",\"\",IF(VLOOKUP($CR39,_Afg07,$R$131)=0,\"\",VLOOKUP($CR39,_Afg07,$R$131)))","v":""},{"$f":"IF($CR39>1,\"kr.\",\"\")","v":""},null,null,null,{"$f":"IF(AND(CR39>1,VLOOKUP(CR39,_Afg07,3)=\"\"),\"Areal med efterafgrøder tælles ikke med i dyrket areal i alt\",\"\")","v":""}]
[]
[null,null,null,null,null,{"$f":"IF(E117<>\"\",\"\",IF(VLOOKUP(CR41,_Afg07,$CS$3)=0,\"\",VLOOKUP(CR41,_Afg07,$CS$3)))","v":""},{"$f":"IF(CR41>1,IF(VLOOKUP(CR41,_Afg07,3)<>\"\",VLOOKUP(CR41,_Afg07,3),\"\"),\"\")","v":""},null,null,{"$f":"IF(H117<>\"\",\"\",IF(VLOOKUP($CR41,_Afg07,$R$131)=0,\"\",VLOOKUP($CR41,_Afg07,$R$131)))","v":""},{"$f":"IF($CR41>1,\"kr.\",\"\")","v":""},null,null,null,{"$f":"IF(AND(CR41>1,VLOOKUP(CR41,_Afg07,3)=\"\"),\"Areal med efterafgrøder tælles ikke med i dyrket areal i alt\",\"\")","v":""}]
[]
[null,null,null,null,null,{"$f":"IF(E119<>\"\",\"\",IF(VLOOKUP(CR43,_Afg07,$CS$3)=0,\"\",VLOOKUP(CR43,_Afg07,$CS$3)))","v":""},{"$f":"IF(CR43>1,IF(VLOOKUP(CR43,_Afg07,3)<>\"\",VLOOKUP(CR43,_Afg07,3),\"\"),\"\")","v":""},null,null,{"$f":"IF(H119<>\"\",\"\",IF(VLOOKUP($CR43,_Afg07,$R$131)=0,\"\",VLOOKUP($CR43,_Afg07,$R$131)))","v":""},{"$f":"IF($CR43>1,\"kr.\",\"\")","v":""},null,null,null,{"$f":"IF(AND(CR43>1,VLOOKUP(CR43,_Afg07,3)=\"\"),\"Areal med efterafgrøder tælles ikke med i dyrket areal i alt\",\"\")","v":""}]
[]
[null,null,null,null,null,{"$f":"IF(E121<>\"\",\"\",IF(VLOOKUP(CR45,_Afg07,$CS$3)=0,\"\",VLOOKUP(CR45,_Afg07,$CS$3)))","v":""},{"$f":"IF(CR45>1,IF(VLOOKUP(CR45,_Afg07,3)<>\"\",VLOOKUP(CR45,_Afg07,3),\"\"),\"\")","v":""},null,null,{"$f":"IF(H121<>\"\",\"\",IF(VLOOKUP($CR45,_Afg07,$R$131)=0,\"\",VLOOKUP($CR45,_Afg07,$R$131)))","v":""},{"$f":"IF($CR45>1,\"kr.\",\"\")","v":""},null,null,null,{"$f":"IF(AND(CR45>1,VLOOKUP(CR45,_Afg07,3)=\"\"),\"Areal med efterafgrøder tælles ikke med i dyrket areal i alt\",\"\")","v":""}]
[]
[null,null,null,null,null,{"$f":"IF(E123<>\"\",\"\",IF(VLOOKUP(CR47,_Afg07,$CS$3)=0,\"\",VLOOKUP(CR47,_Afg07,$CS$3)))","v":""},{"$f":"IF(CR47>1,IF(VLOOKUP(CR47,_Afg07,3)<>\"\",VLOOKUP(CR47,_Afg07,3),\"\"),\"\")","v":""},null,null,{"$f":"IF(H123<>\"\",\"\",IF(VLOOKUP($CR47,_Afg07,$R$131)=0,\"\",VLOOKUP($CR47,_Afg07,$R$131)))","v":""},{"$f":"IF($CR47>1,\"kr.\",\"\")","v":""},null,null,null,{"$f":"IF(AND(CR47>1,VLOOKUP(CR47,_Afg07,3)=\"\"),\"Areal med efterafgrøder tælles ikke med i dyrket areal i alt\",\"\")","v":""}]
[]
[null,null,null,null,null,{"$f":"IF(E125<>\"\",\"\",IF(VLOOKUP(CR49,_Afg07,$CS$3)=0,\"\",VLOOKUP(CR49,_Afg07,$CS$3)))","v":""},{"$f":"IF(CR49>1,IF(VLOOKUP(CR49,_Afg07,3)<>\"\",VLOOKUP(CR49,_Afg07,3),\"\"),\"\")","v":""},null,null,{"$f":"IF(H125<>\"\",\"\",IF(VLOOKUP($CR49,_Afg07,$R$131)=0,\"\",VLOOKUP($CR49,_Afg07,$R$131)))","v":""},{"$f":"IF($CR49>1,\"kr.\",\"\")","v":""},null,null,null,{"$f":"IF(AND(CR49>1,VLOOKUP(CR49,_Afg07,3)=\"\"),\"Areal med efterafgrøder tælles ikke med i dyrket areal i alt\",\"\")","v":""}]
[]
["Dyrket areal i alt",null,{"$f":"IF(AND(CR37>1,VLOOKUP(CR37,_Afg07,3)<>\"\"),C113,0)+IF(AND(CR39>1,VLOOKUP(CR39,_Afg07,3)<>\"\"),C115,0)+IF(AND(CR41>1,VLOOKUP(CR41,_Afg07,3)<>\"\"),C117,0)+IF(AND(CR43>1,VLOOKUP(CR43,_Afg07,3)<>\"\"),C119,0)+IF(AND(CR45>1,VLOOKUP(CR45,_Afg07,3)<>\"\"),C121,0)+IF(AND(CR47>1,VLOOKUP(CR47,_Afg07,3)<>\"\"),C123,0)+IF(AND(CR49>1,VLOOKUP(CR49,_Afg07,3)<>\"\"),C125,0)","v":0}]
[]
[]
[]
["Normer",null,null,null,null,null,null,null,null,null,null,null,null,null,1,2,3,4,5,6,7,8,9,10,11,12,13,14,15,16,17,18,19,20,21,22,23,24,25,26,27,28,29,30,31,32,33,34,35,36,37,38,39,40,41,42,43,44,45,46,47,48,49,50,51,52,53,54,55,56,57,58,59,60,61,62,63,64,65,66,67,68,69,70,71,72]
[null,null,null,null,null,null,null,null,null,null,null,null,null,null,null,null,null,null,"Normudbytter",null,null,null,null,"Halmudbytte, kg pr. ha",null,null,null,null,"Forfrugtsværdi, merudbytte hkg pr. ha",null,null,null,null,"Sparet N","Udsæd","Planteværn","Analyser","Sum","N-gødning, kg N pr. ha",null,null,null,null,"P-start 1","P-start 2","P-kerne","P-halm","K-start","K-kerne","K-halm","Øvrig stykomk (udbytteafhængig)","Afgrøder","Maskin- og arbejdsomk. (med halmbj.), kr. pr. ha",null,null,null,null,"Maskin- og arbejdsomk. (uden halmbj.), kr. pr. ha",null,null,null,null,"Tørring","Eget tørreri","Gylle omk","Plansilo","Stålsilo","Gastæt silo",null,"Korn","Pløjning","Såbed","Glyphosat","Såning","Harvning","Høst","Halm","Mejetærskertid","Enkorn-","Kartoffel-","Kartoffel-","Roe-","Planteværn","Gødskning","Gylle","Korn-"]
["Kvælstofpris",null,6.3,null,null,null,null,null,null,null,null,null,null,null,null,"Afgrøde","Enhed","Pris","JB 1+3","JB 2+4","JB 1-4, vandet","JB 5-6","JB 7-9","JB 1+3","JB 2+4","JB 1-4, vandet","JB 5-6","JB 7-9","JB 1+3","JB 2+4","JB 1-4, vandet","JB 5-6","JB 7-9","Alle JB","Alle JB","Alle JB","Alle JB","Alle JB","JB 1+3","JB 2+4","JB 1-4, vandet","JB 5-6","JB 7-9","Alle JB","Alle JB","Alle JB","Alle JB","JB1+3 og vandet","Alle JB","Alle JB","Alle JB",null,"JB 1+3","JB 2+4","JB 1-4, vandet","JB 5-6","JB 7-9","JB 1+3","JB 2+4","JB 1-4, vandet","JB 5-6","JB 7-9","Kr./hkg",null,"kr. pr. ton","kr./hkg","kr./hkg","kr./hkg","Fesv","1 = ja",null,"Harvning",null,null,"efter høst","(korn og frø)",null,"faktor","såning","lægning","optagning","optagning","Antal beh.","Antal beh.","Ton pr. ha","type","Afgrøde"]
[null,null,null,null,null,null,null,null,null,null,null,null,null,null,1,null,null,null,null,null,null,null,null,null,null,null,null,null,null,null,null,null,null,null,null,null,null,null,null,null,null,null,null,null,null,null,null,null,null,null,null,null,null,null,null,null,null,null,null,null,null,null,null,null,null,null,null,null,null,1]
["Fosforpris",null,12,null,null,null,null,null,null,null,null,null,null,null,2,"Alm. rajgræs 2n","hkg",800,12,12,12,12,12,3800,3800,5300,5300,5300,2,4,4,6,6,23,385,860,175,{"$f":"AI135+AJ135+AK135","v":1420},170,170,170,170,170,null,5,0.39600000000000002,9.7500000000000003E-2,20,0.66,2.125,66.333333333333329,"Alm. rajgræs 2n",3866,3866,6377,4537,4537,3115,3115,5315,3475,3475,30,28,20,null,null,null,0,2,null,null,null,1,2,2,2,2.5,null,null,null,null,3,1,30,null,"Alm. rajgræs 2n"]
[null,null,null,null,null,null,null,null,null,null,null,null,null,null,3,"Alm. rajgræs, 2n Øko","hkg",1100,7.5,7.5,9.5,9.5,9.5,2400,2400,4500,3000,3000,2,4,4,6,6,23,420,0,0,{"$f":"AI136+AJ136+AK136","v":420},105,105,105,105,105,null,5,0.39600000000000002,9.7500000000000003E-2,20,0.66,2.125,55.555555555555557,"Alm. rajgræs, 2n Øko",3445,3445,5989,3819,3819,2915,2915,5063,3148,3148,30,28,20,null,null,null,0,2,null,null,null,1,2,2,2,2.5,null,null,null,null,null,null,45,null,"Alm. rajgræs, 2n Øko"]
["Kaliumpris",null,5,null,null,null,null,null,null,null,null,null,null,null,4,"Alm. rajgræs 4n","hkg",800,15.9,15.9,15.9,15.9,15.9,3800,3800,5300,5300,5300,2,4,4,6,6,23,385,860,175,{"$f":"AI137+AJ137+AK137","v":1420},170,170,170,170,170,null,5,0.39600000000000002,9.7500000000000003E-2,20,0.66,2.125,53.06666666666667,"Alm. rajgræs 4n",3866,3866,6377,4537,4537,3115,3115,5315,3475,3475,30,28,20,null,null,null,0,2,null,null,null,1,2,2,2,2.5,null,null,null,null,3,1,30,null,"Alm. rajgræs 4n"]
[null,null,null,null,null,null,null,null,null,null,null,null,null,null,5,"Efterafgr. Olieræddike",null,0,0,0,0,0,0,null,null,null,null,null,null,null,null,null,null,25,260,0,0,{"$f":"AI138+AJ138+AK138","v":260},0,0,0,0,0,null,null,null,null,null,null,null,null,{"$f":"P138","v":"Efterafgr. Olieræddike"},140,140,140,140,140,140,140,140,140,140,0,0,0,null,null,null,0,null,null,2,null,2,null,null,null,null,null,null,null,null,null,null,null,null,{"$f":"P138","v":"Efterafgr. Olieræddike"}]
["Meromkostning til erstatningskorn",null,15,null,null,null,null,null,null,null,null,null,null,null,6,"Efterafgr. Rajgræs",null,0,0,0,0,0,0,null,null,null,null,null,null,null,null,null,null,25,280,0,0,{"$f":"AI139+AJ139+AK139","v":280},0,0,0,0,0,null,null,null,null,null,null,null,null,{"$f":"P139","v":"Efterafgr. Rajgræs"},140,140,140,140,140,140,140,140,140,140,0,0,0,null,null,null,0,null,null,2,null,2,null,null,null,null,null,null,null,null,null,null,null,null,{"$f":"P139","v":"Efterafgr. Rajgræs"}]
[null,null,null,null,null,null,null,null,null,null,null,null,null,null,7,"Efterafgr. Gul sennep",null,0,0,0,0,0,0,null,null,null,null,null,null,null,null,null,null,25,160,0,0,{"$f":"AI140+AJ140+AK140","v":160},0,0,0,0,0,null,null,null,null,null,null,null,null,{"$f":"P140","v":"Efterafgr. Gul sennep"},140,140,140,140,140,140,140,140,140,140,0,0,0,null,null,null,0,null,null,2,null,2,null,null,null,null,null,null,null,null,null,null,null,null,{"$f":"P140","v":"Efterafgr. Gul sennep"}]
["Kornpris, forfrugtsværdi",null,130,null,null,null,null,null,null,null,null,null,null,null,8,"Engrapgræs (mark)","hkg",1775,11,11,11,11,11,0,0,0,0,0,2,4,4,6,6,23,808,690,175,1673,160,160,160,160,160,null,5,0.39600000000000002,9.7500000000000003E-2,20,0.66,2.125,73.909090909090907,"Engrapgræs (mark)",4549,4549,6074,4549,4549,4549,4549,6074,4549,4549,30,28,0,null,null,null,0,2,null,null,null,1,2,1,1,3,null,null,null,null,1,2,null,null,"Engrapgræs (mark)"]
[null,null,null,null,null,null,null,null,null,null,null,null,null,null,9,"Engrapgræs (plæne)","hkg",1850,8,8,8,8,8,0,0,0,0,0,2,4,4,6,6,23,808,690,175,1673,120,120,120,120,120,null,5,0.39600000000000002,9.7500000000000003E-2,20,0.66,2.125,101.625,"Engrapgræs (plæne)",4549,4549,6074,4549,4549,4549,4549,6074,4549,4549,30,28,0,null,null,null,0,2,null,null,null,1,2,1,1,3,null,null,null,null,1,2,null,null,"Engrapgræs (plæne)"]
["N i husdyrgødning fra 1 DE svin",null,100,null,"kg N (total)",null,null,null,null,null,null,null,null,null,10,"Fabrikskartofler","hkg",65,482,533,584,584,584,0,0,0,0,0,2,4,4,6,6,0,{"$f":"1012+2300","v":3312},4730,0,8042,219,214,239,214,214,7.5,null,4.5999999999999999E-2,0,20,0.40200000000000002,0,5.9810964083175806,"Fabrikskartofler",9710,10699,14276,12075,12075,9710,10699,14276,12075,12075,0,0,0,null,null,null,0,2,1,1,1,null,3,null,null,null,null,1,1,null,14,1,null,null,"Fabrikskartofler"]
[null,null,null,null,null,null,null,null,null,null,null,null,null,null,11,"Havre (vårhavre)","hkg",100,44,51,56,57,60,2500,2500,3200,3300,3300,null,null,null,null,null,0,450,320,0,770,120,115,138,114,119,null,2.5,0.34849999999999998,0.11899999999999999,20,0.42499999999999999,1.2749999999999999,0,"Havre",3946,3946,6077,4357,4357,3465,3465,5450,3710,3710,10,5,22,8,7,6.5,87,1,1,1,1,1,2,2,2,1.2,null,null,null,null,2,1,32,"Havre","Havre"]
["P i husdyrgødning fra 1 DE svin",null,25,null,"kg P",null,null,null,null,null,null,null,null,null,12,"Havre Øko","hkg",210,30,30,50,50,50,2000,2000,2400,2400,2400,5,7,7,8,9,0,765,0,0,765,55,55,55,55,55,null,null,0.34849999999999998,0.11899999999999999,20,0.42499999999999999,1.2749999999999999,0,"Havre Øko",4113,4113,6378,4691,4691,3717,3717,5887,4197,4197,10,5,22,8,7,6.5,87,1,1,1,null,1,2,2,2,1.2,null,null,null,null,null,null,20,"Havre","Havre Øko"]
[null,null,null,null,null,null,null,null,null,null,null,null,null,null,13,"Hestebønne","hkg",130,45,45,45,45,45,0,0,0,0,0,5,7,7,8,9,23,1150,685,0,{"$f":"AI146+AJ146+AK146","v":1835},0,0,0,0,0,null,2.5,0.4214,0.17,20,0.98040000000000005,0.63749999999999996,0,"Hestebønne",4688,4688,5731,3990,3990,4688,4688,5731,3990,3990,16,14,0,null,null,null,101,2,1,1,1,1,2,null,null,1,null,null,1,null,2,1,0,null,"Hestebønne"]
["K i husdyrgødning fra 1 DE svin",null,50,null,"kg K",null,null,null,null,null,null,null,null,null,14,"Hestebønne Øko","hkg",300,20,20,37,37,37,0,0,0,0,0,2,4,4,6,6,23,1196,0,null,1196,0,0,0,0,0,null,null,0.53,0,20,1.03,0,null,"Hestebønne Øko",3915,3915,6187,4497,4497,3915,3915,6187,4497,4497,16,20.6,0,45,null,null,null,2,1,1,null,1,3,null,null,1,null,null,1,null,null,null,0,null,"Hestebønne Øko"]
[null,null,null,null,null,null,null,null,null,null,null,null,null,null,15,"Hvidkløver Øko","hkg",5200,1.5,1.5,1.5,1.5,1.5,500,500,500,500,500,10,10,10,10,10,95,480,0,400,880,0,0,0,0,0,null,null,0.38,0,20,1.06,0,74.666666666666671,"Hvidkløver Øko",3241.2252320040129,3241.2252320040129,2064.3845216331506,3236.41689373297,3236.41689373297,3228.7429993777223,3228.7429993777223,2063.6519114688131,3272.9722373434947,3272.9722373434947,30,28,0,null,null,null,null,2,null,null,null,null,1,1,null,3,null,null,null,null,null,null,0,null,"Hvidkløver Øko"]
["N i husdyrgødning fra 1 DE kvæg",null,100,null,"kg N (total)",null,null,null,null,null,null,null,null,null,16,"Hybridrug (vinter)","hkg",100,60,75,75,86,91,4200,4200,5400,6200,6200,6,8,8,9,9,null,638,690,0,1328,153,156,171,170,181,null,null,0.28899999999999998,7.6499999999999999E-2,20,0.46750000000000003,1.02,0,"Hybridrug",4933,4933,7475,5743,5743,4099,4099,6392,4494,4494,10,5,20,8,7,6.5,110,1,3,3,3,3,2,2,2,1.6,null,null,null,null,2,2,30,"Rug","Hybridrug"]
[null,null,null,null,null,null,null,null,null,null,null,null,null,null,17,"Kløvergræs, slæt","ae",128,78,83,99,89,89,0,0,0,0,0,2,4,4,6,6,95,342,0,0,342,284,286,300,290,290,null,null,0.442,0,20,3,0,null,"kløvergræs, slæt",6443,6443,9223,6632,6632,6443,6443,9223,6632,6632,0,0,25,null,null,null,0,2,1,null,null,null,null,null,null,null,null,null,null,null,null,3,60,null,"Kløvergræs, slæt"]
["P i husdyrgødning fra 1 DE kvæg",null,17,null,"kg P",null,null,null,null,null,null,null,null,null,18,"Lucerne (tørret)","hkg",50,110,120,140,130,130,0,0,0,0,0,2,4,4,6,6,95,600,0,0,600,0,0,0,0,0,null,null,0.26,0,20,2.6,0,null,"Lucerne (tørret)",372,372,372,372,372,372,372,372,372,372,0,0,0,null,null,null,0,2,null,null,null,null,null,null,null,null,null,null,null,null,1,2,0,null,"Lucerne (tørret)"]
[null,null,null,null,null,null,null,null,null,null,null,null,null,null,19,"Læggekartofler","hkg",160,315,341,366,366,366,0,0,0,0,0,2,4,4,6,6,0,8400,4870,0,13270,136,126,146,121,121,7.5,null,5.1999999999999998E-2,0,20,0.50600000000000001,0,29.630498533724339,"Læggekartofler",0,0,18457,16256,16256,0,0,18457,16256,16256,0,0,0,null,null,null,0,2,1,1,1,null,3,null,null,null,null,1,1,null,12,1,0,null,"Læggekartofler"]
["K i husdyrgødning fra 1 DE kvæg",null,67,null,"kg K",null,null,null,null,null,null,null,null,null,20,"Majs, biogas","hkg ts",90,115.54,115.54,128.26000000000002,126.14,132.5,0,0,0,0,0,null,null,null,null,null,0,1600,500,0,2100,173,158,188,162,170,7.5,null,0.26,0,20,1.2,0,null,"Majs, biogas",4205,4205,6114,4396,4396,4205,4205,6117,4396,4396,0,0,22,null,null,null,0,2,1,1,1,null,3,3,null,2,1,null,null,null,2,1,41,null,"Majs, biogas"]
[null,null,null,null,null,null,null,null,null,null,null,null,null,null,21,"Majs, helsæd","ae",102,102,102,112,111,117,0,0,0,0,0,null,null,null,null,null,0,1600,500,370,2470,173,158,188,162,170,7.5,null,0.30420000000000003,0,20,1.4039999999999999,0,null,"Majs, helsæd",4205,4205,6114,4396,4396,4205,4205,6114,4396,4396,0,0,22,null,null,null,0,2,1,1,1,null,3,3,null,2,1,null,null,null,2,1,41,null,"Majs, helsæd"]
["Udnyttelse af N i svinegødning",null,75,null,"%",null,null,null,null,null,null,null,null,null,22,"Majs, kerne","hkg",119,70,70,78,77,81,0,0,0,0,0,null,null,null,null,null,null,1600,500,77,2177,173,158,188,162,170,7.5,null,0.27200000000000002,0,20,0.35,0,0,"Majs, kerne",6068,6068,8007,6377,6377,6068,6068,8007,6377,6377,0,0,22,28,28,14,122,1,1,1,1,null,3,3,null,1,1,null,null,null,2,1,41,"Majs","Majs, kerne"]
[null,null,null,null,null,null,null,null,null,null,null,null,null,null,23,"Markært","hkg",130,47,47,47,47,47,0,0,0,0,0,5,7,7,8,9,23,940,535,0,1475,0,0,0,0,0,null,2.5,0.4214,0.17,20,0.98040000000000005,0.63749999999999996,0,"Markært",3851,3851,5701,3960,3960,3851,3851,5701,3960,3960,16,14,0,null,null,null,101,2,1,1,1,1,2,2,null,1,null,null,null,null,2,1,0,null,"Markært"]
["Udnyttelse af N i kvæggødning",null,70,null,"%",null,null,null,null,null,null,null,null,null,24,"Markært Øko","hkg",305,26,26,28,30,30,0,0,0,0,0,5,7,7,8,9,23,1148,null,null,1148,0,0,0,0,0,null,null,0.4214,0.17,20,0.98040000000000005,0.63749999999999996,0,"Markært Øko",4603,4603,6568,4490,4490,4603,4603,6569,4490,4490,16,14,0,null,null,null,101,2,1,1,null,1,2,2,null,1,null,null,null,null,null,null,0,null,"Markært Øko"]
[null,null,null,null,null,null,null,null,null,null,null,null,null,null,25,"Rødkløver Øko","hkg",4000,2,2,2,2,2,500,500,500,500,500,10,10,10,10,10,95,405,null,400,805,0,0,0,0,0,null,null,0.4214,0.17,20,1.06,0,80,"Rødkløver Øko",2676.2402809129676,2676.2402809129676,4471.8951858622795,2699.7610563823096,2699.7610563823096,2666.0749844430616,2666.0749844430616,4470.342052313883,2729.8366902558519,2729.8366902558519,30,28,0,null,null,null,null,2,null,null,null,null,2,2,null,1,null,null,null,null,null,null,0,null,"Rødkløver Øko"]
["Halmpris",null,0.5,null,"kr. pr. kg",null,null,null,null,null,null,null,null,null,26,"Rødsvingel","hkg",925,8,8,8,8,8,0,0,5300,5300,5300,2,4,4,6,6,23,483,700,175,1358,150,150,150,150,150,null,5,0.29920000000000002,9.7500000000000003E-2,20,0.66,2.125,75,"Rødsvingel",6162,6162,7356,6162,6162,6162,6162,7356,6162,6162,30,28,0,null,null,null,0,2,null,null,null,1,2,2,2,2.5,null,null,null,null,3,2,0,null,"Rødsvingel"]
[null,null,null,null,null,null,null,null,null,null,null,null,null,null,27,"Smalbl. Lupin Øko","hkg",295,25,25,25,20,20,0,0,0,0,0,2,4,4,6,6,23,1260,null,null,1260,0,0,0,0,0,null,null,0.61,0,20,1.1499999999999999,0,0,"Smalbl. Lupin Øko",4089,4089,5988,4190,4190,4089,4089,5988,4190,4190,15,20.6,0,null,null,null,null,null,null,null,null,null,null,null,null,null,null,null,null,null,null,null,0,null,"Smalbl. Lupin Øko"]
["Årstal på udskrift",null,2018,null,null,null,null,null,null,null,null,null,null,null,28,"Spisekartofler Øko","hkg",220,150,150,200,200,200,0,0,0,0,0,2,4,4,6,6,0,4840,null,null,4840,105,105,105,105,105,null,null,0.06,0,20,0.40200000000000002,0,34.225000000000001,"Spisekartofler Øko",13543,13543,15987,13941,13941,13543,13543,15987,13941,13941,null,null,22,null,null,null,null,null,null,null,null,null,null,null,null,null,null,null,null,null,null,null,14,null,"Spisekartofler Øko"]
[null,null,null,null,null,null,null,null,null,null,null,null,null,null,29,"Spisekartofler","hkg",130,325,402,427,427,427,0,0,0,0,0,2,4,4,6,6,0,4800,3315,0,8115,169,170,190,165,165,7.5,null,0.06,0,20,0.40200000000000002,0,27.18,"Spisekartofler",12443,14658,18429,16263,16232,12443,14658,18429,16232,16232,0,0,0,null,null,null,0,2,1,1,1,null,3,null,null,null,null,1,1,null,10,1,0,null,"Spisekartofler"]
[null,null,null,null,null,null,null,null,null,null,null,null,null,null,30,"Sukkerroer","hkg",21.2,477,527,527,647,707,0,0,0,0,0,5,7,7,8,9,3,1755,1620,0,3375,135,125,140,127,133,7.5,null,0.04,0,20,0.22,0,2.5,"Sukkerroer",4311,4367.6470588235288,4367.6470588235288,6606,6606,4311.2903225806449,4367.6470588235288,4367.6470588235288,6606,6606,0,0,0,null,null,null,0,2,1,1,1,null,null,3,null,null,1,null,null,1,5,1,0,null,"Sukkerroer"]
[null,null,null,null,null,null,null,null,null,null,null,null,null,null,31,"Triticale (vinter)","hkg",100,46,58,58,66,70,3400,3400,4300,5000,5000,null,null,null,null,null,null,504,875,0,1379,177,176,191,186,195,null,null,0.35699999999999998,8.5000000000000006E-2,20,0.54400000000000004,1.02,0,"Triticale",4791,4791,7239,5444,5444,4123,4123,6384,4444,4444,10,5,20,8,7,6.5,113,1,3,3,3,3,2,2,2,1.2,null,null,null,null,2,2,30,"Triticale","Triticale"]
[null,null,null,null,null,null,null,null,null,null,null,null,null,null,32,"Triticale Øko","hkg",230,35,35,50,50,50,2600,2600,4100,4100,4100,null,null,null,null,null,null,799,null,null,799,105,105,105,105,105,null,null,0.35699999999999998,8.5000000000000006E-2,20,0.54400000000000004,1.02,null,"Triticale Øko",4281,4281,6930,4851,4851,3749,3749,6109,4004,4004,10,5,20,8,7,6.5,113,1,3,3,null,3,2,2,2,1.2,null,null,null,null,null,null,20,"Triticale","Triticale Øko"]
[null,null,null,null,null,null,null,null,null,null,null,null,null,null,33,"Vinterbyg","hkg",110,55,59,63,78,83,2600,2600,3000,3900,3900,null,null,null,null,null,0,448,595,0,1043,181,171,191,194,205,null,null,0.32300000000000001,6.8000000000000005E-2,20,0.39950000000000002,1.02,0,"Vinterbyg",4408,4408,6699,5022,5022,3906,3906,6114,4250,4250,10,5,20,8,7,6.5,103,1,3,3,3,3,1,1,1,1,null,null,null,null,2,1,30,"Byg","Vinterbyg"]
[null,null,null,null,null,null,null,null,null,null,null,null,null,null,34,"Vinterhvede 1. år","hkg",115,59,75,79,95,100,2900,2900,4000,4800,4800,-5,-7,-7,-9,-9,-23,405,980,0,1385,179,185,206,212,224,null,null,0.28899999999999998,7.6499999999999999E-2,20,0.40799999999999997,1.2749999999999999,0,"Vinterhvede 1. år",4833,4833,7406,5726,5726,4269,4269,6613,4767,4767,10,5,20,8,7,6.5,115,1,3,3,3,3,2,2,2,1.2,null,null,null,null,3,2,30,"Hvede","Vinterhvede 1. år"]
[null,null,null,null,null,null,null,null,null,null,null,null,null,null,35,"Vinterhvede 1. år Øko","hkg",235,27,27,50,50,50,2100,2100,2800,2800,2800,-5,-5,-5,-6,-6,-23,940,null,null,940,105,105,105,105,105,null,null,0.28899999999999998,7.6499999999999999E-2,20,0.40799999999999997,1.2749999999999999,null,"Vinterhvede 1. år Øko",4053,4053,6697,4622,4622,3625,3625,6108,4003,4003,10,5,20,8,7,6.5,115,1,3,3,null,3,2,2,2,1.2,null,null,null,null,null,null,20,"Hvede","Vinterhvede 1. år Øko"]
[null,null,null,null,null,null,null,null,null,null,null,null,null,null,36,"Vinterhvede e. korn","hkg",115,54,68,72,86,91,2600,2600,3600,4400,4400,null,null,null,null,null,null,459,980,0,1439,179,185,206,212,224,null,null,0.28899999999999998,7.6499999999999999E-2,20,0.40799999999999997,1.2749999999999999,0,"Vinterhvede e. korn",4709,4709,7250,5550,5550,4207,4207,6540,4674,4674,10,5,20,8,7,6.5,115,1,3,3,3,3,2,2,2,1.2,null,null,null,null,3,2,30,"Hvede","Vinterhvede e. korn"]
["Udskrift (side 2):",null,null,null,null,null,null,null,null,null,null,null,null,null,37,"Vinterhvede alle år","hkg",115,54,68,72,86,91,2600,2600,3600,4400,4400,null,null,null,null,null,null,459,980,0,1439,179,185,206,212,224,null,null,0.28899999999999998,7.6499999999999999E-2,20,0.40799999999999997,1.2749999999999999,0,"Vinterhvede, hvert år",4709,4709,7250,5550,5550,4207,4207,6540,4674,4674,10,5,20,8,7,6.5,115,1,3,3,3,3,2,2,2,1.2,null,null,null,null,3,2,30,"Hvede","Vinterhvede, hvert år"]
[null,null,null,null,null,null,null,null,null,null,null,null,null,null,38,"Vinterraps","hkg",270,30,38,38,43,45,0,0,0,0,0,5,7,7,9,9,23,644,1185,90,1919,195,207,207,215,218,null,null,0.81899999999999995,6.8000000000000005E-2,20,1.365,1.3939999999999999,2.6190476190476191,"Vinterraps",4253,4253,6459,4629,4629,4253,4253,6459,4629,4629,18,14,20,null,null,null,0,2,2,2,2,2,1,1,null,1,null,null,null,null,6,2,40,null,"Vinterraps"]
[{"$f":"\"Samlet økonomisk resultat for markbruget \"&Aar","v":"Samlet økonomisk resultat for markbruget 2018"},null,null,null,null,null,null,null,null,null,null,null,null,null,39,"Vinterraps Øko","hkg",700,20,20,23,23,23,1800,1800,2000,2200,2200,5,5,5,6,6,23,675,null,46,721,105,105,105,105,105,null,null,0.81899999999999995,6.8000000000000005E-2,20,1.365,1.3939999999999999,5,"Vinterraps Øko",4625,4625,6757,4850,4850,4110,4110,6242,4300,4300,18,14,20,null,null,null,0,2,2,2,null,2,1,1,null,1,null,null,null,null,null,null,35,null,"Vinterraps Øko"]
[null,null,null,null,null,null,null,null,null,null,null,null,null,null,40,"Vinterrug","hkg",105,50,63,62,75,79,3400,3400,4300,5400,5400,null,null,null,null,null,null,360,690,0,1050,141,142,156,156,166,null,null,0.28899999999999998,7.6499999999999999E-2,20,0.46750000000000003,1.02,0,"Vinterrug",4653,4653,7101,5452,5452,3985,3985,6246,4369,4369,10,5,20,8,7,6.5,110,1,3,3,3,3,2,2,2,1.6,null,null,null,null,2,2,30,"Rug","Vinterrug"]
[null,null,null,null,{"$f":"IF(OR($CR$16=$O$185,$CS$16=$O$185,$CT$16=$O$185),$P$185,\"\")","v":""},null,null,{"$f":"IF(OR(CR16=O186,CS16=O186,CT16=O186),P186,\"\")","v":""},null,null,{"$f":"IF(AND($E$174<>\"\",$H$174<>\"\"),\" Forskel\",\"\")","v":""},null,null,null,41,"Vinterrug Øko","hkg",235,37,37,48,57,57,2600,2600,3800,3800,3800,null,null,null,null,null,null,460,null,null,460,105,105,105,105,105,null,null,0.28899999999999998,7.6999999999999999E-2,20,0.46800000000000003,1.02,0,"Vinterrug Øko",4380,4380,6650,4992,4992,3848,3848,5880,4181,4181,10,5,20,8,7,6.5,110,1,3,3,null,3,2,2,2,1.6,null,null,null,null,null,null,20,"Rug","Vinterrug Øko"]
["Antal ha",null,{"$f":"IF(E174=\"\",\"\",C107)","v":""},{"$f":"IF(C175=\"\",\"\",\"ha\")","v":""},null,null,{"$f":"IF(H174=\"\",\"\",C127)","v":""},{"$f":"IF(G175=\"\",\"\",\"ha\")","v":""},null,null,{"$f":"IF(AND($E$174<>\"\",$H$174<>\"\"),G175-C175,\"\")","v":""},{"$f":"IF(K175=\"\",\"\",\"ha\")","v":""},null,null,42,"Vårbyg, foder","hkg",110,46,53,58,65,69,2400,2400,3100,3500,3500,null,null,null,null,null,null,360,390,0,750,142,137,160,145,151,null,2.5,0.32300000000000001,7.6499999999999999E-2,20,0.39950000000000002,1.02,0,"Vårbyg, foder",4126,4126,6257,4663,4663,3665,3665,5651,3974,3974,10,5,22,8,7,6.5,102,1,1,1,1,1,2,2,2,1,null,null,null,null,2,1,30,"Byg","Vårbyg, foder"]
[null,null,null,null,null,null,null,null,null,null,null,null,null,null,43,"Vårbyg, foder Øko","hkg",235,27,27,40,40,40,1600,1600,1900,1900,1900,null,null,null,null,null,null,460,null,null,460,105,105,105,105,105,null,2.5,0.32,0.08,20,0.4,1.02,0,"Vårbyg, foder Øko",4169,4169,6308,4632,4632,3844,3844,5906,4215,4215,10,5,22,8,7,6.5,102,1,1,1,null,1,2,2,2,1,null,null,null,null,null,null,20,"Byg","Vårbyg, foder Øko"]
["Udbytte, kerne/frø",{"$f":"IF($E$174=\"\",\"\",IF(CR$16=O$185,C32,IF(CS$16=O$185,G32,IF(CT$16=O$185,K32,\"\")))*C$107)","v":""},null,{"$f":"IF(B177=\"\",\"\",\"kr.\")","v":""},null,{"$f":"IF($H$174=\"\",\"\",IF(CR$16=O$186,C32,IF(CS$16=O$186,G32,IF(CT$16=O$186,K32,\"\")))*C$127)","v":""},null,{"$f":"IF(F177=\"\",\"\",\"kr.\")","v":""},null,{"$f":"IF(AND($E$174<>\"\",$H$174<>\"\"),F177-B177,\"\")","v":""},null,{"$f":"IF(J177=\"\",\"\",\"kr.\")","v":""},null,null,44,"Vårbyg, malt","hkg",130,45,52,57,64,68,2400,2400,3100,3500,3500,null,null,null,null,null,null,420,390,0,810,142,137,160,145,151,null,2.5,0.32300000000000001,7.6499999999999999E-2,20,0.39950000000000002,1.02,0,"Vårbyg, malt",4126,4126,6257,4663,4663,3665,3665,5651,3974,3974,10,5,22,null,null,null,0,2,1,1,1,1,2,2,2,1,null,null,null,null,2,1,0,null,"Vårbyg, malt"]
["Udbytte, halm",{"$f":"IF($E$174=\"\",\"\",IF(HalmJa=2,\"\",IF(CR$16=O$185,C33,IF(CS$16=O$185,G33,IF(CT$16=O$185,K33,\"\")))*C$107))","v":""},null,{"$f":"IF(B178=\"\",\"\",\"kr.\")","v":""},null,{"$f":"IF($H$174=\"\",\"\",IF(HalmJa=2,\"\",IF(CR$16=O$186,C33,IF(CS$16=O$186,G33,IF(CT$16=O$186,K33,\"\")))*C$127))","v":""},null,{"$f":"IF(F178=\"\",\"\",\"kr.\")","v":""},null,{"$f":"IF(AND($E$174<>\"\",$H$174<>\"\",HalmJa=1),F178-B178,\"\")","v":""},null,{"$f":"IF(J178=\"\",\"\",\"kr.\")","v":""},null,null,45,"Vårbyg, malt Øko","hkg",255,27,27,35,40,40,1600,1600,1900,1900,1900,null,null,null,null,null,null,460,null,null,460,55,55,55,55,55,null,2.5,0.32,0.08,20,0.4,1.02,0,"Vårbyg, malt Øko",4169,4126,6257,4632,4632,3844,3844,5906,4215,4215,10,5,0,8,7,6.5,0,1,1,1,null,1,2,2,2,1,null,null,null,null,null,null,0,"Byg","Vårbyg, malt Øko"]
["Udbytte i alt",{"$f":"IF($E$174=\"\",\"\",IF(CR$16=O$185,C36,IF(CS$16=O$185,G36,IF(CT$16=O$185,K36,\"\")))*C$107)","v":""},null,{"$f":"IF(B179=\"\",\"\",\"kr.\")","v":""},null,{"$f":"IF($H$174=\"\",\"\",IF(CR$16=O$186,C36,IF(CS$16=O$186,G36,IF(CT$16=O$186,K36,\"\")))*C$127)","v":""},null,{"$f":"IF(F179=\"\",\"\",\"kr.\")","v":""},null,{"$f":"IF(AND($E$174<>\"\",$H$174<>\"\"),F179-B179,\"\")","v":""},null,{"$f":"IF(J179=\"\",\"\",\"kr.\")","v":""},null,null,46,"Vårbyg/ært Øko","hkg",270,29,29,35,41,41,1600,1600,1900,1900,1900,null,null,null,null,null,null,1058,null,null,1058,0,0,0,0,0,null,null,null,null,20,null,null,null,"Vårbyg/ært Øko",2358,2358,4378,2445,2445,2508,2508,4528,2595,2595,14.6,14.6,0,null,null,null,null,2,1,1,null,1,2,2,null,1,null,null,null,null,null,null,20,null,"Vårbyg/ært Øko"]
[null,null,null,null,null,null,null,null,null,null,null,null,null,null,47,"Vårhvede","hkg",115,41,47,52,58,62,1800,1800,2400,2700,2700,null,null,null,null,null,null,561,390,0,951,165,159,182,166,172,null,2.5,0.32300000000000001,7.6499999999999999E-2,20,0.39950000000000002,1.02,0,"Vårhvede",3950,3950,6062,4424,4424,3614,3614,5601,3901,3901,10,5,22,8,7,6.5,115,1,1,1,1,1,2,2,2,1,null,null,null,null,2,1,30,"Hvede","Vårhvede"]
["Udsæd",{"$f":"IF($E$174=\"\",\"\",IF(CR$16=O$185,C38,IF(CS$16=O$185,G38,IF(CT$16=O$185,K38,\"\")))*C$107)","v":""},null,{"$f":"IF(B181=\"\",\"\",\"kr.\")","v":""},null,{"$f":"IF($H$174=\"\",\"\",IF(CR$16=O$186,C38,IF(CS$16=O$186,G38,IF(CT$16=O$186,K38,\"\")))*C$127)","v":""},null,{"$f":"IF(F181=\"\",\"\",\"kr.\")","v":""},null,{"$f":"IF(AND($E$174<>\"\",$H$174<>\"\"),F181-B181,\"\")","v":""},null,{"$f":"IF(J181=\"\",\"\",\"kr.\")","v":""},null,null,48,"Vårhvede Øko","hkg",235,27,27,38,38,38,1300,1300,1500,1500,1500,null,null,null,null,null,null,1058,null,null,1058,105,105,105,105,105,null,2.5,0.32,0.08,20,0.4,1.02,0,"Vårhvede Øko",4095,4095,6258,4503,4503,3844,3844,5950,4184,4184,10,5,22,8,7,6.5,115,1,1,1,null,1,2,2,2,1,null,null,null,null,null,null,20,"Hvede","Vårhvede Øko"]
["Gødning",{"$f":"IF($E$174=\"\",\"\",IF(CR$16=O$185,C39,IF(CS$16=O$185,G39,IF(CT$16=O$185,K39,\"\")))*C$107)","v":""},null,{"$f":"IF(B182=\"\",\"\",\"kr.\")","v":""},null,{"$f":"IF($H$174=\"\",\"\",IF(CR$16=O$186,C39,IF(CS$16=O$186,G39,IF(CT$16=O$186,K39,\"\")))*C$127)","v":""},null,{"$f":"IF(F182=\"\",\"\",\"kr.\")","v":""},null,{"$f":"IF(AND($E$174<>\"\",$H$174<>\"\"),F182-B182,\"\")","v":""},null,{"$f":"IF(J182=\"\",\"\",\"kr.\")","v":""},null,null,49,"Vårhvede/ært Øko","hkg",270,29,29,34,36,36,1300,1300,1500,1500,1500,null,null,null,null,null,null,1107,null,null,1107,55,55,55,55,55,null,null,null,null,20,null,null,null,"Vårhvede/ært Øko",2849,2850,2851,2852,2853,3004,3005,3006,3007,3008,14.6,14.6,22,null,null,null,null,null,1,1,1,1,2,2,null,1,null,null,null,null,null,null,20,null,"Vårhvede/ært Øko"]
["Planteværn",{"$f":"IF($E$174=\"\",\"\",IF(CR$16=O$185,C40,IF(CS$16=O$185,G40,IF(CT$16=O$185,K40,\"\")))*C$107)","v":""},null,{"$f":"IF(B183=\"\",\"\",\"kr.\")","v":""},null,{"$f":"IF($H$174=\"\",\"\",IF(CR$16=O$186,C40,IF(CS$16=O$186,G40,IF(CT$16=O$186,K40,\"\")))*C$127)","v":""},null,{"$f":"IF(F183=\"\",\"\",\"kr.\")","v":""},null,{"$f":"IF(AND($E$174<>\"\",$H$174<>\"\"),F183-B183,\"\")","v":""},null,{"$f":"IF(J183=\"\",\"\",\"kr.\")","v":""},null,null,50,"Vårtriticale Øko","hkg",230,32,32,38,38,38,1500,1500,2100,2100,2100,null,null,null,null,null,null,945,null,null,945,105,105,105,105,105,null,2.5,0.32,7.0000000000000007E-2,20,0.4,1.02,0,"Vårtriticale Øko",3006.6297039638735,3006.6297039638735,4924.2339181286552,3080.3598326359834,3080.3598326359834,3495.3721973094171,3495.3721973094171,5312.2968989280243,3792.7335640138408,3792.7335640138408,10,5,22,8,7,6.5,113,1,1,1,null,1,2,2,2,1,null,null,null,null,null,null,20,"Triticale","Vårtriticale Øko"]
["Diverse",{"$f":"IF($E$174=\"\",\"\",IF(CR$16=O$185,C41,IF(CS$16=O$185,G41,IF(CT$16=O$185,K41,\"\")))*C$107)","v":""},null,{"$f":"IF(B184=\"\",\"\",\"kr.\")","v":""},null,{"$f":"IF($H$174=\"\",\"\",IF(CR$16=O$186,C41,IF(CS$16=O$186,G41,IF(CT$16=O$186,K41,\"\")))*C$127)","v":""},null,{"$f":"IF(F184=\"\",\"\",\"kr.\")","v":""},null,{"$f":"IF(AND($E$174<>\"\",$H$174<>\"\"),F184-B184,\"\")","v":""},null,{"$f":"IF(J184=\"\",\"\",\"kr.\")","v":""},null,null,51,"Vårraps  ","hkg",270,19,22,24,25,25,0,0,0,0,0,5,7,7,9,9,23,644,500,40,1184,137,126,144,121,122,null,2.5,0.81899999999999995,6.8000000000000005E-2,20,1.365,1.3939999999999999,4.0740740740740744,"Vårraps",3404,3404,5570,3663,3663,3404,3404,5570,3663,3663,18,14,22,null,null,null,0,2,1,1,1,1,2,2,null,1,null,null,null,null,2,1,34,null,"Vårraps"]
["Stykomkostninger i alt",{"$f":"IF($E$174=\"\",\"\",IF(CR$16=O$185,C42,IF(CS$16=O$185,G42,IF(CT$16=O$185,K42,\"\")))*C$107)","v":""},null,{"$f":"IF(B185=\"\",\"\",\"kr.\")","v":""},null,{"$f":"IF($H$174=\"\",\"\",IF(CR$16=O$186,C42,IF(CS$16=O$186,G42,IF(CT$16=O$186,K42,\"\")))*C$127)","v":""},null,{"$f":"IF(F185=\"\",\"\",\"kr.\")","v":""},null,{"$f":"IF(AND($E$174<>\"\",$H$174<>\"\"),F185-B185,\"\")","v":""},null,{"$f":"IF(J185=\"\",\"\",\"kr.\")","v":""},null,null,52,"Sædskifte 1","hkg",{"$f":"(IF(H93<>\"\",H93,VLOOKUP($CR$36,_Afg07,R131))*$C$93*IF($E$93<>\"\",$E$93,VLOOKUP($CR$36,_Afg07,Udbyttenr))+IF(H95<>\"\",H95,VLOOKUP($CR$38,_Afg07,R131))*$C$95*IF($E$95<>\"\",$E$95,VLOOKUP($CR$38,_Afg07,Udbyttenr))+IF(H97<>\"\",H97,VLOOKUP($CR$40,_Afg07,R131))*$C$97*IF($E$97<>\"\",$E$97,VLOOKUP($CR$40,_Afg07,Udbyttenr))+IF(H99<>\"\",H99,VLOOKUP($CR$42,_Afg07,R131))*$C$99*IF($E$99<>\"\",$E$99,VLOOKUP($CR$42,_Afg07,Udbyttenr))+IF(H101<>\"\",H101,VLOOKUP($CR$44,_Afg07,R131))*$C$101*IF($E$101<>\"\",$E$101,VLOOKUP($CR$44,_Afg07,Udbyttenr))+IF(H103<>\"\",H103,VLOOKUP($CR$46,_Afg07,R131))*$C$103*IF($E$103<>\"\",$E$103,VLOOKUP($CR$46,_Afg07,Udbyttenr))+IF(H105<>\"\",H105,VLOOKUP($CR$48,_Afg07,R131))*$C$105*IF($E$105<>\"\",$E$105,VLOOKUP($CR$48,_Afg07,Udbyttenr)))/($C$107*VLOOKUP($O$185,_Afg07,Udbyttenr))","v":{"$error":"#DIV/0!"}},{"$f":"(IF($E$93<>\"\",$E$93,VLOOKUP($CR$36,_Afg07,S131))*$C$93+IF($E$95<>\"\",$E$95,VLOOKUP($CR$38,_Afg07,S131))*$C$95+IF($E$97<>\"\",$E$97,VLOOKUP($CR$40,_Afg07,S131))*$C$97+IF($E$99<>\"\",$E$99,VLOOKUP($CR$42,_Afg07,S131))*$C$99+IF($E$101<>\"\",$E$101,VLOOKUP($CR$44,_Afg07,S131))*$C$101+IF($E$103<>\"\",$E$103,VLOOKUP($CR$46,_Afg07,S131))*$C$103+IF($E$105<>\"\",$E$105,VLOOKUP($CR$48,_Afg07,S131))*$C$105)/$C$107","v":{"$error":"#DIV/0!"}},{"$f":"(IF($E$93<>\"\",$E$93,VLOOKUP($CR$36,_Afg07,T131))*$C$93+IF($E$95<>\"\",$E$95,VLOOKUP($CR$38,_Afg07,T131))*$C$95+IF($E$97<>\"\",$E$97,VLOOKUP($CR$40,_Afg07,T131))*$C$97+IF($E$99<>\"\",$E$99,VLOOKUP($CR$42,_Afg07,T131))*$C$99+IF($E$101<>\"\",$E$101,VLOOKUP($CR$44,_Afg07,T131))*$C$101+IF($E$103<>\"\",$E$103,VLOOKUP($CR$46,_Afg07,T131))*$C$103+IF($E$105<>\"\",$E$105,VLOOKUP($CR$48,_Afg07,T131))*$C$105)/$C$107","v":{"$error":"#DIV/0!"}},{"$f":"(IF($E$93<>\"\",$E$93,VLOOKUP($CR$36,_Afg07,U131))*$C$93+IF($E$95<>\"\",$E$95,VLOOKUP($CR$38,_Afg07,U131))*$C$95+IF($E$97<>\"\",$E$97,VLOOKUP($CR$40,_Afg07,U131))*$C$97+IF($E$99<>\"\",$E$99,VLOOKUP($CR$42,_Afg07,U131))*$C$99+IF($E$101<>\"\",$E$101,VLOOKUP($CR$44,_Afg07,U131))*$C$101+IF($E$103<>\"\",$E$103,VLOOKUP($CR$46,_Afg07,U131))*$C$103+IF($E$105<>\"\",$E$105,VLOOKUP($CR$48,_Afg07,U131))*$C$105)/$C$107","v":{"$error":"#DIV/0!"}},{"$f":"(IF($E$93<>\"\",$E$93,VLOOKUP($CR$36,_Afg07,V131))*$C$93+IF($E$95<>\"\",$E$95,VLOOKUP($CR$38,_Afg07,V131))*$C$95+IF($E$97<>\"\",$E$97,VLOOKUP($CR$40,_Afg07,V131))*$C$97+IF($E$99<>\"\",$E$99,VLOOKUP($CR$42,_Afg07,V131))*$C$99+IF($E$101<>\"\",$E$101,VLOOKUP($CR$44,_Afg07,V131))*$C$101+IF($E$103<>\"\",$E$103,VLOOKUP($CR$46,_Afg07,V131))*$C$103+IF($E$105<>\"\",$E$105,VLOOKUP($CR$48,_Afg07,V131))*$C$105)/$C$107","v":{"$error":"#DIV/0!"}},{"$f":"(IF($E$93<>\"\",$E$93,VLOOKUP($CR$36,_Afg07,W131))*$C$93+IF($E$95<>\"\",$E$95,VLOOKUP($CR$38,_Afg07,W131))*$C$95+IF($E$97<>\"\",$E$97,VLOOKUP($CR$40,_Afg07,W131))*$C$97+IF($E$99<>\"\",$E$99,VLOOKUP($CR$42,_Afg07,W131))*$C$99+IF($E$101<>\"\",$E$101,VLOOKUP($CR$44,_Afg07,W131))*$C$101+IF($E$103<>\"\",$E$103,VLOOKUP($CR$46,_Afg07,W131))*$C$103+IF($E$105<>\"\",$E$105,VLOOKUP($CR$48,_Afg07,W131))*$C$105)/$C$107","v":{"$error":"#DIV/0!"}},{"$f":"(VLOOKUP($CR$36,_Afg07,X131)*$C$93+VLOOKUP($CR$38,_Afg07,X131)*$C$95+VLOOKUP($CR$40,_Afg07,X131)*$C$97+VLOOKUP($CR$42,_Afg07,X131)*$C$99+VLOOKUP($CR$44,_Afg07,X131)*$C$101+VLOOKUP($CR$46,_Afg07,X131)*$C$103+VLOOKUP($CR$48,_Afg07,X131)*$C$105)/$C$107","v":{"$error":"#DIV/0!"}},{"$error":"#DIV/0!"},{"$error":"#DIV/0!"},{"$error":"#DIV/0!"},{"$error":"#DIV/0!"},{"$error":"#DIV/0!"},{"$error":"#DIV/0!"},{"$error":"#DIV/0!"},{"$error":"#DIV/0!"},{"$error":"#DIV/0!"},{"$error":"#DIV/0!"},{"$error":"#DIV/0!"},{"$error":"#DIV/0!"},{"$error":"#DIV/0!"},{"$error":"#DIV/0!"},{"$error":"#DIV/0!"},{"$error":"#DIV/0!"},{"$error":"#DIV/0!"},{"$error":"#DIV/0!"},{"$error":"#DIV/0!"},{"$error":"#DIV/0!"},{"$error":"#DIV/0!"},{"$f":"(VLOOKUP($CR$36,_Afg07,AT131)*$C$93*IF($E$93<>\"\",$E$93,VLOOKUP($CR$36,_Afg07,Udbyttenr))+VLOOKUP($CR$38,_Afg07,AT131)*$C$95*IF($E$95<>\"\",$E$95,VLOOKUP($CR$38,_Afg07,Udbyttenr))+VLOOKUP($CR$40,_Afg07,AT131)*$C$97*IF($E$97<>\"\",$E$97,VLOOKUP($CR$40,_Afg07,Udbyttenr))+VLOOKUP($CR$42,_Afg07,AT131)*$C$99*IF($E$99<>\"\",$E$99,VLOOKUP($CR$42,_Afg07,Udbyttenr))+VLOOKUP($CR$44,_Afg07,AT131)*$C$101*IF($E$101<>\"\",$E$101,VLOOKUP($CR$44,_Afg07,Udbyttenr))+VLOOKUP($CR$46,_Afg07,AT131)*$C$103*IF($E$103<>\"\",$E$103,VLOOKUP($CR$46,_Afg07,Udbyttenr))+VLOOKUP($CR$48,_Afg07,AT131)*$C$105*IF($E$105<>\"\",$E$105,VLOOKUP($CR$48,_Afg07,Udbyttenr)))/($C$107*VLOOKUP($O$185,_Afg07,Udbyttenr))","v":{"$error":"#DIV/0!"}},{"$f":"(VLOOKUP($CR$36,_Afg07,AU131)*$C$93*VLOOKUP($CR$36,_Afg07,Halmnr)+VLOOKUP($CR$38,_Afg07,AU131)*$C$95*VLOOKUP($CR$38,_Afg07,Halmnr)+VLOOKUP($CR$40,_Afg07,AU131)*$C$97*VLOOKUP($CR$40,_Afg07,Halmnr)+VLOOKUP($CR$42,_Afg07,AU131)*$C$99*VLOOKUP($CR$42,_Afg07,Halmnr)+VLOOKUP($CR$44,_Afg07,AU131)*$C$101*VLOOKUP($CR$44,_Afg07,Halmnr)+VLOOKUP($CR$46,_Afg07,AU131)*$C$103*VLOOKUP($CR$46,_Afg07,Halmnr)+VLOOKUP($CR$48,_Afg07,AU131)*$C$105*VLOOKUP($CR$48,_Afg07,Halmnr))/($C$107*VLOOKUP($O$185,_Afg07,Halmnr))","v":{"$error":"#VALUE!"}},{"$f":"(VLOOKUP($CR$36,_Afg07,AV131)*$C$93+VLOOKUP($CR$38,_Afg07,AV131)*$C$95+VLOOKUP($CR$40,_Afg07,AV131)*$C$97+VLOOKUP($CR$42,_Afg07,AV131)*$C$99+VLOOKUP($CR$44,_Afg07,AV131)*$C$101+VLOOKUP($CR$46,_Afg07,AV131)*$C$103+VLOOKUP($CR$48,_Afg07,AV131)*$C$105)/$C$107","v":{"$error":"#DIV/0!"}},{"$f":"(VLOOKUP($CR$36,_Afg07,AW131)*$C$93*IF($E$93<>\"\",$E$93,VLOOKUP($CR$36,_Afg07,Udbyttenr))+VLOOKUP($CR$38,_Afg07,AW131)*$C$95*IF($E$95<>\"\",$E$95,VLOOKUP($CR$38,_Afg07,Udbyttenr))+VLOOKUP($CR$40,_Afg07,AW131)*$C$97*IF($E$97<>\"\",$E$97,VLOOKUP($CR$40,_Afg07,Udbyttenr))+VLOOKUP($CR$42,_Afg07,AW131)*$C$99*IF($E$99<>\"\",$E$99,VLOOKUP($CR$42,_Afg07,Udbyttenr))+VLOOKUP($CR$44,_Afg07,AW131)*$C$101*IF($E$101<>\"\",$E$101,VLOOKUP($CR$44,_Afg07,Udbyttenr))+VLOOKUP($CR$46,_Afg07,AW131)*$C$103*IF($E$103<>\"\",$E$103,VLOOKUP($CR$46,_Afg07,Udbyttenr))+VLOOKUP($CR$48,_Afg07,AW131)*$C$105*IF($E$105<>\"\",$E$105,VLOOKUP($CR$48,_Afg07,Udbyttenr)))/($C$107*VLOOKUP($O$185,_Afg07,Udbyttenr))","v":{"$error":"#DIV/0!"}},{"$f":"(VLOOKUP($CR$36,_Afg07,AX131)*$C$93*VLOOKUP($CR$36,_Afg07,Halmnr)+VLOOKUP($CR$38,_Afg07,AX131)*$C$95*VLOOKUP($CR$38,_Afg07,Halmnr)+VLOOKUP($CR$40,_Afg07,AX131)*$C$97*VLOOKUP($CR$40,_Afg07,Halmnr)+VLOOKUP($CR$42,_Afg07,AX131)*$C$99*VLOOKUP($CR$42,_Afg07,Halmnr)+VLOOKUP($CR$44,_Afg07,AX131)*$C$101*VLOOKUP($CR$44,_Afg07,Halmnr)+VLOOKUP($CR$46,_Afg07,AX131)*$C$103*VLOOKUP($CR$46,_Afg07,Halmnr)+VLOOKUP($CR$48,_Afg07,AX131)*$C$105*VLOOKUP($CR$48,_Afg07,Halmnr))/($C$107*VLOOKUP($O$185,_Afg07,Halmnr))","v":{"$error":"#VALUE!"}},{"$f":"(VLOOKUP($CR$36,_Afg07,AY131)*$C$93*IF($E$93<>\"\",$E$93,VLOOKUP($CR$36,_Afg07,Udbyttenr))+VLOOKUP($CR$38,_Afg07,AY131)*$C$95*IF($E$95<>\"\",$E$95,VLOOKUP($CR$38,_Afg07,Udbyttenr))+VLOOKUP($CR$40,_Afg07,AY131)*$C$97*IF($E$97<>\"\",$E$97,VLOOKUP($CR$40,_Afg07,Udbyttenr))+VLOOKUP($CR$42,_Afg07,AY131)*$C$99*IF($E$99<>\"\",$E$99,VLOOKUP($CR$42,_Afg07,Udbyttenr))+VLOOKUP($CR$44,_Afg07,AY131)*$C$101*IF($E$101<>\"\",$E$101,VLOOKUP($CR$44,_Afg07,Udbyttenr))+VLOOKUP($CR$46,_Afg07,AY131)*$C$103*IF($E$103<>\"\",$E$103,VLOOKUP($CR$46,_Afg07,Udbyttenr))+VLOOKUP($CR$48,_Afg07,AY131)*$C$105*IF($E$105<>\"\",$E$105,VLOOKUP($CR$48,_Afg07,Udbyttenr)))/($C$107*VLOOKUP($O$185,_Afg07,Udbyttenr))","v":{"$error":"#DIV/0!"}},"Sædskifte 1",{"$f":"(VLOOKUP($CR$36,_Afg07,BA131)*$C$93+VLOOKUP($CR$38,_Afg07,BA131)*$C$95+VLOOKUP($CR$40,_Afg07,BA131)*$C$97+VLOOKUP($CR$42,_Afg07,BA131)*$C$99+VLOOKUP($CR$44,_Afg07,BA131)*$C$101+VLOOKUP($CR$46,_Afg07,BA131)*$C$103+VLOOKUP($CR$48,_Afg07,BA131)*$C$105)/$C$107","v":{"$error":"#DIV/0!"}},{"$error":"#DIV/0!"},{"$error":"#DIV/0!"},{"$error":"#DIV/0!"},{"$error":"#DIV/0!"},{"$error":"#DIV/0!"},{"$error":"#DIV/0!"},{"$error":"#DIV/0!"},{"$error":"#DIV/0!"},{"$error":"#DIV/0!"},{"$f":"(IF(AND(VLOOKUP($CR$36,_Afg07,$BR$131)=1,$CU$3=4),0,VLOOKUP($CR$36,_Afg07,BK131)*$C$93*IF($E$93<>\"\",$E$93,VLOOKUP($CR$36,_Afg07,Udbyttenr)))+IF(AND(VLOOKUP($CR$38,_Afg07,$BR$131)=1,$CU$3=4),0,VLOOKUP($CR$38,_Afg07,BK131)*$C$95*IF($E$95<>\"\",$E$95,VLOOKUP($CR$38,_Afg07,Udbyttenr)))+IF(AND(VLOOKUP($CR$40,_Afg07,$BR$131)=1,$CU$3=4),0,VLOOKUP($CR$40,_Afg07,BK131)*$C$97*IF($E$97<>\"\",$E$97,VLOOKUP($CR$40,_Afg07,Udbyttenr)))+IF(AND(VLOOKUP($CR$42,_Afg07,$BR$131)=1,$CU$3=4),0,VLOOKUP($CR$42,_Afg07,BK131)*$C$99*IF($E$99<>\"\",$E$99,VLOOKUP($CR$42,_Afg07,Udbyttenr)))+IF(AND(VLOOKUP($CR$44,_Afg07,$BR$131)=1,$CU$3=4),0,VLOOKUP($CR$44,_Afg07,BK131)*$C$101*IF($E$101<>\"\",$E$101,VLOOKUP($CR$44,_Afg07,Udbyttenr)))+IF(AND(VLOOKUP($CR$46,_Afg07,$BR$131)=1,$CU$3=4),0,VLOOKUP($CR$46,_Afg07,BK131)*$C$103*IF($E$103<>\"\",$E$103,VLOOKUP($CR$46,_Afg07,Udbyttenr)))+IF(AND(VLOOKUP($CR$48,_Afg07,$BR$131)=1,$CU$3=4),0,VLOOKUP($CR$48,_Afg07,BK131)*$C$105*IF($E$105<>\"\",$E$105,VLOOKUP($CR$48,_Afg07,Udbyttenr))))/($C$107*VLOOKUP($O$185,_Afg07,Udbyttenr))","v":{"$error":"#DIV/0!"}},{"$f":"(IF(AND(VLOOKUP($CR$36,_Afg07,$BR$131)=1,$CU$3=4),0,VLOOKUP($CR$36,_Afg07,BL131)*$C$93*IF($E$93<>\"\",$E$93,VLOOKUP($CR$36,_Afg07,Udbyttenr)))+IF(AND(VLOOKUP($CR$38,_Afg07,$BR$131)=1,$CU$3=4),0,VLOOKUP($CR$38,_Afg07,BL131)*$C$95*IF($E$95<>\"\",$E$95,VLOOKUP($CR$38,_Afg07,Udbyttenr)))+IF(AND(VLOOKUP($CR$40,_Afg07,$BR$131)=1,$CU$3=4),0,VLOOKUP($CR$40,_Afg07,BL131)*$C$97*IF($E$97<>\"\",$E$97,VLOOKUP($CR$40,_Afg07,Udbyttenr)))+IF(AND(VLOOKUP($CR$42,_Afg07,$BR$131)=1,$CU$3=4),0,VLOOKUP($CR$42,_Afg07,BL131)*$C$99*IF($E$99<>\"\",$E$99,VLOOKUP($CR$42,_Afg07,Udbyttenr)))+IF(AND(VLOOKUP($CR$44,_Afg07,$BR$131)=1,$CU$3=4),0,VLOOKUP($CR$44,_Afg07,BL131)*$C$101*IF($E$101<>\"\",$E$101,VLOOKUP($CR$44,_Afg07,Udbyttenr)))+IF(AND(VLOOKUP($CR$46,_Afg07,$BR$131)=1,$CU$3=4),0,VLOOKUP($CR$46,_Afg07,BL131)*$C$103*IF($E$103<>\"\",$E$103,VLOOKUP($CR$46,_Afg07,Udbyttenr)))+IF(AND(VLOOKUP($CR$48,_Afg07,$BR$131)=1,$CU$3=4),0,VLOOKUP($CR$48,_Afg07,BL131)*$C$105*IF($E$105<>\"\",$E$105,VLOOKUP($CR$48,_Afg07,Udbyttenr))))/($C$107*VLOOKUP($O$185,_Afg07,Udbyttenr))","v":{"$error":"#DIV/0!"}},{"$f":"(IF(AND(VLOOKUP($CR$36,_Afg07,$BR$131)=1,$CU$3=4),0,VLOOKUP($CR$36,_Afg07,BM131)*$C$93*IF($E$93<>\"\",$E$93,VLOOKUP($CR$36,_Afg07,Udbyttenr)))+IF(AND(VLOOKUP($CR$38,_Afg07,$BR$131)=1,$CU$3=4),0,VLOOKUP($CR$38,_Afg07,BM131)*$C$95*IF($E$95<>\"\",$E$95,VLOOKUP($CR$38,_Afg07,Udbyttenr)))+IF(AND(VLOOKUP($CR$40,_Afg07,$BR$131)=1,$CU$3=4),0,VLOOKUP($CR$40,_Afg07,BM131)*$C$97*IF($E$97<>\"\",$E$97,VLOOKUP($CR$40,_Afg07,Udbyttenr)))+IF(AND(VLOOKUP($CR$42,_Afg07,$BR$131)=1,$CU$3=4),0,VLOOKUP($CR$42,_Afg07,BM131)*$C$99*IF($E$99<>\"\",$E$99,VLOOKUP($CR$42,_Afg07,Udbyttenr)))+IF(AND(VLOOKUP($CR$44,_Afg07,$BR$131)=1,$CU$3=4),0,VLOOKUP($CR$44,_Afg07,BM131)*$C$101*IF($E$101<>\"\",$E$101,VLOOKUP($CR$44,_Afg07,Udbyttenr)))+IF(AND(VLOOKUP($CR$46,_Afg07,$BR$131)=1,$CU$3=4),0,VLOOKUP($CR$46,_Afg07,BM131)*$C$103*IF($E$103<>\"\",$E$103,VLOOKUP($CR$46,_Afg07,Udbyttenr)))+IF(AND(VLOOKUP($CR$48,_Afg07,$BR$131)=1,$CU$3=4),0,VLOOKUP($CR$48,_Afg07,BM131)*$C$105*IF($E$105<>\"\",$E$105,VLOOKUP($CR$48,_Afg07,Udbyttenr))))/($C$107*VLOOKUP($O$185,_Afg07,Udbyttenr))","v":{"$error":"#DIV/0!"}},{"$f":"(IF(VLOOKUP($CR$36,_Afg07,$BR$131)=1,VLOOKUP($CR$36,_Afg07,BN131)*$C$93*IF($E$93<>\"\",$E$93,VLOOKUP($CR$36,_Afg07,Udbyttenr)),0)+IF(VLOOKUP($CR$38,_Afg07,$BR$131)=1,VLOOKUP($CR$38,_Afg07,BN131)*$C$95*IF($E$95<>\"\",$E$95,VLOOKUP($CR$38,_Afg07,Udbyttenr)),0)+IF(VLOOKUP($CR$40,_Afg07,$BR$131)=1,VLOOKUP($CR$40,_Afg07,BN131)*$C$97*IF($E$97<>\"\",$E$97,VLOOKUP($CR$40,_Afg07,Udbyttenr)),0)+IF(VLOOKUP($CR$42,_Afg07,$BR$131)=1,VLOOKUP($CR$42,_Afg07,BN131)*$C$99*IF($E$99<>\"\",$E$99,VLOOKUP($CR$42,_Afg07,Udbyttenr)),0)+IF(VLOOKUP($CR$44,_Afg07,$BR$131)=1,VLOOKUP($CR$44,_Afg07,BN131)*$C$101*IF($E$101<>\"\",$E$101,VLOOKUP($CR$44,_Afg07,Udbyttenr)),0)+IF(VLOOKUP($CR$46,_Afg07,$BR$131)=1,VLOOKUP($CR$46,_Afg07,BN131)*$C$103*IF($E$103<>\"\",$E$103,VLOOKUP($CR$46,_Afg07,Udbyttenr)),0)+IF(VLOOKUP($CR$48,_Afg07,$BR$131)=1,VLOOKUP($CR$48,_Afg07,BN131)*$C$105*IF($E$105<>\"\",$E$105,VLOOKUP($CR$48,_Afg07,Udbyttenr)),0))/($CU$50)","v":{"$error":"#DIV/0!"}},{"$f":"(IF(VLOOKUP($CR$36,_Afg07,$BR$131)=1,VLOOKUP($CR$36,_Afg07,BO131)*$C$93*IF($E$93<>\"\",$E$93,VLOOKUP($CR$36,_Afg07,Udbyttenr)),0)+IF(VLOOKUP($CR$38,_Afg07,$BR$131)=1,VLOOKUP($CR$38,_Afg07,BO131)*$C$95*IF($E$95<>\"\",$E$95,VLOOKUP($CR$38,_Afg07,Udbyttenr)),0)+IF(VLOOKUP($CR$40,_Afg07,$BR$131)=1,VLOOKUP($CR$40,_Afg07,BO131)*$C$97*IF($E$97<>\"\",$E$97,VLOOKUP($CR$40,_Afg07,Udbyttenr)),0)+IF(VLOOKUP($CR$42,_Afg07,$BR$131)=1,VLOOKUP($CR$42,_Afg07,BO131)*$C$99*IF($E$99<>\"\",$E$99,VLOOKUP($CR$42,_Afg07,Udbyttenr)),0)+IF(VLOOKUP($CR$44,_Afg07,$BR$131)=1,VLOOKUP($CR$44,_Afg07,BO131)*$C$101*IF($E$101<>\"\",$E$101,VLOOKUP($CR$44,_Afg07,Udbyttenr)),0)+IF(VLOOKUP($CR$46,_Afg07,$BR$131)=1,VLOOKUP($CR$46,_Afg07,BO131)*$C$103*IF($E$103<>\"\",$E$103,VLOOKUP($CR$46,_Afg07,Udbyttenr)),0)+IF(VLOOKUP($CR$48,_Afg07,$BR$131)=1,VLOOKUP($CR$48,_Afg07,BO131)*$C$105*IF($E$105<>\"\",$E$105,VLOOKUP($CR$48,_Afg07,Udbyttenr)),0))/($CU$50)","v":{"$error":"#DIV/0!"}},{"$f":"(IF(VLOOKUP($CR$36,_Afg07,$BR$131)=1,VLOOKUP($CR$36,_Afg07,BP131)*$C$93*IF($E$93<>\"\",$E$93,VLOOKUP($CR$36,_Afg07,Udbyttenr)),0)+IF(VLOOKUP($CR$38,_Afg07,$BR$131)=1,VLOOKUP($CR$38,_Afg07,BP131)*$C$95*IF($E$95<>\"\",$E$95,VLOOKUP($CR$38,_Afg07,Udbyttenr)),0)+IF(VLOOKUP($CR$40,_Afg07,$BR$131)=1,VLOOKUP($CR$40,_Afg07,BP131)*$C$97*IF($E$97<>\"\",$E$97,VLOOKUP($CR$40,_Afg07,Udbyttenr)),0)+IF(VLOOKUP($CR$42,_Afg07,$BR$131)=1,VLOOKUP($CR$42,_Afg07,BP131)*$C$99*IF($E$99<>\"\",$E$99,VLOOKUP($CR$42,_Afg07,Udbyttenr)),0)+IF(VLOOKUP($CR$44,_Afg07,$BR$131)=1,VLOOKUP($CR$44,_Afg07,BP131)*$C$101*IF($E$101<>\"\",$E$101,VLOOKUP($CR$44,_Afg07,Udbyttenr)),0)+IF(VLOOKUP($CR$46,_Afg07,$BR$131)=1,VLOOKUP($CR$46,_Afg07,BP131)*$C$103*IF($E$103<>\"\",$E$103,VLOOKUP($CR$46,_Afg07,Udbyttenr)),0)+IF(VLOOKUP($CR$48,_Afg07,$BR$131)=1,VLOOKUP($CR$48,_Afg07,BP131)*$C$105*IF($E$105<>\"\",$E$105,VLOOKUP($CR$48,_Afg07,Udbyttenr)),0))/($CU$50)","v":{"$error":"#DIV/0!"}},{"$f":"(IF(VLOOKUP($CR$36,_Afg07,$BR$131)=1,VLOOKUP($CR$36,_Afg07,BQ131)*$C$93*IF($E$93<>\"\",$E$93,VLOOKUP($CR$36,_Afg07,Udbyttenr)),0)+IF(VLOOKUP($CR$38,_Afg07,$BR$131)=1,VLOOKUP($CR$38,_Afg07,BQ131)*$C$95*IF($E$95<>\"\",$E$95,VLOOKUP($CR$38,_Afg07,Udbyttenr)),0)+IF(VLOOKUP($CR$40,_Afg07,$BR$131)=1,VLOOKUP($CR$40,_Afg07,BQ131)*$C$97*IF($E$97<>\"\",$E$97,VLOOKUP($CR$40,_Afg07,Udbyttenr)),0)+IF(VLOOKUP($CR$42,_Afg07,$BR$131)=1,VLOOKUP($CR$42,_Afg07,BQ131)*$C$99*IF($E$99<>\"\",$E$99,VLOOKUP($CR$42,_Afg07,Udbyttenr)),0)+IF(VLOOKUP($CR$44,_Afg07,$BR$131)=1,VLOOKUP($CR$44,_Afg07,BQ131)*$C$101*IF($E$101<>\"\",$E$101,VLOOKUP($CR$44,_Afg07,Udbyttenr)),0)+IF(VLOOKUP($CR$46,_Afg07,$BR$131)=1,VLOOKUP($CR$46,_Afg07,BQ131)*$C$103*IF($E$103<>\"\",$E$103,VLOOKUP($CR$46,_Afg07,Udbyttenr)),0)+IF(VLOOKUP($CR$48,_Afg07,$BR$131)=1,VLOOKUP($CR$48,_Afg07,BQ131)*$C$105*IF($E$105<>\"\",$E$105,VLOOKUP($CR$48,_Afg07,Udbyttenr)),0))/($CU$50)","v":{"$error":"#DIV/0!"}},3,null,null,null,null,null,null,null,null,null,null,null,null,null,null,null,null,"Sædskifte 1"]
[null,null,null,null,null,null,null,null,null,null,null,null,null,null,53,"Sædskifte 2","hkg",{"$f":"(IF(H113<>\"\",H113,VLOOKUP($CR$37,_Afg07,R131))*$C$113*IF($E$113<>\"\",$E$113,VLOOKUP($CR$37,_Afg07,Udbyttenr))+IF(H115<>\"\",H115,VLOOKUP($CR$39,_Afg07,R131))*$C$115*IF($E$115<>\"\",$E$115,VLOOKUP($CR$39,_Afg07,Udbyttenr))+IF(H117<>\"\",H117,VLOOKUP($CR$41,_Afg07,R131))*$C$117*IF($E$117<>\"\",$E$117,VLOOKUP($CR$41,_Afg07,Udbyttenr))+IF(H119<>\"\",H119,VLOOKUP($CR$43,_Afg07,R131))*$C$119*IF($E$119<>\"\",$E$119,VLOOKUP($CR$43,_Afg07,Udbyttenr))+IF(H121<>\"\",H121,VLOOKUP($CR$45,_Afg07,R131))*$C$121*IF($E$121<>\"\",$E$121,VLOOKUP($CR$45,_Afg07,Udbyttenr))+IF(H123<>\"\",H123,VLOOKUP($CR$47,_Afg07,R131))*$C$123*IF($E$123<>\"\",$E$123,VLOOKUP($CR$47,_Afg07,Udbyttenr))+IF(H125<>\"\",H125,VLOOKUP($CR$49,_Afg07,R131))*$C$125*IF($E$125<>\"\",$E$125,VLOOKUP($CR$49,_Afg07,Udbyttenr)))/($C$127*VLOOKUP($O$186,_Afg07,Udbyttenr))","v":{"$error":"#DIV/0!"}},{"$f":"(IF($E$113<>\"\",$E$113,VLOOKUP($CR$37,_Afg07,S131))*$C$113+IF($E$115<>\"\",$E$115,VLOOKUP($CR$39,_Afg07,S131))*$C$115+IF($E$117<>\"\",$E$117,VLOOKUP($CR$41,_Afg07,S131))*$C$117+IF($E$119<>\"\",$E$119,VLOOKUP($CR$43,_Afg07,S131))*$C$119+IF($E$121<>\"\",$E$121,VLOOKUP($CR$45,_Afg07,S131))*$C$121+IF($E$123<>\"\",$E$123,VLOOKUP($CR$47,_Afg07,S131))*$C$123+IF($E$125<>\"\",$E$125,VLOOKUP($CR$49,_Afg07,S131))*$C$125)/$C$127","v":{"$error":"#DIV/0!"}},{"$f":"(IF($E$113<>\"\",$E$113,VLOOKUP($CR$37,_Afg07,T131))*$C$113+IF($E$115<>\"\",$E$115,VLOOKUP($CR$39,_Afg07,T131))*$C$115+IF($E$117<>\"\",$E$117,VLOOKUP($CR$41,_Afg07,T131))*$C$117+IF($E$119<>\"\",$E$119,VLOOKUP($CR$43,_Afg07,T131))*$C$119+IF($E$121<>\"\",$E$121,VLOOKUP($CR$45,_Afg07,T131))*$C$121+IF($E$123<>\"\",$E$123,VLOOKUP($CR$47,_Afg07,T131))*$C$123+IF($E$125<>\"\",$E$125,VLOOKUP($CR$49,_Afg07,T131))*$C$125)/$C$127","v":{"$error":"#DIV/0!"}},{"$f":"(IF($E$113<>\"\",$E$113,VLOOKUP($CR$37,_Afg07,U131))*$C$113+IF($E$115<>\"\",$E$115,VLOOKUP($CR$39,_Afg07,U131))*$C$115+IF($E$117<>\"\",$E$117,VLOOKUP($CR$41,_Afg07,U131))*$C$117+IF($E$119<>\"\",$E$119,VLOOKUP($CR$43,_Afg07,U131))*$C$119+IF($E$121<>\"\",$E$121,VLOOKUP($CR$45,_Afg07,U131))*$C$121+IF($E$123<>\"\",$E$123,VLOOKUP($CR$47,_Afg07,U131))*$C$123+IF($E$125<>\"\",$E$125,VLOOKUP($CR$49,_Afg07,U131))*$C$125)/$C$127","v":{"$error":"#DIV/0!"}},{"$f":"(IF($E$113<>\"\",$E$113,VLOOKUP($CR$37,_Afg07,V131))*$C$113+IF($E$115<>\"\",$E$115,VLOOKUP($CR$39,_Afg07,V131))*$C$115+IF($E$117<>\"\",$E$117,VLOOKUP($CR$41,_Afg07,V131))*$C$117+IF($E$119<>\"\",$E$119,VLOOKUP($CR$43,_Afg07,V131))*$C$119+IF($E$121<>\"\",$E$121,VLOOKUP($CR$45,_Afg07,V131))*$C$121+IF($E$123<>\"\",$E$123,VLOOKUP($CR$47,_Afg07,V131))*$C$123+IF($E$125<>\"\",$E$125,VLOOKUP($CR$49,_Afg07,V131))*$C$125)/$C$127","v":{"$error":"#DIV/0!"}},{"$f":"(IF($E$113<>\"\",$E$113,VLOOKUP($CR$37,_Afg07,W131))*$C$113+IF($E$115<>\"\",$E$115,VLOOKUP($CR$39,_Afg07,W131))*$C$115+IF($E$117<>\"\",$E$117,VLOOKUP($CR$41,_Afg07,W131))*$C$117+IF($E$119<>\"\",$E$119,VLOOKUP($CR$43,_Afg07,W131))*$C$119+IF($E$121<>\"\",$E$121,VLOOKUP($CR$45,_Afg07,W131))*$C$121+IF($E$123<>\"\",$E$123,VLOOKUP($CR$47,_Afg07,W131))*$C$123+IF($E$125<>\"\",$E$125,VLOOKUP($CR$49,_Afg07,W131))*$C$125)/$C$127","v":{"$error":"#DIV/0!"}},{"$f":"(VLOOKUP($CR$37,_Afg07,X131)*$C$113+VLOOKUP($CR$39,_Afg07,X131)*$C$115+VLOOKUP($CR$41,_Afg07,X131)*$C$117+VLOOKUP($CR$43,_Afg07,X131)*$C$119+VLOOKUP($CR$45,_Afg07,X131)*$C$121+VLOOKUP($CR$47,_Afg07,X131)*$C$123+VLOOKUP($CR$49,_Afg07,X131)*$C$125)/$C$127","v":{"$error":"#DIV/0!"}},{"$error":"#DIV/0!"},{"$error":"#DIV/0!"},{"$error":"#DIV/0!"},{"$error":"#DIV/0!"},{"$error":"#DIV/0!"},{"$error":"#DIV/0!"},{"$error":"#DIV/0!"},{"$error":"#DIV/0!"},{"$error":"#DIV/0!"},{"$error":"#DIV/0!"},{"$error":"#DIV/0!"},{"$error":"#DIV/0!"},{"$error":"#DIV/0!"},{"$error":"#DIV/0!"},{"$error":"#DIV/0!"},{"$error":"#DIV/0!"},{"$error":"#DIV/0!"},{"$error":"#DIV/0!"},{"$error":"#DIV/0!"},{"$error":"#DIV/0!"},{"$error":"#DIV/0!"},{"$f":"(VLOOKUP($CR$37,_Afg07,AT131)*$C$113*IF($E$113<>\"\",$E$113,VLOOKUP($CR$37,_Afg07,Udbyttenr))+VLOOKUP($CR$39,_Afg07,AT131)*$C$115*IF($E$115<>\"\",$E$115,VLOOKUP($CR$39,_Afg07,Udbyttenr))+VLOOKUP($CR$41,_Afg07,AT131)*$C$117*IF($E$117<>\"\",$E$117,VLOOKUP($CR$41,_Afg07,Udbyttenr))+VLOOKUP($CR$43,_Afg07,AT131)*$C$119*IF($E$119<>\"\",$E$119,VLOOKUP($CR$43,_Afg07,Udbyttenr))+VLOOKUP($CR$45,_Afg07,AT131)*$C$121*IF($E$121<>\"\",$E$121,VLOOKUP($CR$45,_Afg07,Udbyttenr))+VLOOKUP($CR$47,_Afg07,AT131)*$C$123*IF($E$123<>\"\",$E$123,VLOOKUP($CR$47,_Afg07,Udbyttenr))+VLOOKUP($CR$49,_Afg07,AT131)*$C$125*IF($E$125<>\"\",$E$125,VLOOKUP($CR$49,_Afg07,Udbyttenr)))/($C$127*VLOOKUP($O$186,_Afg07,Udbyttenr))","v":{"$error":"#DIV/0!"}},{"$f":"(VLOOKUP($CR$37,_Afg07,AU131)*$C$113*VLOOKUP($CR$37,_Afg07,Halmnr)+VLOOKUP($CR$39,_Afg07,AU131)*$C$115*VLOOKUP($CR$39,_Afg07,Halmnr)+VLOOKUP($CR$41,_Afg07,AU131)*$C$117*VLOOKUP($CR$41,_Afg07,Halmnr)+VLOOKUP($CR$43,_Afg07,AU131)*$C$119*VLOOKUP($CR$43,_Afg07,Halmnr)+VLOOKUP($CR$45,_Afg07,AU131)*$C$121*VLOOKUP($CR$45,_Afg07,Halmnr)+VLOOKUP($CR$47,_Afg07,AU131)*$C$123*VLOOKUP($CR$47,_Afg07,Halmnr)+VLOOKUP($CR$49,_Afg07,AU131)*$C$125*VLOOKUP($CR$49,_Afg07,Halmnr))/($C$127*VLOOKUP($O$186,_Afg07,Halmnr))","v":{"$error":"#VALUE!"}},{"$f":"(VLOOKUP($CR$37,_Afg07,AV131)*$C$113+VLOOKUP($CR$39,_Afg07,AV131)*$C$115+VLOOKUP($CR$41,_Afg07,AV131)*$C$117+VLOOKUP($CR$43,_Afg07,AV131)*$C$119+VLOOKUP($CR$45,_Afg07,AV131)*$C$121+VLOOKUP($CR$47,_Afg07,AV131)*$C$123+VLOOKUP($CR$49,_Afg07,AV131)*$C$125)/$C$127","v":{"$error":"#DIV/0!"}},{"$f":"(VLOOKUP($CR$37,_Afg07,AW131)*$C$113*IF($E$113<>\"\",$E$113,VLOOKUP($CR$37,_Afg07,Udbyttenr))+VLOOKUP($CR$39,_Afg07,AW131)*$C$115*IF($E$115<>\"\",$E$115,VLOOKUP($CR$39,_Afg07,Udbyttenr))+VLOOKUP($CR$41,_Afg07,AW131)*$C$117*IF($E$117<>\"\",$E$117,VLOOKUP($CR$41,_Afg07,Udbyttenr))+VLOOKUP($CR$43,_Afg07,AW131)*$C$119*IF($E$119<>\"\",$E$119,VLOOKUP($CR$43,_Afg07,Udbyttenr))+VLOOKUP($CR$45,_Afg07,AW131)*$C$121*IF($E$121<>\"\",$E$121,VLOOKUP($CR$45,_Afg07,Udbyttenr))+VLOOKUP($CR$47,_Afg07,AW131)*$C$123*IF($E$123<>\"\",$E$123,VLOOKUP($CR$47,_Afg07,Udbyttenr))+VLOOKUP($CR$49,_Afg07,AW131)*$C$125*IF($E$125<>\"\",$E$125,VLOOKUP($CR$49,_Afg07,Udbyttenr)))/($C$127*VLOOKUP($O$186,_Afg07,Udbyttenr))","v":{"$error":"#DIV/0!"}},{"$f":"(VLOOKUP($CR$37,_Afg07,AX131)*$C$113*VLOOKUP($CR$37,_Afg07,Halmnr)+VLOOKUP($CR$39,_Afg07,AX131)*$C$115*VLOOKUP($CR$39,_Afg07,Halmnr)+VLOOKUP($CR$41,_Afg07,AX131)*$C$117*VLOOKUP($CR$41,_Afg07,Halmnr)+VLOOKUP($CR$43,_Afg07,AX131)*$C$119*VLOOKUP($CR$43,_Afg07,Halmnr)+VLOOKUP($CR$45,_Afg07,AX131)*$C$121*VLOOKUP($CR$45,_Afg07,Halmnr)+VLOOKUP($CR$47,_Afg07,AX131)*$C$123*VLOOKUP($CR$47,_Afg07,Halmnr)+VLOOKUP($CR$49,_Afg07,AX131)*$C$125*VLOOKUP($CR$49,_Afg07,Halmnr))/($C$127*VLOOKUP($O$186,_Afg07,Halmnr))","v":{"$error":"#VALUE!"}},{"$f":"(VLOOKUP($CR$37,_Afg07,AY131)*$C$113*IF($E$113<>\"\",$E$113,VLOOKUP($CR$37,_Afg07,Udbyttenr))+VLOOKUP($CR$39,_Afg07,AY131)*$C$115*IF($E$115<>\"\",$E$115,VLOOKUP($CR$39,_Afg07,Udbyttenr))+VLOOKUP($CR$41,_Afg07,AY131)*$C$117*IF($E$117<>\"\",$E$117,VLOOKUP($CR$41,_Afg07,Udbyttenr))+VLOOKUP($CR$43,_Afg07,AY131)*$C$119*IF($E$119<>\"\",$E$119,VLOOKUP($CR$43,_Afg07,Udbyttenr))+VLOOKUP($CR$45,_Afg07,AY131)*$C$121*IF($E$121<>\"\",$E$121,VLOOKUP($CR$45,_Afg07,Udbyttenr))+VLOOKUP($CR$47,_Afg07,AY131)*$C$123*IF($E$123<>\"\",$E$123,VLOOKUP($CR$47,_Afg07,Udbyttenr))+VLOOKUP($CR$49,_Afg07,AY131)*$C$125*IF($E$125<>\"\",$E$125,VLOOKUP($CR$49,_Afg07,Udbyttenr)))/($C$127*VLOOKUP($O$186,_Afg07,Udbyttenr))","v":{"$error":"#DIV/0!"}},"Sædskifte 2",{"$f":"(VLOOKUP($CR$37,_Afg07,BA131)*$C$113+VLOOKUP($CR$39,_Afg07,BA131)*$C$115+VLOOKUP($CR$41,_Afg07,BA131)*$C$117+VLOOKUP($CR$43,_Afg07,BA131)*$C$119+VLOOKUP($CR$45,_Afg07,BA131)*$C$121+VLOOKUP($CR$47,_Afg07,BA131)*$C$123+VLOOKUP($CR$49,_Afg07,BA131)*$C$125)/$C$127","v":{"$error":"#DIV/0!"}},{"$error":"#DIV/0!"},{"$error":"#DIV/0!"},{"$error":"#DIV/0!"},{"$error":"#DIV/0!"},{"$error":"#DIV/0!"},{"$error":"#DIV/0!"},{"$error":"#DIV/0!"},{"$error":"#DIV/0!"},{"$error":"#DIV/0!"},{"$f":"(IF(AND(VLOOKUP($CR$37,_Afg07,$BR$131)=1,$CU$3=4),0,VLOOKUP($CR$37,_Afg07,BK131)*$C$113*IF($E$113<>\"\",$E$113,VLOOKUP($CR$37,_Afg07,Udbyttenr)))+IF(AND(VLOOKUP($CR$39,_Afg07,$BR$131)=1,$CU$3=4),0,VLOOKUP($CR$39,_Afg07,BK131)*$C$115*IF($E$115<>\"\",$E$115,VLOOKUP($CR$39,_Afg07,Udbyttenr)))+IF(AND(VLOOKUP($CR$41,_Afg07,$BR$131)=1,$CU$3=4),0,VLOOKUP($CR$41,_Afg07,BK131)*$C$117*IF($E$117<>\"\",$E$117,VLOOKUP($CR$41,_Afg07,Udbyttenr)))+IF(AND(VLOOKUP($CR$43,_Afg07,$BR$131)=1,$CU$3=4),0,VLOOKUP($CR$43,_Afg07,BK131)*$C$119*IF($E$119<>\"\",$E$119,VLOOKUP($CR$43,_Afg07,Udbyttenr)))+IF(AND(VLOOKUP($CR$45,_Afg07,$BR$131)=1,$CU$3=4),0,VLOOKUP($CR$45,_Afg07,BK131)*$C$121*IF($E$121<>\"\",$E$121,VLOOKUP($CR$45,_Afg07,Udbyttenr)))+IF(AND(VLOOKUP($CR$47,_Afg07,$BR$131)=1,$CU$3=4),0,VLOOKUP($CR$47,_Afg07,BK131)*$C$123*IF($E$123<>\"\",$E$123,VLOOKUP($CR$47,_Afg07,Udbyttenr)))+IF(AND(VLOOKUP($CR$49,_Afg07,$BR$131)=1,$CU$3=4),0,VLOOKUP($CR$49,_Afg07,BK131)*$C$125*IF($E$125<>\"\",$E$125,VLOOKUP($CR$49,_Afg07,Udbyttenr))))/($C$127*VLOOKUP($O$186,_Afg07,Udbyttenr))","v":{"$error":"#DIV/0!"}},{"$f":"(IF(AND(VLOOKUP($CR$37,_Afg07,$BR$131)=1,$CU$3=4),0,VLOOKUP($CR$37,_Afg07,BL131)*$C$113*IF($E$113<>\"\",$E$113,VLOOKUP($CR$37,_Afg07,Udbyttenr)))+IF(AND(VLOOKUP($CR$39,_Afg07,$BR$131)=1,$CU$3=4),0,VLOOKUP($CR$39,_Afg07,BL131)*$C$115*IF($E$115<>\"\",$E$115,VLOOKUP($CR$39,_Afg07,Udbyttenr)))+IF(AND(VLOOKUP($CR$41,_Afg07,$BR$131)=1,$CU$3=4),0,VLOOKUP($CR$41,_Afg07,BL131)*$C$117*IF($E$117<>\"\",$E$117,VLOOKUP($CR$41,_Afg07,Udbyttenr)))+IF(AND(VLOOKUP($CR$43,_Afg07,$BR$131)=1,$CU$3=4),0,VLOOKUP($CR$43,_Afg07,BL131)*$C$119*IF($E$119<>\"\",$E$119,VLOOKUP($CR$43,_Afg07,Udbyttenr)))+IF(AND(VLOOKUP($CR$45,_Afg07,$BR$131)=1,$CU$3=4),0,VLOOKUP($CR$45,_Afg07,BL131)*$C$121*IF($E$121<>\"\",$E$121,VLOOKUP($CR$45,_Afg07,Udbyttenr)))+IF(AND(VLOOKUP($CR$47,_Afg07,$BR$131)=1,$CU$3=4),0,VLOOKUP($CR$47,_Afg07,BL131)*$C$123*IF($E$123<>\"\",$E$123,VLOOKUP($CR$47,_Afg07,Udbyttenr)))+IF(AND(VLOOKUP($CR$49,_Afg07,$BR$131)=1,$CU$3=4),0,VLOOKUP($CR$49,_Afg07,BL131)*$C$125*IF($E$125<>\"\",$E$125,VLOOKUP($CR$49,_Afg07,Udbyttenr))))/($C$127*VLOOKUP($O$186,_Afg07,Udbyttenr))","v":{"$error":"#DIV/0!"}},{"$f":"(IF(AND(VLOOKUP($CR$37,_Afg07,$BR$131)=1,$CU$3=4),0,VLOOKUP($CR$37,_Afg07,BM131)*$C$113*IF($E$113<>\"\",$E$113,VLOOKUP($CR$37,_Afg07,Udbyttenr)))+IF(AND(VLOOKUP($CR$39,_Afg07,$BR$131)=1,$CU$3=4),0,VLOOKUP($CR$39,_Afg07,BM131)*$C$115*IF($E$115<>\"\",$E$115,VLOOKUP($CR$39,_Afg07,Udbyttenr)))+IF(AND(VLOOKUP($CR$41,_Afg07,$BR$131)=1,$CU$3=4),0,VLOOKUP($CR$41,_Afg07,BM131)*$C$117*IF($E$117<>\"\",$E$117,VLOOKUP($CR$41,_Afg07,Udbyttenr)))+IF(AND(VLOOKUP($CR$43,_Afg07,$BR$131)=1,$CU$3=4),0,VLOOKUP($CR$43,_Afg07,BM131)*$C$119*IF($E$119<>\"\",$E$119,VLOOKUP($CR$43,_Afg07,Udbyttenr)))+IF(AND(VLOOKUP($CR$45,_Afg07,$BR$131)=1,$CU$3=4),0,VLOOKUP($CR$45,_Afg07,BM131)*$C$121*IF($E$121<>\"\",$E$121,VLOOKUP($CR$45,_Afg07,Udbyttenr)))+IF(AND(VLOOKUP($CR$47,_Afg07,$BR$131)=1,$CU$3=4),0,VLOOKUP($CR$47,_Afg07,BM131)*$C$123*IF($E$123<>\"\",$E$123,VLOOKUP($CR$47,_Afg07,Udbyttenr)))+IF(AND(VLOOKUP($CR$49,_Afg07,$BR$131)=1,$CU$3=4),0,VLOOKUP($CR$49,_Afg07,BM131)*$C$125*IF($E$125<>\"\",$E$125,VLOOKUP($CR$49,_Afg07,Udbyttenr))))/($C$127*VLOOKUP($O$186,_Afg07,Udbyttenr))","v":{"$error":"#DIV/0!"}},{"$f":"(IF(VLOOKUP($CR$37,_Afg07,$BR$131)=1,VLOOKUP($CR$37,_Afg07,BN131)*$C$113*IF($E$113<>\"\",$E$113,VLOOKUP($CR$37,_Afg07,Udbyttenr)),0)+IF(VLOOKUP($CR$39,_Afg07,$BR$131)=1,VLOOKUP($CR$39,_Afg07,BN131)*$C$115*IF($E$115<>\"\",$E$115,VLOOKUP($CR$39,_Afg07,Udbyttenr)),0)+IF(VLOOKUP($CR$41,_Afg07,$BR$131)=1,VLOOKUP($CR$41,_Afg07,BN131)*$C$117*IF($E$117<>\"\",$E$117,VLOOKUP($CR$41,_Afg07,Udbyttenr)),0)+IF(VLOOKUP($CR$43,_Afg07,$BR$131)=1,VLOOKUP($CR$43,_Afg07,BN131)*$C$119*IF($E$119<>\"\",$E$119,VLOOKUP($CR$43,_Afg07,Udbyttenr)),0)+IF(VLOOKUP($CR$45,_Afg07,$BR$131)=1,VLOOKUP($CR$45,_Afg07,BN131)*$C$121*IF($E$121<>\"\",$E$121,VLOOKUP($CR$45,_Afg07,Udbyttenr)),0)+IF(VLOOKUP($CR$47,_Afg07,$BR$131)=1,VLOOKUP($CR$47,_Afg07,BN131)*$C$123*IF($E$123<>\"\",$E$123,VLOOKUP($CR$47,_Afg07,Udbyttenr)),0)+IF(VLOOKUP($CR$49,_Afg07,$BR$131)=1,VLOOKUP($CR$49,_Afg07,BN131)*$C$125*IF($E$125<>\"\",$E$125,VLOOKUP($CR$49,_Afg07,Udbyttenr)),0))/($CU$51)","v":{"$error":"#DIV/0!"}},{"$f":"(IF(VLOOKUP($CR$37,_Afg07,$BR$131)=1,VLOOKUP($CR$37,_Afg07,BO131)*$C$113*IF($E$113<>\"\",$E$113,VLOOKUP($CR$37,_Afg07,Udbyttenr)),0)+IF(VLOOKUP($CR$39,_Afg07,$BR$131)=1,VLOOKUP($CR$39,_Afg07,BO131)*$C$115*IF($E$115<>\"\",$E$115,VLOOKUP($CR$39,_Afg07,Udbyttenr)),0)+IF(VLOOKUP($CR$41,_Afg07,$BR$131)=1,VLOOKUP($CR$41,_Afg07,BO131)*$C$117*IF($E$117<>\"\",$E$117,VLOOKUP($CR$41,_Afg07,Udbyttenr)),0)+IF(VLOOKUP($CR$43,_Afg07,$BR$131)=1,VLOOKUP($CR$43,_Afg07,BO131)*$C$119*IF($E$119<>\"\",$E$119,VLOOKUP($CR$43,_Afg07,Udbyttenr)),0)+IF(VLOOKUP($CR$45,_Afg07,$BR$131)=1,VLOOKUP($CR$45,_Afg07,BO131)*$C$121*IF($E$121<>\"\",$E$121,VLOOKUP($CR$45,_Afg07,Udbyttenr)),0)+IF(VLOOKUP($CR$47,_Afg07,$BR$131)=1,VLOOKUP($CR$47,_Afg07,BO131)*$C$123*IF($E$123<>\"\",$E$123,VLOOKUP($CR$47,_Afg07,Udbyttenr)),0)+IF(VLOOKUP($CR$49,_Afg07,$BR$131)=1,VLOOKUP($CR$49,_Afg07,BO131)*$C$125*IF($E$125<>\"\",$E$125,VLOOKUP($CR$49,_Afg07,Udbyttenr)),0))/($CU$51)","v":{"$error":"#DIV/0!"}},{"$f":"(IF(VLOOKUP($CR$37,_Afg07,$BR$131)=1,VLOOKUP($CR$37,_Afg07,BP131)*$C$113*IF($E$113<>\"\",$E$113,VLOOKUP($CR$37,_Afg07,Udbyttenr)),0)+IF(VLOOKUP($CR$39,_Afg07,$BR$131)=1,VLOOKUP($CR$39,_Afg07,BP131)*$C$115*IF($E$115<>\"\",$E$115,VLOOKUP($CR$39,_Afg07,Udbyttenr)),0)+IF(VLOOKUP($CR$41,_Afg07,$BR$131)=1,VLOOKUP($CR$41,_Afg07,BP131)*$C$117*IF($E$117<>\"\",$E$117,VLOOKUP($CR$41,_Afg07,Udbyttenr)),0)+IF(VLOOKUP($CR$43,_Afg07,$BR$131)=1,VLOOKUP($CR$43,_Afg07,BP131)*$C$119*IF($E$119<>\"\",$E$119,VLOOKUP($CR$43,_Afg07,Udbyttenr)),0)+IF(VLOOKUP($CR$45,_Afg07,$BR$131)=1,VLOOKUP($CR$45,_Afg07,BP131)*$C$121*IF($E$121<>\"\",$E$121,VLOOKUP($CR$45,_Afg07,Udbyttenr)),0)+IF(VLOOKUP($CR$47,_Afg07,$BR$131)=1,VLOOKUP($CR$47,_Afg07,BP131)*$C$123*IF($E$123<>\"\",$E$123,VLOOKUP($CR$47,_Afg07,Udbyttenr)),0)+IF(VLOOKUP($CR$49,_Afg07,$BR$131)=1,VLOOKUP($CR$49,_Afg07,BP131)*$C$125*IF($E$125<>\"\",$E$125,VLOOKUP($CR$49,_Afg07,Udbyttenr)),0))/($CU$51)","v":{"$error":"#DIV/0!"}},{"$f":"(IF(VLOOKUP($CR$37,_Afg07,$BR$131)=1,VLOOKUP($CR$37,_Afg07,BQ131)*$C$113*IF($E$113<>\"\",$E$113,VLOOKUP($CR$37,_Afg07,Udbyttenr)),0)+IF(VLOOKUP($CR$39,_Afg07,$BR$131)=1,VLOOKUP($CR$39,_Afg07,BQ131)*$C$115*IF($E$115<>\"\",$E$115,VLOOKUP($CR$39,_Afg07,Udbyttenr)),0)+IF(VLOOKUP($CR$41,_Afg07,$BR$131)=1,VLOOKUP($CR$41,_Afg07,BQ131)*$C$117*IF($E$117<>\"\",$E$117,VLOOKUP($CR$41,_Afg07,Udbyttenr)),0)+IF(VLOOKUP($CR$43,_Afg07,$BR$131)=1,VLOOKUP($CR$43,_Afg07,BQ131)*$C$119*IF($E$119<>\"\",$E$119,VLOOKUP($CR$43,_Afg07,Udbyttenr)),0)+IF(VLOOKUP($CR$45,_Afg07,$BR$131)=1,VLOOKUP($CR$45,_Afg07,BQ131)*$C$121*IF($E$121<>\"\",$E$121,VLOOKUP($CR$45,_Afg07,Udbyttenr)),0)+IF(VLOOKUP($CR$47,_Afg07,$BR$131)=1,VLOOKUP($CR$47,_Afg07,BQ131)*$C$123*IF($E$123<>\"\",$E$123,VLOOKUP($CR$47,_Afg07,Udbyttenr)),0)+IF(VLOOKUP($CR$49,_Afg07,$BR$131)=1,VLOOKUP($CR$49,_Afg07,BQ131)*$C$125*IF($E$125<>\"\",$E$125,VLOOKUP($CR$49,_Afg07,Udbyttenr)),0))/($CU$51)","v":{"$error":"#DIV/0!"}},4,null,null,null,null,null,null,null,null,null,null,null,null,null,null,null,null,"Sædskifte 2"]
["Dækningsbidrag",{"$f":"IF($E$174=\"\",\"\",IF(CR$16=O$185,C44,IF(CS$16=O$185,G44,IF(CT$16=O$185,K44,\"\")))*C$107)","v":""},null,{"$f":"IF(B187=\"\",\"\",\"kr.\")","v":""},null,{"$f":"IF($H$174=\"\",\"\",IF(CR$16=O$186,C44,IF(CS$16=O$186,G44,IF(CT$16=O$186,K44,\"\")))*C$127)","v":""},null,{"$f":"IF(F187=\"\",\"\",\"kr.\")","v":""},null,{"$f":"IF(AND($E$174<>\"\",$H$174<>\"\"),F187-B187,\"\")","v":""},null,{"$f":"IF(J187=\"\",\"\",\"kr.\")","v":""}]
[null,null,null,null,null,null,null,null,null,null,null,null,null,null,null,null,null,"Udbytte","Hektar",null,null,null,null,"Hektar",null,null,null,null,"Hektar",null,null,null,null,"Hektar","Hektar","Hektar","Hektar",null,"Hektar",null,null,null,null,"Hektar","Hektar","Udbytte","Halm","Hektar","Udbytte","Halm","Udbytte",null,"Hektarrelateret",null,null,null,null,"Hektar",null,null,null,null,"Udbytte","Udbytte",null,"Udbytterelateret, men skal kun regnes for korn"]
["Maskiner og arbejde",{"$f":"IF($E$174=\"\",\"\",IF(CR$16=O$185,C46,IF(CS$16=O$185,G46,IF(CT$16=O$185,K46,\"\")))*C$107)","v":""},null,{"$f":"IF(B189=\"\",\"\",\"kr.\")","v":""},null,{"$f":"IF($H$174=\"\",\"\",IF(CR$16=O$186,C46,IF(CS$16=O$186,G46,IF(CT$16=O$186,K46,\"\")))*C$127)","v":""},null,{"$f":"IF(F189=\"\",\"\",\"kr.\")","v":""},null,{"$f":"IF(AND($E$174<>\"\",$H$174<>\"\"),F189-B189,\"\")","v":""},null,{"$f":"IF(J189=\"\",\"\",\"kr.\")","v":""},null,null,1,2,3,4,5,6,7,8,9,10,11,12,13,14,15,16,17,18,19,20,21,22,23,24,25,26,27,28,29,30,31,32,33,34,35,36,37,38,39,40,41,42,43,44,45,46,47,48,49,50,51,52,53,54,55,56,null,null,null,null,null,null,null,null,null,null,null,null,null,null,null,null,57]
[{"$f":"IF(Tørringnr=1,\"Tørring (løntørring)\",\"Tørring (korn i eget tørreri)\")","v":"Tørring (korn i eget tørreri)"},{"$f":"IF($E$174=\"\",\"\",IF(CR$16=O$185,C47,IF(CS$16=O$185,G47,IF(CT$16=O$185,K47,\"\")))*C$107)","v":""},null,{"$f":"IF(B190=\"\",\"\",\"kr.\")","v":""},null,{"$f":"IF($H$174=\"\",\"\",IF(CR$16=O$186,C47,IF(CS$16=O$186,G47,IF(CT$16=O$186,K47,\"\")))*C$127)","v":""},null,{"$f":"IF(F190=\"\",\"\",\"kr.\")","v":""},null,{"$f":"IF(AND($E$174<>\"\",$H$174<>\"\"),F190-B190,\"\")","v":""},null,{"$f":"IF(J190=\"\",\"\",\"kr.\")","v":""},null,null,1,null,null,null,null,null,null,null,null,{"$f":"(IF(VLOOKUP($CR$36,_Afg07,$BR$131)=1,VLOOKUP($CR$36,_Afg07,X131)*$C$93,0)+IF(VLOOKUP($CR$38,_Afg07,$BR$131)=1,VLOOKUP($CR$38,_Afg07,X131)*$C$95,0)+IF(VLOOKUP($CR$40,_Afg07,$BR$131)=1,VLOOKUP($CR$40,_Afg07,X131)*$C$97,0)+IF(VLOOKUP($CR$42,_Afg07,$BR$131)=1,VLOOKUP($CR$42,_Afg07,X131)*$C$99,0)+IF(VLOOKUP($CR$44,_Afg07,$BR$131)=1,VLOOKUP($CR$44,_Afg07,X131)*$C$101,0)+IF(VLOOKUP($CR$46,_Afg07,$BR$131)=1,VLOOKUP($CR$46,_Afg07,X131)*$C$103,0)+IF(VLOOKUP($CR$48,_Afg07,$BR$131)=1,VLOOKUP($CR$48,_Afg07,X131)*$C$105,0))/($CV$50)","v":{"$error":"#DIV/0!"}},{"$f":"(IF(VLOOKUP($CR$36,_Afg07,$BR$131)=1,VLOOKUP($CR$36,_Afg07,Y131)*$C$93,0)+IF(VLOOKUP($CR$38,_Afg07,$BR$131)=1,VLOOKUP($CR$38,_Afg07,Y131)*$C$95,0)+IF(VLOOKUP($CR$40,_Afg07,$BR$131)=1,VLOOKUP($CR$40,_Afg07,Y131)*$C$97,0)+IF(VLOOKUP($CR$42,_Afg07,$BR$131)=1,VLOOKUP($CR$42,_Afg07,Y131)*$C$99,0)+IF(VLOOKUP($CR$44,_Afg07,$BR$131)=1,VLOOKUP($CR$44,_Afg07,Y131)*$C$101,0)+IF(VLOOKUP($CR$46,_Afg07,$BR$131)=1,VLOOKUP($CR$46,_Afg07,Y131)*$C$103,0)+IF(VLOOKUP($CR$48,_Afg07,$BR$131)=1,VLOOKUP($CR$48,_Afg07,Y131)*$C$105,0))/($CV$50)","v":{"$error":"#DIV/0!"}},{"$f":"(IF(VLOOKUP($CR$36,_Afg07,$BR$131)=1,VLOOKUP($CR$36,_Afg07,Z131)*$C$93,0)+IF(VLOOKUP($CR$38,_Afg07,$BR$131)=1,VLOOKUP($CR$38,_Afg07,Z131)*$C$95,0)+IF(VLOOKUP($CR$40,_Afg07,$BR$131)=1,VLOOKUP($CR$40,_Afg07,Z131)*$C$97,0)+IF(VLOOKUP($CR$42,_Afg07,$BR$131)=1,VLOOKUP($CR$42,_Afg07,Z131)*$C$99,0)+IF(VLOOKUP($CR$44,_Afg07,$BR$131)=1,VLOOKUP($CR$44,_Afg07,Z131)*$C$101,0)+IF(VLOOKUP($CR$46,_Afg07,$BR$131)=1,VLOOKUP($CR$46,_Afg07,Z131)*$C$103,0)+IF(VLOOKUP($CR$48,_Afg07,$BR$131)=1,VLOOKUP($CR$48,_Afg07,Z131)*$C$105,0))/($CV$50)","v":{"$error":"#DIV/0!"}},{"$f":"(IF(VLOOKUP($CR$36,_Afg07,$BR$131)=1,VLOOKUP($CR$36,_Afg07,AA131)*$C$93,0)+IF(VLOOKUP($CR$38,_Afg07,$BR$131)=1,VLOOKUP($CR$38,_Afg07,AA131)*$C$95,0)+IF(VLOOKUP($CR$40,_Afg07,$BR$131)=1,VLOOKUP($CR$40,_Afg07,AA131)*$C$97,0)+IF(VLOOKUP($CR$42,_Afg07,$BR$131)=1,VLOOKUP($CR$42,_Afg07,AA131)*$C$99,0)+IF(VLOOKUP($CR$44,_Afg07,$BR$131)=1,VLOOKUP($CR$44,_Afg07,AA131)*$C$101,0)+IF(VLOOKUP($CR$46,_Afg07,$BR$131)=1,VLOOKUP($CR$46,_Afg07,AA131)*$C$103,0)+IF(VLOOKUP($CR$48,_Afg07,$BR$131)=1,VLOOKUP($CR$48,_Afg07,AA131)*$C$105,0))/($CV$50)","v":{"$error":"#DIV/0!"}},{"$f":"(IF(VLOOKUP($CR$36,_Afg07,$BR$131)=1,VLOOKUP($CR$36,_Afg07,AB131)*$C$93,0)+IF(VLOOKUP($CR$38,_Afg07,$BR$131)=1,VLOOKUP($CR$38,_Afg07,AB131)*$C$95,0)+IF(VLOOKUP($CR$40,_Afg07,$BR$131)=1,VLOOKUP($CR$40,_Afg07,AB131)*$C$97,0)+IF(VLOOKUP($CR$42,_Afg07,$BR$131)=1,VLOOKUP($CR$42,_Afg07,AB131)*$C$99,0)+IF(VLOOKUP($CR$44,_Afg07,$BR$131)=1,VLOOKUP($CR$44,_Afg07,AB131)*$C$101,0)+IF(VLOOKUP($CR$46,_Afg07,$BR$131)=1,VLOOKUP($CR$46,_Afg07,AB131)*$C$103,0)+IF(VLOOKUP($CR$48,_Afg07,$BR$131)=1,VLOOKUP($CR$48,_Afg07,AB131)*$C$105,0))/($CV$50)","v":{"$error":"#DIV/0!"}},null,null,null,null,null,null,{"$f":"(IF(VLOOKUP($CR$36,_Afg07,$BR$131)=1,VLOOKUP($CR$36,_Afg07,AI131)*$C$93,0)+IF(VLOOKUP($CR$38,_Afg07,$BR$131)=1,VLOOKUP($CR$38,_Afg07,AI131)*$C$95,0)+IF(VLOOKUP($CR$40,_Afg07,$BR$131)=1,VLOOKUP($CR$40,_Afg07,AI131)*$C$97,0)+IF(VLOOKUP($CR$42,_Afg07,$BR$131)=1,VLOOKUP($CR$42,_Afg07,AI131)*$C$99,0)+IF(VLOOKUP($CR$44,_Afg07,$BR$131)=1,VLOOKUP($CR$44,_Afg07,AI131)*$C$101,0)+IF(VLOOKUP($CR$46,_Afg07,$BR$131)=1,VLOOKUP($CR$46,_Afg07,AI131)*$C$103,0)+IF(VLOOKUP($CR$48,_Afg07,$BR$131)=1,VLOOKUP($CR$48,_Afg07,AI131)*$C$105,0))/($CV$50)","v":{"$error":"#DIV/0!"}},{"$f":"(IF(VLOOKUP($CR$36,_Afg07,$BR$131)=1,VLOOKUP($CR$36,_Afg07,AJ131)*$C$93,0)+IF(VLOOKUP($CR$38,_Afg07,$BR$131)=1,VLOOKUP($CR$38,_Afg07,AJ131)*$C$95,0)+IF(VLOOKUP($CR$40,_Afg07,$BR$131)=1,VLOOKUP($CR$40,_Afg07,AJ131)*$C$97,0)+IF(VLOOKUP($CR$42,_Afg07,$BR$131)=1,VLOOKUP($CR$42,_Afg07,AJ131)*$C$99,0)+IF(VLOOKUP($CR$44,_Afg07,$BR$131)=1,VLOOKUP($CR$44,_Afg07,AJ131)*$C$101,0)+IF(VLOOKUP($CR$46,_Afg07,$BR$131)=1,VLOOKUP($CR$46,_Afg07,AJ131)*$C$103,0)+IF(VLOOKUP($CR$48,_Afg07,$BR$131)=1,VLOOKUP($CR$48,_Afg07,AJ131)*$C$105,0))/($CV$50)","v":{"$error":"#DIV/0!"}},{"$f":"(IF(VLOOKUP($CR$36,_Afg07,$BR$131)=1,VLOOKUP($CR$36,_Afg07,AK131)*$C$93,0)+IF(VLOOKUP($CR$38,_Afg07,$BR$131)=1,VLOOKUP($CR$38,_Afg07,AK131)*$C$95,0)+IF(VLOOKUP($CR$40,_Afg07,$BR$131)=1,VLOOKUP($CR$40,_Afg07,AK131)*$C$97,0)+IF(VLOOKUP($CR$42,_Afg07,$BR$131)=1,VLOOKUP($CR$42,_Afg07,AK131)*$C$99,0)+IF(VLOOKUP($CR$44,_Afg07,$BR$131)=1,VLOOKUP($CR$44,_Afg07,AK131)*$C$101,0)+IF(VLOOKUP($CR$46,_Afg07,$BR$131)=1,VLOOKUP($CR$46,_Afg07,AK131)*$C$103,0)+IF(VLOOKUP($CR$48,_Afg07,$BR$131)=1,VLOOKUP($CR$48,_Afg07,AK131)*$C$105,0))/($CV$50)","v":{"$error":"#DIV/0!"}},null,{"$f":"(IF(VLOOKUP($CR$36,_Afg07,$BR$131)=1,VLOOKUP($CR$36,_Afg07,AM131)*$C$93,0)+IF(VLOOKUP($CR$38,_Afg07,$BR$131)=1,VLOOKUP($CR$38,_Afg07,AM131)*$C$95,0)+IF(VLOOKUP($CR$40,_Afg07,$BR$131)=1,VLOOKUP($CR$40,_Afg07,AM131)*$C$97,0)+IF(VLOOKUP($CR$42,_Afg07,$BR$131)=1,VLOOKUP($CR$42,_Afg07,AM131)*$C$99,0)+IF(VLOOKUP($CR$44,_Afg07,$BR$131)=1,VLOOKUP($CR$44,_Afg07,AM131)*$C$101,0)+IF(VLOOKUP($CR$46,_Afg07,$BR$131)=1,VLOOKUP($CR$46,_Afg07,AM131)*$C$103,0)+IF(VLOOKUP($CR$48,_Afg07,$BR$131)=1,VLOOKUP($CR$48,_Afg07,AM131)*$C$105,0))/($CV$50)","v":{"$error":"#DIV/0!"}},{"$error":"#DIV/0!"},{"$error":"#DIV/0!"},{"$error":"#DIV/0!"},{"$error":"#DIV/0!"},{"$error":"#DIV/0!"},{"$error":"#DIV/0!"},{"$f":"(IF(VLOOKUP($CR$36,_Afg07,$BR$131)=1,VLOOKUP($CR$36,_Afg07,AT131)*$C$93*IF($E$93<>\"\",$E$93,VLOOKUP($CR$36,_Afg07,Udbyttenr)),0)+IF(VLOOKUP($CR$38,_Afg07,$BR$131)=1,VLOOKUP($CR$38,_Afg07,AT131)*$C$95*IF($E$95<>\"\",$E$95,VLOOKUP($CR$38,_Afg07,Udbyttenr)),0)+IF(VLOOKUP($CR$40,_Afg07,$BR$131)=1,VLOOKUP($CR$40,_Afg07,AT131)*$C$97*IF($E$97<>\"\",$E$97,VLOOKUP($CR$40,_Afg07,Udbyttenr)),0)+IF(VLOOKUP($CR$42,_Afg07,$BR$131)=1,VLOOKUP($CR$42,_Afg07,AT131)*$C$99*IF($E$99<>\"\",$E$99,VLOOKUP($CR$42,_Afg07,Udbyttenr)),0)+IF(VLOOKUP($CR$44,_Afg07,$BR$131)=1,VLOOKUP($CR$44,_Afg07,AT131)*$C$101*IF($E$101<>\"\",$E$101,VLOOKUP($CR$44,_Afg07,Udbyttenr)),0)+IF(VLOOKUP($CR$46,_Afg07,$BR$131)=1,VLOOKUP($CR$46,_Afg07,AT131)*$C$103*IF($E$103<>\"\",$E$103,VLOOKUP($CR$46,_Afg07,Udbyttenr)),0)+IF(VLOOKUP($CR$48,_Afg07,$BR$131)=1,VLOOKUP($CR$48,_Afg07,AT131)*$C$105*IF($E$105<>\"\",$E$105,VLOOKUP($CR$48,_Afg07,Udbyttenr)),0))/($CU$50)","v":{"$error":"#DIV/0!"}},{"$f":"(IF(VLOOKUP($CR$36,_Afg07,$BR$131)=1,VLOOKUP($CR$36,_Afg07,AU131)*$C$93*VLOOKUP($CR$36,_Afg07,Halmnr),0)+IF(VLOOKUP($CR$38,_Afg07,$BR$131)=1,VLOOKUP($CR$38,_Afg07,AU131)*$C$95*VLOOKUP($CR$38,_Afg07,Halmnr),0)+IF(VLOOKUP($CR$40,_Afg07,$BR$131)=1,VLOOKUP($CR$40,_Afg07,AU131)*$C$97*VLOOKUP($CR$40,_Afg07,Halmnr),0)+IF(VLOOKUP($CR$42,_Afg07,$BR$131)=1,VLOOKUP($CR$42,_Afg07,AU131)*$C$99*VLOOKUP($CR$42,_Afg07,Halmnr),0)+IF(VLOOKUP($CR$44,_Afg07,$BR$131)=1,VLOOKUP($CR$44,_Afg07,AU131)*$C$101*VLOOKUP($CR$44,_Afg07,Halmnr),0)+IF(VLOOKUP($CR$46,_Afg07,$BR$131)=1,VLOOKUP($CR$46,_Afg07,AU131)*$C$103*VLOOKUP($CR$46,_Afg07,Halmnr),0)+IF(VLOOKUP($CR$48,_Afg07,$BR$131)=1,VLOOKUP($CR$48,_Afg07,AU131)*$C$105*VLOOKUP($CR$48,_Afg07,Halmnr),0))/($CY$50)","v":{"$error":"#VALUE!"}},{"$f":"(IF(VLOOKUP($CR$36,_Afg07,$BR$131)=1,VLOOKUP($CR$36,_Afg07,AV131)*$C$93,0)+IF(VLOOKUP($CR$38,_Afg07,$BR$131)=1,VLOOKUP($CR$38,_Afg07,AV131)*$C$95,0)+IF(VLOOKUP($CR$40,_Afg07,$BR$131)=1,VLOOKUP($CR$40,_Afg07,AV131)*$C$97,0)+IF(VLOOKUP($CR$42,_Afg07,$BR$131)=1,VLOOKUP($CR$42,_Afg07,AV131)*$C$99,0)+IF(VLOOKUP($CR$44,_Afg07,$BR$131)=1,VLOOKUP($CR$44,_Afg07,AV131)*$C$101,0)+IF(VLOOKUP($CR$46,_Afg07,$BR$131)=1,VLOOKUP($CR$46,_Afg07,AV131)*$C$103,0)+IF(VLOOKUP($CR$48,_Afg07,$BR$131)=1,VLOOKUP($CR$48,_Afg07,AV131)*$C$105,0))/($CV$50)","v":{"$error":"#DIV/0!"}},{"$f":"(IF(VLOOKUP($CR$36,_Afg07,$BR$131)=1,VLOOKUP($CR$36,_Afg07,AW131)*$C$93*IF($E$93<>\"\",$E$93,VLOOKUP($CR$36,_Afg07,Udbyttenr)),0)+IF(VLOOKUP($CR$38,_Afg07,$BR$131)=1,VLOOKUP($CR$38,_Afg07,AW131)*$C$95*IF($E$95<>\"\",$E$95,VLOOKUP($CR$38,_Afg07,Udbyttenr)),0)+IF(VLOOKUP($CR$40,_Afg07,$BR$131)=1,VLOOKUP($CR$40,_Afg07,AW131)*$C$97*IF($E$97<>\"\",$E$97,VLOOKUP($CR$40,_Afg07,Udbyttenr)),0)+IF(VLOOKUP($CR$42,_Afg07,$BR$131)=1,VLOOKUP($CR$42,_Afg07,AW131)*$C$99*IF($E$99<>\"\",$E$99,VLOOKUP($CR$42,_Afg07,Udbyttenr)),0)+IF(VLOOKUP($CR$44,_Afg07,$BR$131)=1,VLOOKUP($CR$44,_Afg07,AW131)*$C$101*IF($E$101<>\"\",$E$101,VLOOKUP($CR$44,_Afg07,Udbyttenr)),0)+IF(VLOOKUP($CR$46,_Afg07,$BR$131)=1,VLOOKUP($CR$46,_Afg07,AW131)*$C$103*IF($E$103<>\"\",$E$103,VLOOKUP($CR$46,_Afg07,Udbyttenr)),0)+IF(VLOOKUP($CR$48,_Afg07,$BR$131)=1,VLOOKUP($CR$48,_Afg07,AW131)*$C$105*IF($E$105<>\"\",$E$105,VLOOKUP($CR$48,_Afg07,Udbyttenr)),0))/($CU$50)","v":{"$error":"#DIV/0!"}},{"$f":"(IF(VLOOKUP($CR$36,_Afg07,$BR$131)=1,VLOOKUP($CR$36,_Afg07,AX131)*$C$93*VLOOKUP($CR$36,_Afg07,Halmnr),0)+IF(VLOOKUP($CR$38,_Afg07,$BR$131)=1,VLOOKUP($CR$38,_Afg07,AX131)*$C$95*VLOOKUP($CR$38,_Afg07,Halmnr),0)+IF(VLOOKUP($CR$40,_Afg07,$BR$131)=1,VLOOKUP($CR$40,_Afg07,AX131)*$C$97*VLOOKUP($CR$40,_Afg07,Halmnr),0)+IF(VLOOKUP($CR$42,_Afg07,$BR$131)=1,VLOOKUP($CR$42,_Afg07,AX131)*$C$99*VLOOKUP($CR$42,_Afg07,Halmnr),0)+IF(VLOOKUP($CR$44,_Afg07,$BR$131)=1,VLOOKUP($CR$44,_Afg07,AX131)*$C$101*VLOOKUP($CR$44,_Afg07,Halmnr),0)+IF(VLOOKUP($CR$46,_Afg07,$BR$131)=1,VLOOKUP($CR$46,_Afg07,AX131)*$C$103*VLOOKUP($CR$46,_Afg07,Halmnr),0)+IF(VLOOKUP($CR$48,_Afg07,$BR$131)=1,VLOOKUP($CR$48,_Afg07,AX131)*$C$105*VLOOKUP($CR$48,_Afg07,Halmnr),0))/($CY$50)","v":{"$error":"#VALUE!"}},{"$f":"(IF(VLOOKUP($CR$36,_Afg07,$BR$131)=1,VLOOKUP($CR$36,_Afg07,AY131)*$C$93*IF($E$93<>\"\",$E$93,VLOOKUP($CR$36,_Afg07,Udbyttenr)),0)+IF(VLOOKUP($CR$38,_Afg07,$BR$131)=1,VLOOKUP($CR$38,_Afg07,AY131)*$C$95*IF($E$95<>\"\",$E$95,VLOOKUP($CR$38,_Afg07,Udbyttenr)),0)+IF(VLOOKUP($CR$40,_Afg07,$BR$131)=1,VLOOKUP($CR$40,_Afg07,AY131)*$C$97*IF($E$97<>\"\",$E$97,VLOOKUP($CR$40,_Afg07,Udbyttenr)),0)+IF(VLOOKUP($CR$42,_Afg07,$BR$131)=1,VLOOKUP($CR$42,_Afg07,AY131)*$C$99*IF($E$99<>\"\",$E$99,VLOOKUP($CR$42,_Afg07,Udbyttenr)),0)+IF(VLOOKUP($CR$44,_Afg07,$BR$131)=1,VLOOKUP($CR$44,_Afg07,AY131)*$C$101*IF($E$101<>\"\",$E$101,VLOOKUP($CR$44,_Afg07,Udbyttenr)),0)+IF(VLOOKUP($CR$46,_Afg07,$BR$131)=1,VLOOKUP($CR$46,_Afg07,AY131)*$C$103*IF($E$103<>\"\",$E$103,VLOOKUP($CR$46,_Afg07,Udbyttenr)),0)+IF(VLOOKUP($CR$48,_Afg07,$BR$131)=1,VLOOKUP($CR$48,_Afg07,AY131)*$C$105*IF($E$105<>\"\",$E$105,VLOOKUP($CR$48,_Afg07,Udbyttenr)),0))/($CU$50)","v":{"$error":"#DIV/0!"}},null,{"$f":"(IF(VLOOKUP($CR$36,_Afg07,$BR$131)=1,VLOOKUP($CR$36,_Afg07,BA131)*$C$93,0)+IF(VLOOKUP($CR$38,_Afg07,$BR$131)=1,VLOOKUP($CR$38,_Afg07,BA131)*$C$95,0)+IF(VLOOKUP($CR$40,_Afg07,$BR$131)=1,VLOOKUP($CR$40,_Afg07,BA131)*$C$97,0)+IF(VLOOKUP($CR$42,_Afg07,$BR$131)=1,VLOOKUP($CR$42,_Afg07,BA131)*$C$99,0)+IF(VLOOKUP($CR$44,_Afg07,$BR$131)=1,VLOOKUP($CR$44,_Afg07,BA131)*$C$101,0)+IF(VLOOKUP($CR$46,_Afg07,$BR$131)=1,VLOOKUP($CR$46,_Afg07,BA131)*$C$103,0)+IF(VLOOKUP($CR$48,_Afg07,$BR$131)=1,VLOOKUP($CR$48,_Afg07,BA131)*$C$105,0))/($CV$50)","v":{"$error":"#DIV/0!"}},{"$error":"#DIV/0!"},{"$error":"#DIV/0!"},{"$error":"#DIV/0!"},{"$error":"#DIV/0!"},{"$error":"#DIV/0!"},{"$error":"#DIV/0!"},{"$error":"#DIV/0!"},{"$error":"#DIV/0!"},{"$error":"#DIV/0!"},{"$f":"(IF(VLOOKUP($CR$36,_Afg07,$BR$131)=1,VLOOKUP($CR$36,_Afg07,BK131)*$C$93*IF($E$93<>\"\",$E$93,VLOOKUP($CR$36,_Afg07,Udbyttenr)),0)+IF(VLOOKUP($CR$38,_Afg07,$BR$131)=1,VLOOKUP($CR$38,_Afg07,BK131)*$C$95*IF($E$95<>\"\",$E$95,VLOOKUP($CR$38,_Afg07,Udbyttenr)),0)+IF(VLOOKUP($CR$40,_Afg07,$BR$131)=1,VLOOKUP($CR$40,_Afg07,BK131)*$C$97*IF($E$97<>\"\",$E$97,VLOOKUP($CR$40,_Afg07,Udbyttenr)),0)+IF(VLOOKUP($CR$42,_Afg07,$BR$131)=1,VLOOKUP($CR$42,_Afg07,BK131)*$C$99*IF($E$99<>\"\",$E$99,VLOOKUP($CR$42,_Afg07,Udbyttenr)),0)+IF(VLOOKUP($CR$44,_Afg07,$BR$131)=1,VLOOKUP($CR$44,_Afg07,BK131)*$C$101*IF($E$101<>\"\",$E$101,VLOOKUP($CR$44,_Afg07,Udbyttenr)),0)+IF(VLOOKUP($CR$46,_Afg07,$BR$131)=1,VLOOKUP($CR$46,_Afg07,BK131)*$C$103*IF($E$103<>\"\",$E$103,VLOOKUP($CR$46,_Afg07,Udbyttenr)),0)+IF(VLOOKUP($CR$48,_Afg07,$BR$131)=1,VLOOKUP($CR$48,_Afg07,BK131)*$C$105*IF($E$105<>\"\",$E$105,VLOOKUP($CR$48,_Afg07,Udbyttenr)),0))/($CU$50)","v":{"$error":"#DIV/0!"}},{"$f":"(IF(VLOOKUP($CR$36,_Afg07,$BR$131)=1,VLOOKUP($CR$36,_Afg07,BL131)*$C$93*IF($E$93<>\"\",$E$93,VLOOKUP($CR$36,_Afg07,Udbyttenr)),0)+IF(VLOOKUP($CR$38,_Afg07,$BR$131)=1,VLOOKUP($CR$38,_Afg07,BL131)*$C$95*IF($E$95<>\"\",$E$95,VLOOKUP($CR$38,_Afg07,Udbyttenr)),0)+IF(VLOOKUP($CR$40,_Afg07,$BR$131)=1,VLOOKUP($CR$40,_Afg07,BL131)*$C$97*IF($E$97<>\"\",$E$97,VLOOKUP($CR$40,_Afg07,Udbyttenr)),0)+IF(VLOOKUP($CR$42,_Afg07,$BR$131)=1,VLOOKUP($CR$42,_Afg07,BL131)*$C$99*IF($E$99<>\"\",$E$99,VLOOKUP($CR$42,_Afg07,Udbyttenr)),0)+IF(VLOOKUP($CR$44,_Afg07,$BR$131)=1,VLOOKUP($CR$44,_Afg07,BL131)*$C$101*IF($E$101<>\"\",$E$101,VLOOKUP($CR$44,_Afg07,Udbyttenr)),0)+IF(VLOOKUP($CR$46,_Afg07,$BR$131)=1,VLOOKUP($CR$46,_Afg07,BL131)*$C$103*IF($E$103<>\"\",$E$103,VLOOKUP($CR$46,_Afg07,Udbyttenr)),0)+IF(VLOOKUP($CR$48,_Afg07,$BR$131)=1,VLOOKUP($CR$48,_Afg07,BL131)*$C$105*IF($E$105<>\"\",$E$105,VLOOKUP($CR$48,_Afg07,Udbyttenr)),0))/($CU$50)","v":{"$error":"#DIV/0!"}},null,{"$f":"(IF(VLOOKUP($CR$36,_Afg07,$BR$131)=1,VLOOKUP($CR$36,_Afg07,BN131)*$C$93*IF($E$93<>\"\",$E$93,VLOOKUP($CR$36,_Afg07,Udbyttenr)),0)+IF(VLOOKUP($CR$38,_Afg07,$BR$131)=1,VLOOKUP($CR$38,_Afg07,BN131)*$C$95*IF($E$95<>\"\",$E$95,VLOOKUP($CR$38,_Afg07,Udbyttenr)),0)+IF(VLOOKUP($CR$40,_Afg07,$BR$131)=1,VLOOKUP($CR$40,_Afg07,BN131)*$C$97*IF($E$97<>\"\",$E$97,VLOOKUP($CR$40,_Afg07,Udbyttenr)),0)+IF(VLOOKUP($CR$42,_Afg07,$BR$131)=1,VLOOKUP($CR$42,_Afg07,BN131)*$C$99*IF($E$99<>\"\",$E$99,VLOOKUP($CR$42,_Afg07,Udbyttenr)),0)+IF(VLOOKUP($CR$44,_Afg07,$BR$131)=1,VLOOKUP($CR$44,_Afg07,BN131)*$C$101*IF($E$101<>\"\",$E$101,VLOOKUP($CR$44,_Afg07,Udbyttenr)),0)+IF(VLOOKUP($CR$46,_Afg07,$BR$131)=1,VLOOKUP($CR$46,_Afg07,BN131)*$C$103*IF($E$103<>\"\",$E$103,VLOOKUP($CR$46,_Afg07,Udbyttenr)),0)+IF(VLOOKUP($CR$48,_Afg07,$BR$131)=1,VLOOKUP($CR$48,_Afg07,BN131)*$C$105*IF($E$105<>\"\",$E$105,VLOOKUP($CR$48,_Afg07,Udbyttenr)),0))/($CU$50)","v":{"$error":"#DIV/0!"}},{"$f":"(IF(VLOOKUP($CR$36,_Afg07,$BR$131)=1,VLOOKUP($CR$36,_Afg07,BO131)*$C$93*IF($E$93<>\"\",$E$93,VLOOKUP($CR$36,_Afg07,Udbyttenr)),0)+IF(VLOOKUP($CR$38,_Afg07,$BR$131)=1,VLOOKUP($CR$38,_Afg07,BO131)*$C$95*IF($E$95<>\"\",$E$95,VLOOKUP($CR$38,_Afg07,Udbyttenr)),0)+IF(VLOOKUP($CR$40,_Afg07,$BR$131)=1,VLOOKUP($CR$40,_Afg07,BO131)*$C$97*IF($E$97<>\"\",$E$97,VLOOKUP($CR$40,_Afg07,Udbyttenr)),0)+IF(VLOOKUP($CR$42,_Afg07,$BR$131)=1,VLOOKUP($CR$42,_Afg07,BO131)*$C$99*IF($E$99<>\"\",$E$99,VLOOKUP($CR$42,_Afg07,Udbyttenr)),0)+IF(VLOOKUP($CR$44,_Afg07,$BR$131)=1,VLOOKUP($CR$44,_Afg07,BO131)*$C$101*IF($E$101<>\"\",$E$101,VLOOKUP($CR$44,_Afg07,Udbyttenr)),0)+IF(VLOOKUP($CR$46,_Afg07,$BR$131)=1,VLOOKUP($CR$46,_Afg07,BO131)*$C$103*IF($E$103<>\"\",$E$103,VLOOKUP($CR$46,_Afg07,Udbyttenr)),0)+IF(VLOOKUP($CR$48,_Afg07,$BR$131)=1,VLOOKUP($CR$48,_Afg07,BO131)*$C$105*IF($E$105<>\"\",$E$105,VLOOKUP($CR$48,_Afg07,Udbyttenr)),0))/($CU$50)","v":{"$error":"#DIV/0!"}},{"$f":"(IF(VLOOKUP($CR$36,_Afg07,$BR$131)=1,VLOOKUP($CR$36,_Afg07,BP131)*$C$93*IF($E$93<>\"\",$E$93,VLOOKUP($CR$36,_Afg07,Udbyttenr)),0)+IF(VLOOKUP($CR$38,_Afg07,$BR$131)=1,VLOOKUP($CR$38,_Afg07,BP131)*$C$95*IF($E$95<>\"\",$E$95,VLOOKUP($CR$38,_Afg07,Udbyttenr)),0)+IF(VLOOKUP($CR$40,_Afg07,$BR$131)=1,VLOOKUP($CR$40,_Afg07,BP131)*$C$97*IF($E$97<>\"\",$E$97,VLOOKUP($CR$40,_Afg07,Udbyttenr)),0)+IF(VLOOKUP($CR$42,_Afg07,$BR$131)=1,VLOOKUP($CR$42,_Afg07,BP131)*$C$99*IF($E$99<>\"\",$E$99,VLOOKUP($CR$42,_Afg07,Udbyttenr)),0)+IF(VLOOKUP($CR$44,_Afg07,$BR$131)=1,VLOOKUP($CR$44,_Afg07,BP131)*$C$101*IF($E$101<>\"\",$E$101,VLOOKUP($CR$44,_Afg07,Udbyttenr)),0)+IF(VLOOKUP($CR$46,_Afg07,$BR$131)=1,VLOOKUP($CR$46,_Afg07,BP131)*$C$103*IF($E$103<>\"\",$E$103,VLOOKUP($CR$46,_Afg07,Udbyttenr)),0)+IF(VLOOKUP($CR$48,_Afg07,$BR$131)=1,VLOOKUP($CR$48,_Afg07,BP131)*$C$105*IF($E$105<>\"\",$E$105,VLOOKUP($CR$48,_Afg07,Udbyttenr)),0))/($CU$50)","v":{"$error":"#DIV/0!"}},{"$f":"(IF(VLOOKUP($CR$36,_Afg07,$BR$131)=1,VLOOKUP($CR$36,_Afg07,BQ131)*$C$93*IF($E$93<>\"\",$E$93,VLOOKUP($CR$36,_Afg07,Udbyttenr)),0)+IF(VLOOKUP($CR$38,_Afg07,$BR$131)=1,VLOOKUP($CR$38,_Afg07,BQ131)*$C$95*IF($E$95<>\"\",$E$95,VLOOKUP($CR$38,_Afg07,Udbyttenr)),0)+IF(VLOOKUP($CR$40,_Afg07,$BR$131)=1,VLOOKUP($CR$40,_Afg07,BQ131)*$C$97*IF($E$97<>\"\",$E$97,VLOOKUP($CR$40,_Afg07,Udbyttenr)),0)+IF(VLOOKUP($CR$42,_Afg07,$BR$131)=1,VLOOKUP($CR$42,_Afg07,BQ131)*$C$99*IF($E$99<>\"\",$E$99,VLOOKUP($CR$42,_Afg07,Udbyttenr)),0)+IF(VLOOKUP($CR$44,_Afg07,$BR$131)=1,VLOOKUP($CR$44,_Afg07,BQ131)*$C$101*IF($E$101<>\"\",$E$101,VLOOKUP($CR$44,_Afg07,Udbyttenr)),0)+IF(VLOOKUP($CR$46,_Afg07,$BR$131)=1,VLOOKUP($CR$46,_Afg07,BQ131)*$C$103*IF($E$103<>\"\",$E$103,VLOOKUP($CR$46,_Afg07,Udbyttenr)),0)+IF(VLOOKUP($CR$48,_Afg07,$BR$131)=1,VLOOKUP($CR$48,_Afg07,BQ131)*$C$105*IF($E$105<>\"\",$E$105,VLOOKUP($CR$48,_Afg07,Udbyttenr)),0))/($CU$50)","v":{"$error":"#DIV/0!"}}]
[{"$f":"IF(Købernr=2,\"Erstatningskorn\",\"\")","v":""},{"$f":"IF(Købernr=1,\"\",IF($E$174=\"\",\"\",IF(CR$16=O$185,C48,IF(CS$16=O$185,G48,IF(CT$16=O$185,K48,\"\")))*C$107))","v":""},null,{"$f":"IF(B191=\"\",\"\",\"kr.\")","v":""},null,{"$f":"IF(Købernr=1,\"\",IF($H$174=\"\",\"\",IF(CR$16=O$186,C48,IF(CS$16=O$186,G48,IF(CT$16=O$186,K48,\"\")))*C$127))","v":""},null,{"$f":"IF(F191=\"\",\"\",\"kr.\")","v":""},null,{"$f":"IF(Købernr=1,\"\",IF(AND($E$174<>\"\",$H$174<>\"\"),F191-B191,\"\"))","v":""},null,{"$f":"IF(J191=\"\",\"\",\"kr.\")","v":""},null,null,2,null,null,null,null,null,null,null,null,{"$f":"(IF(VLOOKUP($CR$37,_Afg07,$BR$131)=1,VLOOKUP($CR$37,_Afg07,X131)*$C$113,0)+IF(VLOOKUP($CR$39,_Afg07,$BR$131)=1,VLOOKUP($CR$39,_Afg07,X131)*$C$115,0)+IF(VLOOKUP($CR$41,_Afg07,$BR$131)=1,VLOOKUP($CR$41,_Afg07,X131)*$C$117,0)+IF(VLOOKUP($CR$43,_Afg07,$BR$131)=1,VLOOKUP($CR$43,_Afg07,X131)*$C$119,0)+IF(VLOOKUP($CR$45,_Afg07,$BR$131)=1,VLOOKUP($CR$45,_Afg07,X131)*$C$121,0)+IF(VLOOKUP($CR$47,_Afg07,$BR$131)=1,VLOOKUP($CR$47,_Afg07,X131)*$C$123,0)+IF(VLOOKUP($CR$49,_Afg07,$BR$131)=1,VLOOKUP($CR$49,_Afg07,X131)*$C$125,0))/($CV$51)","v":{"$error":"#DIV/0!"}},{"$f":"(IF(VLOOKUP($CR$37,_Afg07,$BR$131)=1,VLOOKUP($CR$37,_Afg07,Y131)*$C$113,0)+IF(VLOOKUP($CR$39,_Afg07,$BR$131)=1,VLOOKUP($CR$39,_Afg07,Y131)*$C$115,0)+IF(VLOOKUP($CR$41,_Afg07,$BR$131)=1,VLOOKUP($CR$41,_Afg07,Y131)*$C$117,0)+IF(VLOOKUP($CR$43,_Afg07,$BR$131)=1,VLOOKUP($CR$43,_Afg07,Y131)*$C$119,0)+IF(VLOOKUP($CR$45,_Afg07,$BR$131)=1,VLOOKUP($CR$45,_Afg07,Y131)*$C$121,0)+IF(VLOOKUP($CR$47,_Afg07,$BR$131)=1,VLOOKUP($CR$47,_Afg07,Y131)*$C$123,0)+IF(VLOOKUP($CR$49,_Afg07,$BR$131)=1,VLOOKUP($CR$49,_Afg07,Y131)*$C$125,0))/($CV$51)","v":{"$error":"#DIV/0!"}},{"$f":"(IF(VLOOKUP($CR$37,_Afg07,$BR$131)=1,VLOOKUP($CR$37,_Afg07,Z131)*$C$113,0)+IF(VLOOKUP($CR$39,_Afg07,$BR$131)=1,VLOOKUP($CR$39,_Afg07,Z131)*$C$115,0)+IF(VLOOKUP($CR$41,_Afg07,$BR$131)=1,VLOOKUP($CR$41,_Afg07,Z131)*$C$117,0)+IF(VLOOKUP($CR$43,_Afg07,$BR$131)=1,VLOOKUP($CR$43,_Afg07,Z131)*$C$119,0)+IF(VLOOKUP($CR$45,_Afg07,$BR$131)=1,VLOOKUP($CR$45,_Afg07,Z131)*$C$121,0)+IF(VLOOKUP($CR$47,_Afg07,$BR$131)=1,VLOOKUP($CR$47,_Afg07,Z131)*$C$123,0)+IF(VLOOKUP($CR$49,_Afg07,$BR$131)=1,VLOOKUP($CR$49,_Afg07,Z131)*$C$125,0))/($CV$51)","v":{"$error":"#DIV/0!"}},{"$f":"(IF(VLOOKUP($CR$37,_Afg07,$BR$131)=1,VLOOKUP($CR$37,_Afg07,AA131)*$C$113,0)+IF(VLOOKUP($CR$39,_Afg07,$BR$131)=1,VLOOKUP($CR$39,_Afg07,AA131)*$C$115,0)+IF(VLOOKUP($CR$41,_Afg07,$BR$131)=1,VLOOKUP($CR$41,_Afg07,AA131)*$C$117,0)+IF(VLOOKUP($CR$43,_Afg07,$BR$131)=1,VLOOKUP($CR$43,_Afg07,AA131)*$C$119,0)+IF(VLOOKUP($CR$45,_Afg07,$BR$131)=1,VLOOKUP($CR$45,_Afg07,AA131)*$C$121,0)+IF(VLOOKUP($CR$47,_Afg07,$BR$131)=1,VLOOKUP($CR$47,_Afg07,AA131)*$C$123,0)+IF(VLOOKUP($CR$49,_Afg07,$BR$131)=1,VLOOKUP($CR$49,_Afg07,AA131)*$C$125,0))/($CV$51)","v":{"$error":"#DIV/0!"}},{"$f":"(IF(VLOOKUP($CR$37,_Afg07,$BR$131)=1,VLOOKUP($CR$37,_Afg07,AB131)*$C$113,0)+IF(VLOOKUP($CR$39,_Afg07,$BR$131)=1,VLOOKUP($CR$39,_Afg07,AB131)*$C$115,0)+IF(VLOOKUP($CR$41,_Afg07,$BR$131)=1,VLOOKUP($CR$41,_Afg07,AB131)*$C$117,0)+IF(VLOOKUP($CR$43,_Afg07,$BR$131)=1,VLOOKUP($CR$43,_Afg07,AB131)*$C$119,0)+IF(VLOOKUP($CR$45,_Afg07,$BR$131)=1,VLOOKUP($CR$45,_Afg07,AB131)*$C$121,0)+IF(VLOOKUP($CR$47,_Afg07,$BR$131)=1,VLOOKUP($CR$47,_Afg07,AB131)*$C$123,0)+IF(VLOOKUP($CR$49,_Afg07,$BR$131)=1,VLOOKUP($CR$49,_Afg07,AB131)*$C$125,0))/($CV$51)","v":{"$error":"#DIV/0!"}},null,null,null,null,null,null,{"$f":"(IF(VLOOKUP($CR$37,_Afg07,$BR$131)=1,VLOOKUP($CR$37,_Afg07,AI131)*$C$113,0)+IF(VLOOKUP($CR$39,_Afg07,$BR$131)=1,VLOOKUP($CR$39,_Afg07,AI131)*$C$115,0)+IF(VLOOKUP($CR$41,_Afg07,$BR$131)=1,VLOOKUP($CR$41,_Afg07,AI131)*$C$117,0)+IF(VLOOKUP($CR$43,_Afg07,$BR$131)=1,VLOOKUP($CR$43,_Afg07,AI131)*$C$119,0)+IF(VLOOKUP($CR$45,_Afg07,$BR$131)=1,VLOOKUP($CR$45,_Afg07,AI131)*$C$121,0)+IF(VLOOKUP($CR$47,_Afg07,$BR$131)=1,VLOOKUP($CR$47,_Afg07,AI131)*$C$123,0)+IF(VLOOKUP($CR$49,_Afg07,$BR$131)=1,VLOOKUP($CR$49,_Afg07,AI131)*$C$125,0))/($CV$51)","v":{"$error":"#DIV/0!"}},{"$f":"(IF(VLOOKUP($CR$37,_Afg07,$BR$131)=1,VLOOKUP($CR$37,_Afg07,AJ131)*$C$113,0)+IF(VLOOKUP($CR$39,_Afg07,$BR$131)=1,VLOOKUP($CR$39,_Afg07,AJ131)*$C$115,0)+IF(VLOOKUP($CR$41,_Afg07,$BR$131)=1,VLOOKUP($CR$41,_Afg07,AJ131)*$C$117,0)+IF(VLOOKUP($CR$43,_Afg07,$BR$131)=1,VLOOKUP($CR$43,_Afg07,AJ131)*$C$119,0)+IF(VLOOKUP($CR$45,_Afg07,$BR$131)=1,VLOOKUP($CR$45,_Afg07,AJ131)*$C$121,0)+IF(VLOOKUP($CR$47,_Afg07,$BR$131)=1,VLOOKUP($CR$47,_Afg07,AJ131)*$C$123,0)+IF(VLOOKUP($CR$49,_Afg07,$BR$131)=1,VLOOKUP($CR$49,_Afg07,AJ131)*$C$125,0))/($CV$51)","v":{"$error":"#DIV/0!"}},{"$f":"(IF(VLOOKUP($CR$37,_Afg07,$BR$131)=1,VLOOKUP($CR$37,_Afg07,AK131)*$C$113,0)+IF(VLOOKUP($CR$39,_Afg07,$BR$131)=1,VLOOKUP($CR$39,_Afg07,AK131)*$C$115,0)+IF(VLOOKUP($CR$41,_Afg07,$BR$131)=1,VLOOKUP($CR$41,_Afg07,AK131)*$C$117,0)+IF(VLOOKUP($CR$43,_Afg07,$BR$131)=1,VLOOKUP($CR$43,_Afg07,AK131)*$C$119,0)+IF(VLOOKUP($CR$45,_Afg07,$BR$131)=1,VLOOKUP($CR$45,_Afg07,AK131)*$C$121,0)+IF(VLOOKUP($CR$47,_Afg07,$BR$131)=1,VLOOKUP($CR$47,_Afg07,AK131)*$C$123,0)+IF(VLOOKUP($CR$49,_Afg07,$BR$131)=1,VLOOKUP($CR$49,_Afg07,AK131)*$C$125,0))/($CV$51)","v":{"$error":"#DIV/0!"}},null,{"$f":"(IF(VLOOKUP($CR$37,_Afg07,$BR$131)=1,VLOOKUP($CR$37,_Afg07,AM131)*$C$113,0)+IF(VLOOKUP($CR$39,_Afg07,$BR$131)=1,VLOOKUP($CR$39,_Afg07,AM131)*$C$115,0)+IF(VLOOKUP($CR$41,_Afg07,$BR$131)=1,VLOOKUP($CR$41,_Afg07,AM131)*$C$117,0)+IF(VLOOKUP($CR$43,_Afg07,$BR$131)=1,VLOOKUP($CR$43,_Afg07,AM131)*$C$119,0)+IF(VLOOKUP($CR$45,_Afg07,$BR$131)=1,VLOOKUP($CR$45,_Afg07,AM131)*$C$121,0)+IF(VLOOKUP($CR$47,_Afg07,$BR$131)=1,VLOOKUP($CR$47,_Afg07,AM131)*$C$123,0)+IF(VLOOKUP($CR$49,_Afg07,$BR$131)=1,VLOOKUP($CR$49,_Afg07,AM131)*$C$125,0))/($CV$51)","v":{"$error":"#DIV/0!"}},{"$error":"#DIV/0!"},{"$error":"#DIV/0!"},{"$error":"#DIV/0!"},{"$error":"#DIV/0!"},{"$error":"#DIV/0!"},{"$error":"#DIV/0!"},{"$f":"(IF(VLOOKUP($CR$37,_Afg07,$BR$131)=1,VLOOKUP($CR$37,_Afg07,AT131)*$C$113*IF($E$113<>\"\",$E$113,VLOOKUP($CR$37,_Afg07,Udbyttenr)),0)+IF(VLOOKUP($CR$39,_Afg07,$BR$131)=1,VLOOKUP($CR$39,_Afg07,AT131)*$C$115*IF($E$115<>\"\",$E$115,VLOOKUP($CR$39,_Afg07,Udbyttenr)),0)+IF(VLOOKUP($CR$41,_Afg07,$BR$131)=1,VLOOKUP($CR$41,_Afg07,AT131)*$C$117*IF($E$117<>\"\",$E$117,VLOOKUP($CR$41,_Afg07,Udbyttenr)),0)+IF(VLOOKUP($CR$43,_Afg07,$BR$131)=1,VLOOKUP($CR$43,_Afg07,AT131)*$C$119*IF($E$119<>\"\",$E$119,VLOOKUP($CR$43,_Afg07,Udbyttenr)),0)+IF(VLOOKUP($CR$45,_Afg07,$BR$131)=1,VLOOKUP($CR$45,_Afg07,AT131)*$C$121*IF($E$121<>\"\",$E$121,VLOOKUP($CR$45,_Afg07,Udbyttenr)),0)+IF(VLOOKUP($CR$47,_Afg07,$BR$131)=1,VLOOKUP($CR$47,_Afg07,AT131)*$C$123*IF($E$123<>\"\",$E$123,VLOOKUP($CR$47,_Afg07,Udbyttenr)),0)+IF(VLOOKUP($CR$49,_Afg07,$BR$131)=1,VLOOKUP($CR$49,_Afg07,AT131)*$C$125*IF($E$125<>\"\",$E$125,VLOOKUP($CR$49,_Afg07,Udbyttenr)),0))/($CU$51)","v":{"$error":"#DIV/0!"}},{"$f":"(IF(VLOOKUP($CR$37,_Afg07,$BR$131)=1,VLOOKUP($CR$37,_Afg07,AU131)*$C$113*VLOOKUP($CR$37,_Afg07,Halmnr),0)+IF(VLOOKUP($CR$39,_Afg07,$BR$131)=1,VLOOKUP($CR$39,_Afg07,AU131)*$C$115*VLOOKUP($CR$39,_Afg07,Halmnr),0)+IF(VLOOKUP($CR$41,_Afg07,$BR$131)=1,VLOOKUP($CR$41,_Afg07,AU131)*$C$117*VLOOKUP($CR$41,_Afg07,Halmnr),0)+IF(VLOOKUP($CR$43,_Afg07,$BR$131)=1,VLOOKUP($CR$43,_Afg07,AU131)*$C$119*VLOOKUP($CR$43,_Afg07,Halmnr),0)+IF(VLOOKUP($CR$45,_Afg07,$BR$131)=1,VLOOKUP($CR$45,_Afg07,AU131)*$C$121*VLOOKUP($CR$45,_Afg07,Halmnr),0)+IF(VLOOKUP($CR$47,_Afg07,$BR$131)=1,VLOOKUP($CR$47,_Afg07,AU131)*$C$123*VLOOKUP($CR$47,_Afg07,Halmnr),0)+IF(VLOOKUP($CR$49,_Afg07,$BR$131)=1,VLOOKUP($CR$49,_Afg07,AU131)*$C$125*VLOOKUP($CR$49,_Afg07,Halmnr),0))/($CY$51)","v":{"$error":"#VALUE!"}},{"$f":"(IF(VLOOKUP($CR$37,_Afg07,$BR$131)=1,VLOOKUP($CR$37,_Afg07,AV131)*$C$113,0)+IF(VLOOKUP($CR$39,_Afg07,$BR$131)=1,VLOOKUP($CR$39,_Afg07,AV131)*$C$115,0)+IF(VLOOKUP($CR$41,_Afg07,$BR$131)=1,VLOOKUP($CR$41,_Afg07,AV131)*$C$117,0)+IF(VLOOKUP($CR$43,_Afg07,$BR$131)=1,VLOOKUP($CR$43,_Afg07,AV131)*$C$119,0)+IF(VLOOKUP($CR$45,_Afg07,$BR$131)=1,VLOOKUP($CR$45,_Afg07,AV131)*$C$121,0)+IF(VLOOKUP($CR$47,_Afg07,$BR$131)=1,VLOOKUP($CR$47,_Afg07,AV131)*$C$123,0)+IF(VLOOKUP($CR$49,_Afg07,$BR$131)=1,VLOOKUP($CR$49,_Afg07,AV131)*$C$125,0))/($CV$51)","v":{"$error":"#DIV/0!"}},{"$f":"(IF(VLOOKUP($CR$37,_Afg07,$BR$131)=1,VLOOKUP($CR$37,_Afg07,AW131)*$C$113*IF($E$113<>\"\",$E$113,VLOOKUP($CR$37,_Afg07,Udbyttenr)),0)+IF(VLOOKUP($CR$39,_Afg07,$BR$131)=1,VLOOKUP($CR$39,_Afg07,AW131)*$C$115*IF($E$115<>\"\",$E$115,VLOOKUP($CR$39,_Afg07,Udbyttenr)),0)+IF(VLOOKUP($CR$41,_Afg07,$BR$131)=1,VLOOKUP($CR$41,_Afg07,AW131)*$C$117*IF($E$117<>\"\",$E$117,VLOOKUP($CR$41,_Afg07,Udbyttenr)),0)+IF(VLOOKUP($CR$43,_Afg07,$BR$131)=1,VLOOKUP($CR$43,_Afg07,AW131)*$C$119*IF($E$119<>\"\",$E$119,VLOOKUP($CR$43,_Afg07,Udbyttenr)),0)+IF(VLOOKUP($CR$45,_Afg07,$BR$131)=1,VLOOKUP($CR$45,_Afg07,AW131)*$C$121*IF($E$121<>\"\",$E$121,VLOOKUP($CR$45,_Afg07,Udbyttenr)),0)+IF(VLOOKUP($CR$47,_Afg07,$BR$131)=1,VLOOKUP($CR$47,_Afg07,AW131)*$C$123*IF($E$123<>\"\",$E$123,VLOOKUP($CR$47,_Afg07,Udbyttenr)),0)+IF(VLOOKUP($CR$49,_Afg07,$BR$131)=1,VLOOKUP($CR$49,_Afg07,AW131)*$C$125*IF($E$125<>\"\",$E$125,VLOOKUP($CR$49,_Afg07,Udbyttenr)),0))/($CU$51)","v":{"$error":"#DIV/0!"}},{"$f":"(IF(VLOOKUP($CR$37,_Afg07,$BR$131)=1,VLOOKUP($CR$37,_Afg07,AX131)*$C$113*VLOOKUP($CR$37,_Afg07,Halmnr),0)+IF(VLOOKUP($CR$39,_Afg07,$BR$131)=1,VLOOKUP($CR$39,_Afg07,AX131)*$C$115*VLOOKUP($CR$39,_Afg07,Halmnr),0)+IF(VLOOKUP($CR$41,_Afg07,$BR$131)=1,VLOOKUP($CR$41,_Afg07,AX131)*$C$117*VLOOKUP($CR$41,_Afg07,Halmnr),0)+IF(VLOOKUP($CR$43,_Afg07,$BR$131)=1,VLOOKUP($CR$43,_Afg07,AX131)*$C$119*VLOOKUP($CR$43,_Afg07,Halmnr),0)+IF(VLOOKUP($CR$45,_Afg07,$BR$131)=1,VLOOKUP($CR$45,_Afg07,AX131)*$C$121*VLOOKUP($CR$45,_Afg07,Halmnr),0)+IF(VLOOKUP($CR$47,_Afg07,$BR$131)=1,VLOOKUP($CR$47,_Afg07,AX131)*$C$123*VLOOKUP($CR$47,_Afg07,Halmnr),0)+IF(VLOOKUP($CR$49,_Afg07,$BR$131)=1,VLOOKUP($CR$49,_Afg07,AX131)*$C$125*VLOOKUP($CR$49,_Afg07,Halmnr),0))/($CY$51)","v":{"$error":"#VALUE!"}},{"$f":"(IF(VLOOKUP($CR$37,_Afg07,$BR$131)=1,VLOOKUP($CR$37,_Afg07,AY131)*$C$113*IF($E$113<>\"\",$E$113,VLOOKUP($CR$37,_Afg07,Udbyttenr)),0)+IF(VLOOKUP($CR$39,_Afg07,$BR$131)=1,VLOOKUP($CR$39,_Afg07,AY131)*$C$115*IF($E$115<>\"\",$E$115,VLOOKUP($CR$39,_Afg07,Udbyttenr)),0)+IF(VLOOKUP($CR$41,_Afg07,$BR$131)=1,VLOOKUP($CR$41,_Afg07,AY131)*$C$117*IF($E$117<>\"\",$E$117,VLOOKUP($CR$41,_Afg07,Udbyttenr)),0)+IF(VLOOKUP($CR$43,_Afg07,$BR$131)=1,VLOOKUP($CR$43,_Afg07,AY131)*$C$119*IF($E$119<>\"\",$E$119,VLOOKUP($CR$43,_Afg07,Udbyttenr)),0)+IF(VLOOKUP($CR$45,_Afg07,$BR$131)=1,VLOOKUP($CR$45,_Afg07,AY131)*$C$121*IF($E$121<>\"\",$E$121,VLOOKUP($CR$45,_Afg07,Udbyttenr)),0)+IF(VLOOKUP($CR$47,_Afg07,$BR$131)=1,VLOOKUP($CR$47,_Afg07,AY131)*$C$123*IF($E$123<>\"\",$E$123,VLOOKUP($CR$47,_Afg07,Udbyttenr)),0)+IF(VLOOKUP($CR$49,_Afg07,$BR$131)=1,VLOOKUP($CR$49,_Afg07,AY131)*$C$125*IF($E$125<>\"\",$E$125,VLOOKUP($CR$49,_Afg07,Udbyttenr)),0))/($CU$51)","v":{"$error":"#DIV/0!"}},null,{"$f":"(IF(VLOOKUP($CR$37,_Afg07,$BR$131)=1,VLOOKUP($CR$37,_Afg07,BA131)*$C$113,0)+IF(VLOOKUP($CR$39,_Afg07,$BR$131)=1,VLOOKUP($CR$39,_Afg07,BA131)*$C$115,0)+IF(VLOOKUP($CR$41,_Afg07,$BR$131)=1,VLOOKUP($CR$41,_Afg07,BA131)*$C$117,0)+IF(VLOOKUP($CR$43,_Afg07,$BR$131)=1,VLOOKUP($CR$43,_Afg07,BA131)*$C$119,0)+IF(VLOOKUP($CR$45,_Afg07,$BR$131)=1,VLOOKUP($CR$45,_Afg07,BA131)*$C$121,0)+IF(VLOOKUP($CR$47,_Afg07,$BR$131)=1,VLOOKUP($CR$47,_Afg07,BA131)*$C$123,0)+IF(VLOOKUP($CR$49,_Afg07,$BR$131)=1,VLOOKUP($CR$49,_Afg07,BA131)*$C$125,0))/($CV$51)","v":{"$error":"#DIV/0!"}},{"$error":"#DIV/0!"},{"$error":"#DIV/0!"},{"$error":"#DIV/0!"},{"$error":"#DIV/0!"},{"$error":"#DIV/0!"},{"$error":"#DIV/0!"},{"$error":"#DIV/0!"},{"$error":"#DIV/0!"},{"$error":"#DIV/0!"},{"$f":"(IF(VLOOKUP($CR$37,_Afg07,$BR$131)=1,VLOOKUP($CR$37,_Afg07,BK131)*$C$113*IF($E$113<>\"\",$E$113,VLOOKUP($CR$37,_Afg07,Udbyttenr)),0)+IF(VLOOKUP($CR$39,_Afg07,$BR$131)=1,VLOOKUP($CR$39,_Afg07,BK131)*$C$115*IF($E$115<>\"\",$E$115,VLOOKUP($CR$39,_Afg07,Udbyttenr)),0)+IF(VLOOKUP($CR$41,_Afg07,$BR$131)=1,VLOOKUP($CR$41,_Afg07,BK131)*$C$117*IF($E$117<>\"\",$E$117,VLOOKUP($CR$41,_Afg07,Udbyttenr)),0)+IF(VLOOKUP($CR$43,_Afg07,$BR$131)=1,VLOOKUP($CR$43,_Afg07,BK131)*$C$119*IF($E$119<>\"\",$E$119,VLOOKUP($CR$43,_Afg07,Udbyttenr)),0)+IF(VLOOKUP($CR$45,_Afg07,$BR$131)=1,VLOOKUP($CR$45,_Afg07,BK131)*$C$121*IF($E$121<>\"\",$E$121,VLOOKUP($CR$45,_Afg07,Udbyttenr)),0)+IF(VLOOKUP($CR$47,_Afg07,$BR$131)=1,VLOOKUP($CR$47,_Afg07,BK131)*$C$123*IF($E$123<>\"\",$E$123,VLOOKUP($CR$47,_Afg07,Udbyttenr)),0)+IF(VLOOKUP($CR$49,_Afg07,$BR$131)=1,VLOOKUP($CR$49,_Afg07,BK131)*$C$125*IF($E$125<>\"\",$E$125,VLOOKUP($CR$49,_Afg07,Udbyttenr)),0))/($CU$51)","v":{"$error":"#DIV/0!"}},{"$f":"(IF(VLOOKUP($CR$37,_Afg07,$BR$131)=1,VLOOKUP($CR$37,_Afg07,BL131)*$C$113*IF($E$113<>\"\",$E$113,VLOOKUP($CR$37,_Afg07,Udbyttenr)),0)+IF(VLOOKUP($CR$39,_Afg07,$BR$131)=1,VLOOKUP($CR$39,_Afg07,BL131)*$C$115*IF($E$115<>\"\",$E$115,VLOOKUP($CR$39,_Afg07,Udbyttenr)),0)+IF(VLOOKUP($CR$41,_Afg07,$BR$131)=1,VLOOKUP($CR$41,_Afg07,BL131)*$C$117*IF($E$117<>\"\",$E$117,VLOOKUP($CR$41,_Afg07,Udbyttenr)),0)+IF(VLOOKUP($CR$43,_Afg07,$BR$131)=1,VLOOKUP($CR$43,_Afg07,BL131)*$C$119*IF($E$119<>\"\",$E$119,VLOOKUP($CR$43,_Afg07,Udbyttenr)),0)+IF(VLOOKUP($CR$45,_Afg07,$BR$131)=1,VLOOKUP($CR$45,_Afg07,BL131)*$C$121*IF($E$121<>\"\",$E$121,VLOOKUP($CR$45,_Afg07,Udbyttenr)),0)+IF(VLOOKUP($CR$47,_Afg07,$BR$131)=1,VLOOKUP($CR$47,_Afg07,BL131)*$C$123*IF($E$123<>\"\",$E$123,VLOOKUP($CR$47,_Afg07,Udbyttenr)),0)+IF(VLOOKUP($CR$49,_Afg07,$BR$131)=1,VLOOKUP($CR$49,_Afg07,BL131)*$C$125*IF($E$125<>\"\",$E$125,VLOOKUP($CR$49,_Afg07,Udbyttenr)),0))/($CU$51)","v":{"$error":"#DIV/0!"}},null,{"$f":"(IF(VLOOKUP($CR$37,_Afg07,$BR$131)=1,VLOOKUP($CR$37,_Afg07,BN131)*$C$113*IF($E$113<>\"\",$E$113,VLOOKUP($CR$37,_Afg07,Udbyttenr)),0)+IF(VLOOKUP($CR$39,_Afg07,$BR$131)=1,VLOOKUP($CR$39,_Afg07,BN131)*$C$115*IF($E$115<>\"\",$E$115,VLOOKUP($CR$39,_Afg07,Udbyttenr)),0)+IF(VLOOKUP($CR$41,_Afg07,$BR$131)=1,VLOOKUP($CR$41,_Afg07,BN131)*$C$117*IF($E$117<>\"\",$E$117,VLOOKUP($CR$41,_Afg07,Udbyttenr)),0)+IF(VLOOKUP($CR$43,_Afg07,$BR$131)=1,VLOOKUP($CR$43,_Afg07,BN131)*$C$119*IF($E$119<>\"\",$E$119,VLOOKUP($CR$43,_Afg07,Udbyttenr)),0)+IF(VLOOKUP($CR$45,_Afg07,$BR$131)=1,VLOOKUP($CR$45,_Afg07,BN131)*$C$121*IF($E$121<>\"\",$E$121,VLOOKUP($CR$45,_Afg07,Udbyttenr)),0)+IF(VLOOKUP($CR$47,_Afg07,$BR$131)=1,VLOOKUP($CR$47,_Afg07,BN131)*$C$123*IF($E$123<>\"\",$E$123,VLOOKUP($CR$47,_Afg07,Udbyttenr)),0)+IF(VLOOKUP($CR$49,_Afg07,$BR$131)=1,VLOOKUP($CR$49,_Afg07,BN131)*$C$125*IF($E$125<>\"\",$E$125,VLOOKUP($CR$49,_Afg07,Udbyttenr)),0))/($CU$51)","v":{"$error":"#DIV/0!"}},{"$f":"(IF(VLOOKUP($CR$37,_Afg07,$BR$131)=1,VLOOKUP($CR$37,_Afg07,BO131)*$C$113*IF($E$113<>\"\",$E$113,VLOOKUP($CR$37,_Afg07,Udbyttenr)),0)+IF(VLOOKUP($CR$39,_Afg07,$BR$131)=1,VLOOKUP($CR$39,_Afg07,BO131)*$C$115*IF($E$115<>\"\",$E$115,VLOOKUP($CR$39,_Afg07,Udbyttenr)),0)+IF(VLOOKUP($CR$41,_Afg07,$BR$131)=1,VLOOKUP($CR$41,_Afg07,BO131)*$C$117*IF($E$117<>\"\",$E$117,VLOOKUP($CR$41,_Afg07,Udbyttenr)),0)+IF(VLOOKUP($CR$43,_Afg07,$BR$131)=1,VLOOKUP($CR$43,_Afg07,BO131)*$C$119*IF($E$119<>\"\",$E$119,VLOOKUP($CR$43,_Afg07,Udbyttenr)),0)+IF(VLOOKUP($CR$45,_Afg07,$BR$131)=1,VLOOKUP($CR$45,_Afg07,BO131)*$C$121*IF($E$121<>\"\",$E$121,VLOOKUP($CR$45,_Afg07,Udbyttenr)),0)+IF(VLOOKUP($CR$47,_Afg07,$BR$131)=1,VLOOKUP($CR$47,_Afg07,BO131)*$C$123*IF($E$123<>\"\",$E$123,VLOOKUP($CR$47,_Afg07,Udbyttenr)),0)+IF(VLOOKUP($CR$49,_Afg07,$BR$131)=1,VLOOKUP($CR$49,_Afg07,BO131)*$C$125*IF($E$125<>\"\",$E$125,VLOOKUP($CR$49,_Afg07,Udbyttenr)),0))/($CU$51)","v":{"$error":"#DIV/0!"}},{"$f":"(IF(VLOOKUP($CR$37,_Afg07,$BR$131)=1,VLOOKUP($CR$37,_Afg07,BP131)*$C$113*IF($E$113<>\"\",$E$113,VLOOKUP($CR$37,_Afg07,Udbyttenr)),0)+IF(VLOOKUP($CR$39,_Afg07,$BR$131)=1,VLOOKUP($CR$39,_Afg07,BP131)*$C$115*IF($E$115<>\"\",$E$115,VLOOKUP($CR$39,_Afg07,Udbyttenr)),0)+IF(VLOOKUP($CR$41,_Afg07,$BR$131)=1,VLOOKUP($CR$41,_Afg07,BP131)*$C$117*IF($E$117<>\"\",$E$117,VLOOKUP($CR$41,_Afg07,Udbyttenr)),0)+IF(VLOOKUP($CR$43,_Afg07,$BR$131)=1,VLOOKUP($CR$43,_Afg07,BP131)*$C$119*IF($E$119<>\"\",$E$119,VLOOKUP($CR$43,_Afg07,Udbyttenr)),0)+IF(VLOOKUP($CR$45,_Afg07,$BR$131)=1,VLOOKUP($CR$45,_Afg07,BP131)*$C$121*IF($E$121<>\"\",$E$121,VLOOKUP($CR$45,_Afg07,Udbyttenr)),0)+IF(VLOOKUP($CR$47,_Afg07,$BR$131)=1,VLOOKUP($CR$47,_Afg07,BP131)*$C$123*IF($E$123<>\"\",$E$123,VLOOKUP($CR$47,_Afg07,Udbyttenr)),0)+IF(VLOOKUP($CR$49,_Afg07,$BR$131)=1,VLOOKUP($CR$49,_Afg07,BP131)*$C$125*IF($E$125<>\"\",$E$125,VLOOKUP($CR$49,_Afg07,Udbyttenr)),0))/($CU$51)","v":{"$error":"#DIV/0!"}},{"$f":"(IF(VLOOKUP($CR$37,_Afg07,$BR$131)=1,VLOOKUP($CR$37,_Afg07,BQ131)*$C$113*IF($E$113<>\"\",$E$113,VLOOKUP($CR$37,_Afg07,Udbyttenr)),0)+IF(VLOOKUP($CR$39,_Afg07,$BR$131)=1,VLOOKUP($CR$39,_Afg07,BQ131)*$C$115*IF($E$115<>\"\",$E$115,VLOOKUP($CR$39,_Afg07,Udbyttenr)),0)+IF(VLOOKUP($CR$41,_Afg07,$BR$131)=1,VLOOKUP($CR$41,_Afg07,BQ131)*$C$117*IF($E$117<>\"\",$E$117,VLOOKUP($CR$41,_Afg07,Udbyttenr)),0)+IF(VLOOKUP($CR$43,_Afg07,$BR$131)=1,VLOOKUP($CR$43,_Afg07,BQ131)*$C$119*IF($E$119<>\"\",$E$119,VLOOKUP($CR$43,_Afg07,Udbyttenr)),0)+IF(VLOOKUP($CR$45,_Afg07,$BR$131)=1,VLOOKUP($CR$45,_Afg07,BQ131)*$C$121*IF($E$121<>\"\",$E$121,VLOOKUP($CR$45,_Afg07,Udbyttenr)),0)+IF(VLOOKUP($CR$47,_Afg07,$BR$131)=1,VLOOKUP($CR$47,_Afg07,BQ131)*$C$123*IF($E$123<>\"\",$E$123,VLOOKUP($CR$47,_Afg07,Udbyttenr)),0)+IF(VLOOKUP($CR$49,_Afg07,$BR$131)=1,VLOOKUP($CR$49,_Afg07,BQ131)*$C$125*IF($E$125<>\"\",$E$125,VLOOKUP($CR$49,_Afg07,Udbyttenr)),0))/($CU$51)","v":{"$error":"#DIV/0!"}}]
[]
["Resultat",{"$f":"IF($E$174=\"\",\"\",IF(CR$16=O$185,C50,IF(CS$16=O$185,G50,IF(CT$16=O$185,K50,\"\")))*C$107)","v":""},null,{"$f":"IF(B193=\"\",\"\",\"kr.\")","v":""},null,{"$f":"IF($H$174=\"\",\"\",IF(CR$16=O$186,C50,IF(CS$16=O$186,G50,IF(CT$16=O$186,K50,\"\")))*C$127)","v":""},null,{"$f":"IF(F193=\"\",\"\",\"kr.\")","v":""},null,{"$f":"IF(AND($E$174<>\"\",$H$174<>\"\"),F193-B193,\"\")","v":""},null,{"$f":"IF(J193=\"\",\"\",\"kr.\")","v":""}]
[null,null,null,null,null,null,null,null,null,null,null,null,null,null,null,"Den samlede økonomi for hele markbruget (alle ha i sædskifterne) er beregnet ud fra de samme tal, som vises på side 1. \nPå side 2 vises kun tal for sædskifte 1 og 2. Sæd-skifte 1 og 2 behøver ikke indeholder lige mange ha."]
[]
[{"$f":"IF(FEnr=1,\"Foderbehov (korn)\",\"\")","v":"Foderbehov (korn)"},{"$f":"IF(OR($E$174=\"\",FEnr=2),\"\",B236)","v":""},null,{"$f":"IF(B196<>\"\",\"FEsv\",\"\")","v":""},null,{"$f":"IF(OR($H$174=\"\",FEnr=2),\"\",B236)","v":""},null,{"$f":"IF(F196<>\"\",\"FEsv\",\"\")","v":""}]
[{"$f":"IF(FEnr=1,\"Foder produceret\",\"\")","v":"Foder produceret"},{"$f":"IF(OR($E$174=\"\",FEnr=2),\"\",IF(CR$16=O$185,C57,IF(CS$16=O$185,G57,IF(CT$16=O$185,K57,\"\")))*C$107)","v":""},null,{"$f":"IF(B197<>\"\",\"FEsv\",\"\")","v":""},null,{"$f":"IF(OR($H$174=\"\",FEnr=2),\"\",IF(CR$16=O$186,C57,IF(CS$16=O$186,G57,IF(CT$16=O$186,K57,\"\")))*C$127)","v":""},null,{"$f":"IF(F197<>\"\",\"FEsv\",\"\")","v":""},null,{"$f":"IF(AND($E$174<>\"\",$H$174<>\"\",FEnr=1),F197-B197,\"\")","v":""},null,{"$f":"IF(J197<>\"\",\"FEsv\",\"\")","v":""}]
[]
[]
[{"$f":"F67","v":""},null,"Areal  ",null,null,"Udbytte  ",null,"Pris"]
["I alt",{"$f":"C175","v":""},{"$f":"D175","v":""}]
[{"$f":"F68","v":""},{"$f":"H68","v":""},"",null,{"$f":"J68","v":""},"","",""]
["","","",null,"","","",""]
["","","",null,"","","",""]
["","","",null,"","","",""]
["","","",null,"","","","",null,null,null,null,null,null,null,{"$f":"IF(AND(B196>B197,B191=\"\"),\"Foderbehov er større end foder produceret; men du har angivet, at bedriften er kornsælger.\",IF(AND(B197>B196,B191<>\"\"),\"Foder produceret er større end foderbehov; men du har angivet, at bedriften er kornkøber.\",\"\"))","v":""}]
["","","",null,"","","",""]
["","","",null,"","","",""]
[]
[{"$f":"F76","v":""},null,{"$f":"IF(H175=\"\",\"\",\"Areal  \")","v":""},null,null,{"$f":"IF(H174=\"\",\"\",\"Udbytte  \")","v":""},null,{"$f":"IF(H174=\"\",\"\",\"Pris\")","v":""}]
[{"$f":"IF(H174=\"\",\"\",\"I alt\")","v":""},{"$f":"G175","v":""},{"$f":"H175","v":""}]
[{"$f":"F77","v":""},{"$f":"H77","v":""},"",null,{"$f":"J77","v":""},"","",""]
["","","",null,"","","",""]
["","","",null,"","","",""]
["","","",null,"","","",""]
["","","",null,"","","",""]
["","","",null,"","","",""]
["","","",null,"","","",""]
[]
[]
[{"$f":"\"Jordtypen er \"&IF(JBnr=1,\"JB 1+3\",IF(JBnr=2,\"JB 2+4\",IF(JBnr=3,\"JB 1-4, vandet\",IF(JBnr=4,\"JB 5-6\",\"JB 7-9\"))))","v":"Jordtypen er JB 5-6"},null,{"$f":"IF(Hdgnr=1,\"Ingen husdyrgødning\",\"Husdyrgødning fra \"&VLOOKUP(Hdgnr,_Hdg2,2))","v":"Ingen husdyrgødning"}]
[{"$f":"IF(HalmJa=1,\"Halmen bjærges\",\"Halmen nedmuldes\")","v":"Halmen nedmuldes"},null,{"$f":"IF(Købernr=1,\"Bedriften er netto kornsælger\",\"Bedriften er netto kornkøber\")","v":"Bedriften er netto kornsælger"}]
[]
[]
[]
["Foderbehov"]
[]
[null,null,"Besætning",null,null,"Vægtinterval",null,null,null," Foderforbrug",null,null,null,null,null,null,null,null,null,null,null,null,null,null,null,null,null,null,null,null,null,null,null,null,null,null,null,null,null,null,null,null,null,null,null,null,null,null,null,null,null,null,null,null,null,null,null,null,null,null,null,null,null,null,null,null,null,null,null,null,null,null,null,null,null,null,null,null,null,null,null,null,null,null,null,null,null,null,null,null,null,null,null,null,null,null,null,null,"Foderforbrug_FE","Korn-FE"]
[]
["Søer m. smågrise",null,null,"årssøer",null,null,null,null,null,{"$f":"IF(L230<>\"\",\"\",1482)","v":1482},{"$f":"IF(J230<>\"\",\"FE\",\"\")","v":"FE"},null,"FE",null,null,"Du kan beregne besætningen foderbehov (korn) i foderenheder. Resultatet bliver vist på udskriften side 2, så man kan vurdere, om bedriften er netto kornkøber eller kornsælger.",null,null,null,null,null,null,null,null,null,null,null,null,null,null,null,null,null,null,null,null,null,null,null,null,null,null,null,null,null,null,null,null,null,null,null,null,null,null,null,null,null,null,null,null,null,null,null,null,null,null,null,null,null,null,null,null,null,null,null,null,null,null,null,null,null,null,null,null,null,null,null,null,null,null,null,null,null,null,null,81,"%",null,{"$f":"C230*IF(L230<>\"\",L230,J230)","v":0},{"$f":"CU230*CR230*0.01","v":0}]
[]
["Smågrise",null,null,"stk.",null,6.7,"kg",31,"kg",{"$f":"IF(L232<>\"\",\"\",1.98)","v":1.98},{"$f":"IF(J232<>\"\",\"Fesv\",\"\")","v":"Fesv"},null,"Fesv",null,null,null,null,null,null,null,null,null,null,null,null,null,null,null,null,null,null,null,null,null,null,null,null,null,null,null,null,null,null,null,null,null,null,null,null,null,null,null,null,null,null,null,null,null,null,null,null,null,null,null,null,null,null,null,null,null,null,null,null,null,null,null,null,null,null,null,null,null,null,null,null,null,null,null,null,null,null,null,null,null,null,68,"%",null,{"$f":"C232*(H232-F232)*IF(L232<>\"\",L232,J232)","v":0},{"$f":"CU232*CR232*0.01","v":0}]
[]
["Slagtesvin",null,null,"stk.",null,31,"kg",113,"kg",{"$f":"IF(L234<>\"\",\"\",2.83)","v":2.83},{"$f":"IF(J234<>\"\",\"Fesv\",\"\")","v":"Fesv"},null,"Fesv",null,null,null,null,null,null,null,null,null,null,null,null,null,null,null,null,null,null,null,null,null,null,null,null,null,null,null,null,null,null,null,null,null,null,null,null,null,null,null,null,null,null,null,null,null,null,null,null,null,null,null,null,null,null,null,null,null,null,null,null,null,null,null,null,null,null,null,null,null,null,null,null,null,null,null,null,null,null,null,null,null,null,78,"%",null,{"$f":"C234*(H234-F234)*IF(L234<>\"\",L234,J234)","v":0},{"$f":"CU234*CR234*0.01","v":0}]
[]
["Foderbehov (korn)",{"$f":"IF(CV230+CV232+CV234=0,0,CV230+CV232+CV234)","v":0},null,"Fesv i alt"]
[]
[]
[]
["Tidsforbrug til jordbearbejdning, såning og høst"]
[null,null,null,null,null,null,null,null,null,null,null,null,null,null,null,"Der kan beregnes tidsforbrug (netto) og arbejdsprofil for forskellige sædskifter og forskellige bedriftsstørrelser.\nAngivelse af om der pløjes eller harves mv. anvendes kun til beregning af tidsforbrug.\nDet har ingen indflydelse på de økonomiske beregninger. Tidsforbrug beregnes for 'Sædskifte 1' og 'Sædskifte 2'."]
[]
["Sædskifte 1",null,null,"Harvning",null," Såbeds-",null,"Glyphosat"]
[null," Pløjning",null,"e. høst",null," harvning",null,"før såning"]
[]
[{"$f":"IF(CR36=1,\"\",VLOOKUP(CR36,_Afg07,2))","v":""}]
[]
[{"$f":"IF(CR38=1,\"\",VLOOKUP(CR38,_Afg07,2))","v":""}]
[]
[{"$f":"IF(CR40=1,\"\",VLOOKUP(CR40,_Afg07,2))","v":""}]
[]
[{"$f":"IF(CR42=1,\"\",VLOOKUP(CR42,_Afg07,2))","v":""}]
[]
[{"$f":"IF(CR44=1,\"\",VLOOKUP(CR44,_Afg07,2))","v":""}]
[]
[{"$f":"IF(CR46=1,\"\",VLOOKUP(CR46,_Afg07,2))","v":""}]
[]
[{"$f":"IF(CR48=1,\"\",VLOOKUP(CR48,_Afg07,2))","v":""}]
[]
[]
["Sædskifte 2",null,null,"Harvning",null," Såbeds-",null,"Glyphosat"]
[null," Pløjning",null,"e. høst",null," harvning",null,"før såning"]
[]
[{"$f":"IF(CR37=1,\"\",VLOOKUP(CR37,_Afg07,2))","v":""}]
[]
[{"$f":"IF(CR39=1,\"\",VLOOKUP(CR39,_Afg07,2))","v":""}]
[]
[{"$f":"IF(CR41=1,\"\",VLOOKUP(CR41,_Afg07,2))","v":""}]
[]
[{"$f":"IF(CR43=1,\"\",VLOOKUP(CR43,_Afg07,2))","v":""}]
[]
[{"$f":"IF(CR45=1,\"\",VLOOKUP(CR45,_Afg07,2))","v":""}]
[]
[{"$f":"IF(CR47=1,\"\",VLOOKUP(CR47,_Afg07,2))","v":""}]
[]
[{"$f":"IF(CR49=1,\"\",VLOOKUP(CR49,_Afg07,2))","v":""}]
[]
[]
["Maskinkapaciteter",null,null,null,null,null,"Norm",null,null,"Egen\nkapacitet"]
[null,null,null,null,null,null,"kapacitet"]
[]
["Plov",null,null,null,null,null,{"$f":"VLOOKUP(DK32,Plov,3)","v":1.6},"ha/time",null,null,"ha/time"]
[null,null,null,null,null,null,null,null,null,null,null,null,null,null,null,"Valg af maskintyper har kun betydning for beregning af tidsforbrug. Det har ingen indvirkning på de økonomiske beregninger.\nDu kan angive dine egne maskinkapaciteter. Ellers anvendes den valgte normkapacitet.\nI række 5 vælges om halmen nedmuldes eller bjærges."]
["Stubharve",null,null,null,null,null,{"$f":"VLOOKUP(DM32,Stubh,3)","v":2.7},"ha/time",null,null,"ha/time"]
[]
["Såbedsharve",null,null,null,null,null,{"$f":"VLOOKUP(DO32,Såbedh,3)","v":4.7},"ha/time",null,null,"ha/time"]
[]
["Marksprøjte",null,null,null,null,null,{"$f":"VLOOKUP(DQ32,Sprøjte,3)","v":5.3},"ha/time",null,null,"ha/time"]
[]
["Gødningsspreder",null,null,null,null,null,{"$f":"VLOOKUP(EA32,Spreder,4)","v":9},"ha/time",null,null,"ha/time"]
[]
["Gyllevogn",null,null,null,null,null,{"$f":"VLOOKUP(DY32,Gylle,4)","v":60},"ton/time",null,null,"ton/time"]
[]
["Såmaskine",null,null,null,null,null,{"$f":"VLOOKUP(DS32,Såmaskine,3)","v":2.9},"ha/time",null,null,"ha/time"]
[]
["Enkornsåmaskine.",null,null,null,null,null,{"$f":"VLOOKUP(EC32,Enkorn,3)","v":2.6},"ha/time",null,null,"ha/time"]
[]
["Kartoffellægger",null,null,null,null,null,{"$f":"VLOOKUP(EE32,Kartoffellægger,4)","v":0.7},"ha/time",null,null,"ha/time"]
[]
["Mejetærsker",null,null,null,null,null,{"$f":"VLOOKUP(DU32,Mejetærsker,3)","v":1.9},"ha/time",null,null,"ha/time"]
[]
["Halmpresser",null,null,null,null,null,{"$f":"VLOOKUP(DW32,Halmpresser,3)","v":5.3},"ha/time",null,null,"ha/time",{"$f":"VLOOKUP(DW32,Halmpresser,4)","v":3.2},"ha/time (transport)"]
[]
["Kartoffeloptager",null,null,null,null,null,{"$f":"VLOOKUP(EG32,Kartoffeloptager,4)","v":0.8},"ha/time",null,null,"ha/time"]
[]
["Roeoptager",null,null,null,null,null,{"$f":"VLOOKUP(EI32,Roeoptager,4)","v":1.3},"ha/time",null,null,"ha/time"]
[]
[]
["Udskrift (side 3):"]
[]
[{"$f":"\"Tidsforbrug (netto) i markbruget \"&Aar","v":"Tidsforbrug (netto) i markbruget 2018"}]
[]
["Nedenfor er beregnet tidsforbruget til jordbearbejdning, såning, gødskning, planteværn, høst og"]
["halmbjærgning. Det er beregnet som netto tidsforbrug. Det vil sige, at klargøring, vedligehold",null,null,null,null,null,null,null,null,null,null,null,null,null,null,"Tidsforbrug til jordbearbejdning og såning er fordelt på 4 perioder:\nPløjning er fordelt på august (vinterraps), september (vintersæd) og vinter (vårsæd). Såning er fordelt på august (vinterraps), september (vintersæd) og forår (vårsæd). Såbedsharvning er fordelt på samme måde som såning. Harvning efter høst er fordelt efter høstperiode."]
["reparationsarbejde, transporttid og ventetid ikke er indregnet."]
[]
[null,null,null,null,{"$f":"E174","v":""},null,{"$f":"H174","v":""}]
["Tidsforbrug (netto) i alt",null,{"$f":"IF(ISERROR(C328+C344+C345+C346+C355),\"\",(C328+C344+C345+C346+C355))","v":""},{"$f":"IF(C318=\"\",\"\",\"timer\")","v":""},null,null,{"$f":"IF(ISERROR(G328+G344+G345+G346+G355),\"\",(G328+G344+G345+G346+G355))","v":""},{"$f":"IF(G318=\"\",\"\",\"timer\")","v":""}]
["Tidsforbrug pr. ha (gns.)",null,{"$f":"IF(ISERROR(C318/C107),\"\",(C318/C107))","v":""},{"$f":"IF(C319=\"\",\"\",\"timer\")","v":""},null,null,{"$f":"IF(ISERROR(G318/C127),\"\",(G318/C127))","v":""},{"$f":"IF(G319=\"\",\"\",\"timer\")","v":""}]
[]
["Tidsforbrug til jordbearbejdning og såning"]
[]
[null,null,null,null,{"$f":"E174","v":""},null,{"$f":"H174","v":""}]
["Forår",null,{"$f":"IF($E$174=\"\",\"\",DY50+EB50+EE50+EM50+EN50)","v":""},{"$f":"IF(C324=\"\",\"\",\"timer\")","v":""},null,null,{"$f":"IF($H$174=\"\",\"\",DY51+EB51+EE51+EM51+EN51)","v":""},{"$f":"IF(G324=\"\",\"\",\"timer\")","v":""}]
["August",null,{"$f":"IF($E$174=\"\",\"\",DT50+DV50+DW50+DZ50+EC50+EF50)","v":""},{"$f":"IF(C325=\"\",\"\",\"timer\")","v":""},null,null,{"$f":"IF($H$174=\"\",\"\",DT51+DV51+DW51+DZ51+EC51+EF51)","v":""},{"$f":"IF(G325=\"\",\"\",\"timer\")","v":""}]
["September",null,{"$f":"IF($E$174=\"\",\"\",DU50+EA50+ED50+EG50)","v":""},{"$f":"IF(C326=\"\",\"\",\"timer\")","v":""},null,null,{"$f":"IF($H$174=\"\",\"\",DU51+EA51+ED51+EG51)","v":""},{"$f":"IF(G326=\"\",\"\",\"timer\")","v":""}]
["Vinter",null,{"$f":"IF($E$174=\"\",\"\",DS50)","v":""},{"$f":"IF(C327=\"\",\"\",\"timer\")","v":""},null,null,{"$f":"IF($H$174=\"\",\"\",DS51)","v":""},{"$f":"IF(G327=\"\",\"\",\"timer\")","v":""}]
["I alt",null,{"$f":"IF($E$174=\"\",\"\",C324+C325+C326+C327)","v":""},{"$f":"IF(C328=\"\",\"\",\"timer\")","v":""},null,null,{"$f":"IF($H$174=\"\",\"\",G324+G325+G326+G327)","v":""},{"$f":"IF(G328=\"\",\"\",\"timer\")","v":""}]
[]
[]
[]
[]
[]
[]
[]
[]
[]
[]
[]
[]
["Tidsforbrug til gødskning og planteværn"]
[]
[null,null,null,null,{"$f":"E174","v":""},null,{"$f":"H174","v":""}]
["Handelsgødning",null,{"$f":"IF($E$174=\"\",\"\",ER50)","v":""},{"$f":"IF(C344=\"\",\"\",\"timer\")","v":""},null,null,{"$f":"IF($H$174=\"\",\"\",ER51)","v":""},{"$f":"IF(G344=\"\",\"\",\"timer\")","v":""}]
["Husdyrgødning",null,{"$f":"IF($E$174=\"\",\"\",ES50)","v":""},{"$f":"IF(C345=\"\",\"\",\"timer\")","v":""},null,null,{"$f":"IF($H$174=\"\",\"\",ES51)","v":""},{"$f":"IF(G345=\"\",\"\",\"timer\")","v":""}]
["Planteværn",null,{"$f":"IF($E$174=\"\",\"\",EQ50)","v":""},{"$f":"IF(C346=\"\",\"\",\"timer\")","v":""},null,null,{"$f":"IF($H$174=\"\",\"\",EQ51)","v":""},{"$f":"IF(G346=\"\",\"\",\"timer\")","v":""}]
[]
[{"$f":"IF(HalmJa=1,\"Tidsforbrug til høst (mejetærskning, optagning og halmbjærgning)\",\"Tidsforbrug til høst (mejetærskning og optagning)\")","v":"Tidsforbrug til høst (mejetærskning og optagning)"}]
[]
[null,null,null,null,{"$f":"E174","v":""},null,{"$f":"H174","v":""}]
["Juli",null,{"$f":"IF($E$174=\"\",\"\",EH50+EK50)","v":""},{"$f":"IF(C351=\"\",\"\",\"timer\")","v":""},null,null,{"$f":"IF($H$174=\"\",\"\",EH51+EK51)","v":""},{"$f":"IF(G351=\"\",\"\",\"timer\")","v":""},null,null,null,null,null,null,null,"Høst af afgrøder er fordelt på 4 perioder: \nHøst i juli omfatter vinterbyg, vinterraps og tidlig frøgræs.\nHøst i august omfatter kornafgrøderne (undtagen vinterbyg), vårraps og markært samt sildig frøgræs.\nHøst i september omfatter hestebønner og kartofler.\nHøst i oktober omfatter majs til modenhed.\nDer korrigeres automatisk for høstkapaciteten i de enkelte afgrøder (i forhold til vårbyg)."]
["August",null,{"$f":"IF($E$174=\"\",\"\",EI50+EL50)","v":""},{"$f":"IF(C352=\"\",\"\",\"timer\")","v":""},null,null,{"$f":"IF($H$174=\"\",\"\",EI51+EL51)","v":""},{"$f":"IF(G352=\"\",\"\",\"timer\")","v":""}]
["September",null,{"$f":"IF($E$174=\"\",\"\",EO50)","v":""},{"$f":"IF(C353=\"\",\"\",\"timer\")","v":""},null,null,{"$f":"IF($H$174=\"\",\"\",EO51)","v":""},{"$f":"IF(G353=\"\",\"\",\"timer\")","v":""}]
["Oktober",null,{"$f":"IF($E$174=\"\",\"\",EJ50+EP50)","v":""},{"$f":"IF(C354=\"\",\"\",\"timer\")","v":""},null,null,{"$f":"IF($H$174=\"\",\"\",EJ51+EP51)","v":""},{"$f":"IF(G354=\"\",\"\",\"timer\")","v":""}]
["I alt",null,{"$f":"IF($E$174=\"\",\"\",C351+C352+C354+C353)","v":""},{"$f":"IF(C355=\"\",\"\",\"timer\")","v":""},null,null,{"$f":"IF($H$174=\"\",\"\",G351+G352+G354+G353)","v":""},{"$f":"IF(G355=\"\",\"\",\"timer\")","v":""}]
[]
[]
[]
[]
[]
[]
[]
[]
[]
[]
[]
[]
[]
[]
[]
[]
[]
[]
[]
[]
[]
[]
[]
[]
[]
[]
[]
[]
[]
[]
[]
[]
[]
[]
[]
[]
["Nix pille!"]
[]
["Figuren",null,null,null,null,"Figur jordbearbejdning mv.",null,null,null,"Figur Høst"]
["Afgrøde","DB I","DBII",null,null,null,{"$f":"E174","v":""},{"$f":"H174","v":""},null,null,{"$f":"E174","v":""},{"$f":"H174","v":""}]
[{"$f":"E28","v":""},{"$f":"C44","v":""},{"$f":"C50","v":""},null,null,"Forår",{"$f":"C324","v":""},{"$f":"G324","v":""},null,"Juli",{"$f":"C351","v":""},{"$f":"G351","v":""}]
[{"$f":"H28","v":""},{"$f":"G44","v":""},{"$f":"G50","v":""},null,null,"August",{"$f":"C325","v":""},{"$f":"G325","v":""},null,"August",{"$f":"C352","v":""},{"$f":"G352","v":""}]
[{"$f":"L28","v":""},{"$f":"K44","v":""},{"$f":"K50","v":""},null,null,"September",{"$f":"C326","v":""},{"$f":"G326","v":""},null,"September",{"$f":"C353","v":""},{"$f":"G353","v":""}]
[{"$f":"O28","v":0},{"$f":"O44","v":0},{"$f":"O50","v":0},null,null,"Vinter",{"$f":"C327","v":""},{"$f":"G327","v":""},null,"Oktober",{"$f":"C354","v":""},{"$f":"G354","v":""}]
[]
[]
[]
["Beregning af gødningsomkostning"]
["N gødningsbehov, kr",null,{"$f":"IF(Afgnr>1,VLOOKUP(Afgnr,_Afg07,Nnr)*Npris,0)","v":0},null,null,null,{"$f":"IF(Alt1nr>1,VLOOKUP(Alt1nr,_Afg07,Nnr)*Npris,0)","v":0},null,null,null,{"$f":"IF(Alt2nr>1,VLOOKUP(Alt2nr,_Afg07,Nnr)*Npris,0)","v":0}]
["N i husdyrgødning, kr.",null,{"$f":"IF(Hdgnr>1,VLOOKUP(Hdgnr,_Hdg2,4)*Npris,0)","v":0},null,null,null,{"$f":"IF(Hdgnr>1,VLOOKUP(Hdgnr,_Hdg2,4)*Npris,0)","v":0},null,null,null,{"$f":"IF(Hdgnr>1,VLOOKUP(Hdgnr,_Hdg2,4)*Npris,0)","v":0}]
["N gødningsomkostning, kr.",null,{"$f":"IF(C404-C405<0,0,C404-C405)","v":0},null,null,null,{"$f":"IF(G404-G405<0,0,G404-G405)","v":0},null,null,null,{"$f":"IF(K404-K405<0,0,K404-K405)","v":0}]
[]
["P startgødningsbehov1, kr.",null,{"$f":"IF(Afgnr>1,VLOOKUP(Afgnr,_Afg07,$AR$131)*Ppris,0)","v":0},null,null,null,{"$f":"IF(Alt1nr>1,VLOOKUP(Alt1nr,_Afg07,$AR$131)*Ppris,0)","v":0},null,null,null,{"$f":"IF(Alt2nr>1,VLOOKUP(Alt2nr,_Afg07,$AR$131)*Ppris,0)","v":0}]
["P startgødningsbehov2, kr.",null,{"$f":"IF(Afgnr>1,VLOOKUP(Afgnr,_Afg07,$AS$131)*Ppris,0)","v":0},null,null,null,{"$f":"IF(Alt1nr>1,VLOOKUP(Alt1nr,_Afg07,$AS$131)*Ppris,0)","v":0},null,null,null,{"$f":"IF(Alt2nr>1,VLOOKUP(Alt2nr,_Afg07,$AS$131)*Ppris,0)","v":0}]
["P-bortførsel-kerne, kr",null,{"$f":"IF(Afgnr>1,C29*VLOOKUP(Afgnr,_Afg07,$AT$131)*Ppris,0)","v":0},null,null,null,{"$f":"IF(Alt1nr>1,G29*VLOOKUP(Alt1nr,_Afg07,$AT$131)*Ppris,0)","v":0},null,null,null,{"$f":"IF(Alt2nr>1,K29*VLOOKUP(Alt2nr,_Afg07,$AT$131)*Ppris,0)","v":0}]
["P-bortførsel-halm, kr.",null,{"$f":"IF(ISERROR(IF(AND(Afgnr>1,HalmJa=1),VLOOKUP(Afgnr,_Afg07,Halmnr)*VLOOKUP(Afgnr,_Afg07,$AU$131)*0.01*Ppris,0)),0,IF(AND(Afgnr>1,HalmJa=1),VLOOKUP(Afgnr,_Afg07,Halmnr)*VLOOKUP(Afgnr,_Afg07,$AU$131)*0.01*Ppris,0))","v":0},null,null,null,{"$f":"IF(ISERROR(IF(AND(Alt1nr>1,HalmJa=1),VLOOKUP(Alt1nr,_Afg07,Halmnr)*VLOOKUP(Alt1nr,_Afg07,$AU$131)*0.01*Ppris,0)),0,IF(AND(Alt1nr>1,HalmJa=1),VLOOKUP(Alt1nr,_Afg07,Halmnr)*VLOOKUP(Alt1nr,_Afg07,$AU$131)*0.01*Ppris,0))","v":0},null,null,null,{"$f":"IF(ISERROR(IF(AND(Alt2nr>1,HalmJa=1),VLOOKUP(Alt2nr,_Afg07,Halmnr)*VLOOKUP(Alt2nr,_Afg07,$AU$131)*0.01*Ppris,0)),0,IF(AND(Alt2nr>1,HalmJa=1),VLOOKUP(Alt2nr,_Afg07,Halmnr)*VLOOKUP(Alt2nr,_Afg07,$AU$131)*0.01*Ppris,0))","v":0}]
["P i husdyrgødning, kr.",null,{"$f":"IF(Hdgnr>1,VLOOKUP(Hdgnr,_Hdg2,5)*Ppris,0)","v":0},null,null,null,{"$f":"IF(Hdgnr>1,VLOOKUP(Hdgnr,_Hdg2,5)*Ppris,0)","v":0},null,null,null,{"$f":"IF(Hdgnr>1,VLOOKUP(Hdgnr,_Hdg2,5)*Ppris,0)","v":0}]
["P gødningsomkostning, kr.",null,{"$f":"C408+IF((C409+C410+C411)>C412,(C409+C410+C411)-C412,0)","v":0},null,null,null,{"$f":"G408+IF((G409+G410+G411)>G412,(G409+G410+G411)-G412,0)","v":0},null,null,null,{"$f":"K408+IF((K409+K410+K411)>K412,(K409+K410+K411)-K412,0)","v":0}]
[]
["K startgødningsbehov, kr.",null,{"$f":"IF(AND(Afgnr>1,OR(CR3=1,CR3=3)),VLOOKUP(Afgnr,_Afg07,$AV$131)*Kpris,0)","v":0},null,null,null,{"$f":"IF(AND(Alt1nr>1,OR(CR3=1,CR3=3)),VLOOKUP(Alt1nr,_Afg07,$AV$131)*Kpris,0)","v":0},null,null,null,{"$f":"IF(AND(Alt2nr>1,OR(CR3=1,CR3=3)),VLOOKUP(Alt2nr,_Afg07,$AV$131)*Kpris,0)","v":0}]
["K-bortførsel-kerne, kr",null,{"$f":"IF(Afgnr>1,C29*VLOOKUP(Afgnr,_Afg07,$AW$131)*Kpris,0)","v":0},null,null,null,{"$f":"IF(Alt1nr>1,G29*VLOOKUP(Alt1nr,_Afg07,$AW$131)*Kpris,0)","v":0},null,null,null,{"$f":"IF(Alt2nr>1,K29*VLOOKUP(Alt2nr,_Afg07,$AW$131)*Kpris,0)","v":0}]
["K-bortførsel-halm, kr.",null,{"$f":"IF(ISERROR(IF(AND(Afgnr>1,HalmJa=1),VLOOKUP(Afgnr,_Afg07,Halmnr)*VLOOKUP(Afgnr,_Afg07,$AX$131)*0.01*Kpris,0)),0,IF(AND(Afgnr>1,HalmJa=1),VLOOKUP(Afgnr,_Afg07,Halmnr)*VLOOKUP(Afgnr,_Afg07,$AX$131)*0.01*Kpris,0))","v":0},null,null,null,{"$f":"IF(ISERROR(IF(AND(Alt1nr>1,HalmJa=1),VLOOKUP(Alt1nr,_Afg07,Halmnr)*VLOOKUP(Alt1nr,_Afg07,$AX$131)*0.01*Kpris,0)),0,IF(AND(Alt1nr>1,HalmJa=1),VLOOKUP(Alt1nr,_Afg07,Halmnr)*VLOOKUP(Alt1nr,_Afg07,$AX$131)*0.01*Kpris,0))","v":0},null,null,null,{"$f":"IF(ISERROR(IF(AND(Alt2nr>1,HalmJa=1),VLOOKUP(Alt2nr,_Afg07,Halmnr)*VLOOKUP(Alt2nr,_Afg07,$AX$131)*0.01*Kpris,0)),0,IF(AND(Alt2nr>1,HalmJa=1),VLOOKUP(Alt2nr,_Afg07,Halmnr)*VLOOKUP(Alt2nr,_Afg07,$AX$131)*0.01*Kpris,0))","v":0}]
["K i husdyrgødning, kr.",null,{"$f":"IF(Hdgnr>1,VLOOKUP(Hdgnr,_Hdg2,6)*Kpris,0)","v":0},null,null,null,{"$f":"IF(Hdgnr>1,VLOOKUP(Hdgnr,_Hdg2,6)*Kpris,0)","v":0},null,null,null,{"$f":"IF(Hdgnr>1,VLOOKUP(Hdgnr,_Hdg2,6)*Kpris,0)","v":0}]
["K gødningsomkostning, kr.",null,{"$f":"C414+IF((C415+C416+C417)>C418,(C415+C416+C417)-C418,0)","v":0},null,null,null,{"$f":"G414+IF((G415+G416+G417)>G418,(G415+G416+G417)-G418,0)","v":0},null,null,null,{"$f":"K414+IF((K415+K416+K417)>K418,(K415+K416+K417)-K418,0)","v":0}]
[]
["Gødning i alt, kr",null,{"$f":"IF(ISERROR(C406+C413+C419),0,(C406+C413+C419))","v":0},null,null,null,{"$f":"IF(ISERROR(G406+G413+G419),0,(G406+G413+G419))","v":0},null,null,null,{"$f":"IF(ISERROR(K406+K413+K419),0,(K406+K413+K419))","v":0}]
[]
["Udgifter foderkorn"]
["Udsæd",null,{"$f":"IF(Afgnr>1,IF(VLOOKUP(Afgnr,_Afg07,$BR$131)=1,VLOOKUP(Afgnr,_Afg07,$AI$131),IF(VLOOKUP(Afgnr,_Afg07,$BR$131)=3,VLOOKUP(1,Foderkorn,$AI$131),IF(VLOOKUP(Afgnr,_Afg07,$BR$131)=4,VLOOKUP(2,Foderkorn,$AI$131),0))),0)","v":0},null,null,null,{"$f":"IF(Alt1nr>1,IF(VLOOKUP(Alt1nr,_Afg07,$BR$131)=1,VLOOKUP(Alt1nr,_Afg07,$AI$131),IF(VLOOKUP(Alt1nr,_Afg07,$BR$131)=3,VLOOKUP(1,Foderkorn,$AI$131),IF(VLOOKUP(Alt1nr,_Afg07,$BR$131)=4,VLOOKUP(2,Foderkorn,$AI$131),0))),0)","v":0},null,null,null,{"$f":"IF(Alt2nr>1,IF(VLOOKUP(Alt2nr,_Afg07,$BR$131)=1,VLOOKUP(Alt1nr,_Afg07,$AI$131),IF(VLOOKUP(Alt2nr,_Afg07,$BR$131)=3,VLOOKUP(1,Foderkorn,$AI$131),IF(VLOOKUP(Alt2nr,_Afg07,$BR$131)=4,VLOOKUP(2,Foderkorn,$AI$131),0))),0)","v":0}]
["Planteværn",null,{"$f":"IF(Afgnr>1,IF(VLOOKUP(Afgnr,_Afg07,$BR$131)=1,VLOOKUP(Afgnr,_Afg07,$AJ$131),IF(VLOOKUP(Afgnr,_Afg07,$BR$131)=3,VLOOKUP(1,Foderkorn,$AJ$131),IF(VLOOKUP(Afgnr,_Afg07,$BR$131)=4,VLOOKUP(2,Foderkorn,$AJ$131),0))),0)","v":0},null,null,null,{"$f":"IF(Alt1nr>1,IF(VLOOKUP(Alt1nr,_Afg07,$BR$131)=1,VLOOKUP(Alt1nr,_Afg07,$AJ$131),IF(VLOOKUP(Alt1nr,_Afg07,$BR$131)=3,VLOOKUP(1,Foderkorn,$AJ$131),IF(VLOOKUP(Alt1nr,_Afg07,$BR$131)=4,VLOOKUP(2,Foderkorn,$AJ$131),0))),0)","v":0},null,null,null,{"$f":"IF(Alt2nr>1,IF(VLOOKUP(Alt2nr,_Afg07,$BR$131)=1,VLOOKUP(Alt2nr,_Afg07,$AJ$131),IF(VLOOKUP(Alt2nr,_Afg07,$BR$131)=3,VLOOKUP(1,Foderkorn,$AJ$131),IF(VLOOKUP(Alt2nr,_Afg07,$BR$131)=4,VLOOKUP(2,Foderkorn,$AJ$131),0))),0)","v":0}]
[]
["N gødningsbehov, kr (foderkorn)",null,{"$f":"IF(Afgnr>1,IF(VLOOKUP(Afgnr,_Afg07,$BR$131)=1,VLOOKUP(Afgnr,_Afg07,Nnr)*Npris,IF(VLOOKUP(Afgnr,_Afg07,$BR$131)=3,VLOOKUP(1,Foderkorn,Nnr)*Npris,IF(VLOOKUP(Afgnr,_Afg07,$BR$131)=4,VLOOKUP(2,Foderkorn,Nnr)*Npris,0))),0)","v":0},null,null,null,{"$f":"IF(Alt1nr>1,IF(VLOOKUP(Alt1nr,_Afg07,$BR$131)=1,VLOOKUP(Alt1nr,_Afg07,Nnr)*Npris,IF(VLOOKUP(Alt1nr,_Afg07,$BR$131)=3,VLOOKUP(1,Foderkorn,Nnr)*Npris,IF(VLOOKUP(Alt1nr,_Afg07,$BR$131)=4,VLOOKUP(2,Foderkorn,Nnr)*Npris,0))),0)","v":0},null,null,null,{"$f":"IF(Alt2nr>1,IF(VLOOKUP(Alt2nr,_Afg07,$BR$131)=1,VLOOKUP(Alt2nr,_Afg07,Nnr)*Npris,IF(VLOOKUP(Alt2nr,_Afg07,$BR$131)=3,VLOOKUP(1,Foderkorn,Nnr)*Npris,IF(VLOOKUP(Alt2nr,_Afg07,$BR$131)=4,VLOOKUP(2,Foderkorn,Nnr)*Npris,0))),0)","v":0}]
["N i husdyrgødning, kr.",null,{"$f":"IF(Hdgnr>1,VLOOKUP(Hdgnr,_Hdg2,4)*Npris,0)","v":0},null,null,null,{"$f":"IF(Hdgnr>1,VLOOKUP(Hdgnr,_Hdg2,4)*Npris,0)","v":0},null,null,null,{"$f":"IF(Hdgnr>1,VLOOKUP(Hdgnr,_Hdg2,4)*Npris,0)","v":0}]
["N gødningsomkostning, kr.",null,{"$f":"IF(C427-C428<0,0,C427-C428)","v":0},null,null,null,{"$f":"IF(G427-G428<0,0,G427-G428)","v":0},null,null,null,{"$f":"IF(K427-K428<0,0,K427-K428)","v":0}]
[]
["P startgødningsbehov1, kr.",null,{"$f":"IF(Afgnr>1,IF(VLOOKUP(Afgnr,_Afg07,$BR$131)=1,VLOOKUP(Afgnr,_Afg07,$AR$131)*Ppris,IF(VLOOKUP(Afgnr,_Afg07,$BR$131)=3,VLOOKUP(1,Foderkorn,$AR$131)*Ppris,IF(VLOOKUP(Afgnr,_Afg07,$BR$131)=4,VLOOKUP(2,Foderkorn,$AR$131)*Ppris,0))),0)","v":0},null,null,null,{"$f":"IF(Alt1nr>1,IF(VLOOKUP(Alt1nr,_Afg07,$BR$131)=1,VLOOKUP(Alt1nr,_Afg07,$AR$131)*Ppris,IF(VLOOKUP(Alt1nr,_Afg07,$BR$131)=3,VLOOKUP(1,Foderkorn,$AR$131)*Ppris,IF(VLOOKUP(Alt1nr,_Afg07,$BR$131)=4,VLOOKUP(2,Foderkorn,$AR$131)*Ppris,0))),0)","v":0},null,null,null,{"$f":"IF(Alt2nr>1,IF(VLOOKUP(Alt2nr,_Afg07,$BR$131)=1,VLOOKUP(Alt2nr,_Afg07,$AR$131)*Ppris,IF(VLOOKUP(Alt2nr,_Afg07,$BR$131)=3,VLOOKUP(1,Foderkorn,$AR$131)*Ppris,IF(VLOOKUP(Alt2nr,_Afg07,$BR$131)=4,VLOOKUP(2,Foderkorn,$AR$131)*Ppris,0))),0)","v":0}]
["P startgødningsbehov2, kr.",null,{"$f":"IF(Afgnr>1,IF(VLOOKUP(Afgnr,_Afg07,$BR$131)=1,VLOOKUP(Afgnr,_Afg07,$AS$131)*Ppris,IF(VLOOKUP(Afgnr,_Afg07,$BR$131)=3,VLOOKUP(1,Foderkorn,$AS$131)*Ppris,IF(VLOOKUP(Afgnr,_Afg07,$BR$131)=4,VLOOKUP(2,Foderkorn,$AS$131)*Ppris,0))),0)","v":0},null,null,null,{"$f":"IF(Alt1nr>1,IF(VLOOKUP(Alt1nr,_Afg07,$BR$131)=1,VLOOKUP(Alt1nr,_Afg07,$AS$131)*Ppris,IF(VLOOKUP(Alt1nr,_Afg07,$BR$131)=3,VLOOKUP(1,Foderkorn,$AS$131)*Ppris,IF(VLOOKUP(Alt1nr,_Afg07,$BR$131)=4,VLOOKUP(2,Foderkorn,$AS$131)*Ppris,0))),0)","v":0},null,null,null,{"$f":"IF(Alt2nr>1,IF(VLOOKUP(Alt2nr,_Afg07,$BR$131)=1,VLOOKUP(Alt2nr,_Afg07,$AS$131)*Ppris,IF(VLOOKUP(Alt2nr,_Afg07,$BR$131)=3,VLOOKUP(1,Foderkorn,$AS$131)*Ppris,IF(VLOOKUP(Alt2nr,_Afg07,$BR$131)=4,VLOOKUP(2,Foderkorn,$AS$131)*Ppris,0))),0)","v":0}]
["P-bortførsel-kerne, kr",null,{"$f":"IF(Afgnr>1,IF(VLOOKUP(Afgnr,_Afg07,$BR$131)=1,C$29*VLOOKUP(Afgnr,_Afg07,$AT$131)*Ppris,IF(VLOOKUP(Afgnr,_Afg07,$BR$131)=3,$CX$50*VLOOKUP(1,Foderkorn,$AT$131)*Ppris,IF(VLOOKUP(Afgnr,_Afg07,$BR$131)=4,$CX$51*VLOOKUP(2,Foderkorn,$AT$131)*Ppris,0))),0)","v":0},null,null,null,{"$f":"IF(Alt1nr>1,IF(VLOOKUP(Alt1nr,_Afg07,$BR$131)=1,G$29*VLOOKUP(Alt1nr,_Afg07,$AT$131)*Ppris,IF(VLOOKUP(Alt1nr,_Afg07,$BR$131)=3,$CX$50*VLOOKUP(1,Foderkorn,$AT$131)*Ppris,IF(VLOOKUP(Alt1nr,_Afg07,$BR$131)=4,$CX$51*VLOOKUP(2,Foderkorn,$AT$131)*Ppris,0))),0)","v":0},null,null,null,{"$f":"IF(Alt2nr>1,IF(VLOOKUP(Alt2nr,_Afg07,$BR$131)=1,K$29*VLOOKUP(Alt2nr,_Afg07,$AT$131)*Ppris,IF(VLOOKUP(Alt2nr,_Afg07,$BR$131)=3,$CX$50*VLOOKUP(1,Foderkorn,$AT$131)*Ppris,IF(VLOOKUP(Alt2nr,_Afg07,$BR$131)=4,$CX$51*VLOOKUP(2,Foderkorn,$AT$131)*Ppris,0))),0)","v":0}]
["P-bortførsel-halm, kr.",null,{"$f":"IF(AND(Afgnr>1,HalmJa=1),IF(VLOOKUP(Afgnr,_Afg07,$BR$131)=1,VLOOKUP(Afgnr,_Afg07,Halmnr)*VLOOKUP(Afgnr,_Afg07,$AU$131)*0.01*Ppris,IF(VLOOKUP(Afgnr,_Afg07,$BR$131)=3,VLOOKUP(1,Foderkorn,Halmnr)*VLOOKUP(1,Foderkorn,$AU$131)*0.01*Ppris,IF(VLOOKUP(Afgnr,_Afg07,$BR$131)=4,VLOOKUP(2,Foderkorn,Halmnr)*VLOOKUP(2,Foderkorn,$AU$131)*0.01*Ppris,0))),0)","v":0},null,null,null,{"$f":"IF(AND(Alt1nr>1,HalmJa=1),IF(VLOOKUP(Alt1nr,_Afg07,$BR$131)=1,VLOOKUP(Alt1nr,_Afg07,Halmnr)*VLOOKUP(Alt1nr,_Afg07,$AU$131)*0.01*Ppris,IF(VLOOKUP(Alt1nr,_Afg07,$BR$131)=3,VLOOKUP(1,Foderkorn,Halmnr)*VLOOKUP(1,Foderkorn,$AU$131)*0.01*Ppris,IF(VLOOKUP(Alt1nr,_Afg07,$BR$131)=4,VLOOKUP(2,Foderkorn,Halmnr)*VLOOKUP(2,Foderkorn,$AU$131)*0.01*Ppris,0))),0)","v":0},null,null,null,{"$f":"IF(AND(Alt2nr>1,HalmJa=1),IF(VLOOKUP(Alt2nr,_Afg07,$BR$131)=1,VLOOKUP(Alt2nr,_Afg07,Halmnr)*VLOOKUP(Alt2nr,_Afg07,$AU$131)*0.01*Ppris,IF(VLOOKUP(Alt2nr,_Afg07,$BR$131)=3,VLOOKUP(1,Foderkorn,Halmnr)*VLOOKUP(1,Foderkorn,$AU$131)*0.01*Ppris,IF(VLOOKUP(Alt2nr,_Afg07,$BR$131)=4,VLOOKUP(2,Foderkorn,Halmnr)*VLOOKUP(2,Foderkorn,$AU$131)*0.01*Ppris,0))),0)","v":0}]
["P i husdyrgødning, kr.",null,{"$f":"IF(Hdgnr>1,VLOOKUP(Hdgnr,_Hdg2,5)*Ppris,0)","v":0},null,null,null,{"$f":"IF(Hdgnr>1,VLOOKUP(Hdgnr,_Hdg2,5)*Ppris,0)","v":0},null,null,null,{"$f":"IF(Hdgnr>1,VLOOKUP(Hdgnr,_Hdg2,5)*Ppris,0)","v":0}]
["P gødningsomkostning, kr.",null,{"$f":"C431+IF((C432+C433+C434)>C435,(C432+C433+C434)-C435,0)","v":0},null,null,null,{"$f":"G431+IF((G432+G433+G434)>G435,(G432+G433+G434)-G435,0)","v":0},null,null,null,{"$f":"K431+IF((K432+K433+K434)>K435,(K432+K433+K434)-K435,0)","v":0}]
[]
["K startgødningsbehov, kr.",null,{"$f":"IF(AND(Afgnr>1,OR($CR$3=1,$CR$3=3)),IF(VLOOKUP(Afgnr,_Afg07,$BR$131)=1,VLOOKUP(Afgnr,_Afg07,$AV$131)*Kpris,IF(VLOOKUP(Afgnr,_Afg07,$BR$131)=3,VLOOKUP(1,Foderkorn,$AV$131)*Kpris,IF(VLOOKUP(Afgnr,_Afg07,$BR$131)=4,VLOOKUP(2,Foderkorn,$AV$131)*Kpris,0))),0)","v":0},null,null,null,{"$f":"IF(AND(Alt1nr>1,OR($CR$3=1,$CR$3=3)),IF(VLOOKUP(Alt1nr,_Afg07,$BR$131)=1,VLOOKUP(Alt1nr,_Afg07,$AV$131)*Kpris,IF(VLOOKUP(Alt1nr,_Afg07,$BR$131)=3,VLOOKUP(1,Foderkorn,$AV$131)*Kpris,IF(VLOOKUP(Alt1nr,_Afg07,$BR$131)=4,VLOOKUP(2,Foderkorn,$AV$131)*Kpris,0))),0)","v":0},null,null,null,{"$f":"IF(AND(Alt2nr>1,OR($CR$3=1,$CR$3=3)),IF(VLOOKUP(Alt2nr,_Afg07,$BR$131)=1,VLOOKUP(Alt2nr,_Afg07,$AV$131)*Kpris,IF(VLOOKUP(Alt2nr,_Afg07,$BR$131)=3,VLOOKUP(1,Foderkorn,$AV$131)*Kpris,IF(VLOOKUP(Alt2nr,_Afg07,$BR$131)=4,VLOOKUP(2,Foderkorn,$AV$131)*Kpris,0))),0)","v":0}]
["K-bortførsel-kerne, kr",null,{"$f":"IF(Afgnr>1,IF(VLOOKUP(Afgnr,_Afg07,$BR$131)=1,C$29*VLOOKUP(Afgnr,_Afg07,$AW$131)*Kpris,IF(VLOOKUP(Afgnr,_Afg07,$BR$131)=3,$CX$50*VLOOKUP(1,Foderkorn,$AW$131)*Kpris,IF(VLOOKUP(Afgnr,_Afg07,$BR$131)=4,$CX$51*VLOOKUP(2,Foderkorn,$AW$131)*Kpris,0))),0)","v":0},null,null,null,{"$f":"IF(Alt1nr>1,IF(VLOOKUP(Alt1nr,_Afg07,$BR$131)=1,G$29*VLOOKUP(Alt1nr,_Afg07,$AW$131)*Kpris,IF(VLOOKUP(Alt1nr,_Afg07,$BR$131)=3,$CX$50*VLOOKUP(1,Foderkorn,$AW$131)*Kpris,IF(VLOOKUP(Alt1nr,_Afg07,$BR$131)=4,$CX$51*VLOOKUP(2,Foderkorn,$AW$131)*Kpris,0))),0)","v":0},null,null,null,{"$f":"IF(Alt2nr>1,IF(VLOOKUP(Alt2nr,_Afg07,$BR$131)=1,K$29*VLOOKUP(Alt2nr,_Afg07,$AW$131)*Kpris,IF(VLOOKUP(Alt2nr,_Afg07,$BR$131)=3,$CX$50*VLOOKUP(1,Foderkorn,$AW$131)*Kpris,IF(VLOOKUP(Alt2nr,_Afg07,$BR$131)=4,$CX$51*VLOOKUP(2,Foderkorn,$AW$131)*Kpris,0))),0)","v":0}]
["K-bortførsel-halm, kr.",null,{"$f":"IF(AND(Afgnr>1,HalmJa=1),IF(VLOOKUP(Afgnr,_Afg07,$BR$131)=1,VLOOKUP(Afgnr,_Afg07,Halmnr)*VLOOKUP(Afgnr,_Afg07,$AX$131)*0.01*Kpris,IF(VLOOKUP(Afgnr,_Afg07,$BR$131)=3,VLOOKUP(1,Foderkorn,Halmnr)*VLOOKUP(1,Foderkorn,$AX$131)*0.01*Kpris,IF(VLOOKUP(Afgnr,_Afg07,$BR$131)=4,VLOOKUP(2,Foderkorn,Halmnr)*VLOOKUP(2,Foderkorn,$AX$131)*0.01*Kpris,0))),0)","v":0},null,null,null,{"$f":"IF(AND(Alt1nr>1,HalmJa=1),IF(VLOOKUP(Alt1nr,_Afg07,$BR$131)=1,VLOOKUP(Alt1nr,_Afg07,Halmnr)*VLOOKUP(Alt1nr,_Afg07,$AX$131)*0.01*Kpris,IF(VLOOKUP(Alt1nr,_Afg07,$BR$131)=3,VLOOKUP(1,Foderkorn,Halmnr)*VLOOKUP(1,Foderkorn,$AX$131)*0.01*Kpris,IF(VLOOKUP(Alt1nr,_Afg07,$BR$131)=4,VLOOKUP(2,Foderkorn,Halmnr)*VLOOKUP(2,Foderkorn,$AX$131)*0.01*Kpris,0))),0)","v":0},null,null,null,{"$f":"IF(AND(Alt2nr>1,HalmJa=1),IF(VLOOKUP(Alt2nr,_Afg07,$BR$131)=1,VLOOKUP(Alt2nr,_Afg07,Halmnr)*VLOOKUP(Alt2nr,_Afg07,$AX$131)*0.01*Kpris,IF(VLOOKUP(Alt2nr,_Afg07,$BR$131)=3,VLOOKUP(1,Foderkorn,Halmnr)*VLOOKUP(1,Foderkorn,$AX$131)*0.01*Kpris,IF(VLOOKUP(Alt2nr,_Afg07,$BR$131)=4,VLOOKUP(2,Foderkorn,Halmnr)*VLOOKUP(2,Foderkorn,$AX$131)*0.01*Kpris,0))),0)","v":0}]
["K i husdyrgødning, kr.",null,{"$f":"IF(Hdgnr>1,VLOOKUP(Hdgnr,_Hdg2,6)*Kpris,0)","v":0},null,null,null,{"$f":"IF(Hdgnr>1,VLOOKUP(Hdgnr,_Hdg2,6)*Kpris,0)","v":0},null,null,null,{"$f":"IF(Hdgnr>1,VLOOKUP(Hdgnr,_Hdg2,6)*Kpris,0)","v":0}]
["K gødningsomkostning, kr.",null,{"$f":"C437+IF((C438+C439+C440)>C441,(C438+C439+C440)-C441,0)","v":0},null,null,null,{"$f":"G437+IF((G438+G439+G440)>G441,(G438+G439+G440)-G441,0)","v":0},null,null,null,{"$f":"K437+IF((K438+K439+K440)>K441,(K438+K439+K440)-K441,0)","v":0}]
[]
["Gødning i alt, kr",null,{"$f":"IF(ISERROR(C429+C436+C442),0,(C429+C436+C442))","v":0},null,null,null,{"$f":"IF(ISERROR(G429+G436+G442),0,(G429+G436+G442))","v":0},null,null,null,{"$f":"IF(ISERROR(K429+K436+K442),0,(K429+K436+K442))","v":0}]
[]
["Diverse styk",null,{"$f":"IF(Afgnr>1,IF(VLOOKUP(Afgnr,_Afg07,$BR$131)=1,VLOOKUP(Afgnr,_Afg07,$AK$131)+C$29*VLOOKUP(Afgnr,_Afg07,$AY$131),IF(VLOOKUP(Afgnr,_Afg07,$BR$131)=3,VLOOKUP(1,Foderkorn,$AK$131)+$CX$50*VLOOKUP(1,Foderkorn,$AY$131),IF(VLOOKUP(Afgnr,_Afg07,$BR$131)=4,VLOOKUP(2,Foderkorn,$AK$131)+$CX$51*VLOOKUP(2,Foderkorn,$AY$131),0))),0)","v":0},null,null,null,{"$f":"IF(Alt1nr>1,IF(VLOOKUP(Alt1nr,_Afg07,$BR$131)=1,VLOOKUP(Alt1nr,_Afg07,$AK$131)+G$29*VLOOKUP(Alt1nr,_Afg07,$AY$131),IF(VLOOKUP(Alt1nr,_Afg07,$BR$131)=3,VLOOKUP(1,Foderkorn,$AK$131)+$CX$50*VLOOKUP(1,Foderkorn,$AY$131),IF(VLOOKUP(Alt1nr,_Afg07,$BR$131)=4,VLOOKUP(2,Foderkorn,$AK$131)+$CX$51*VLOOKUP(2,Foderkorn,$AY$131),0))),0)","v":0},null,null,null,{"$f":"IF(Alt2nr>1,IF(VLOOKUP(Alt2nr,_Afg07,$BR$131)=1,VLOOKUP(Alt2nr,_Afg07,$AK$131)+K$29*VLOOKUP(Alt2nr,_Afg07,$AY$131),IF(VLOOKUP(Alt2nr,_Afg07,$BR$131)=3,VLOOKUP(1,Foderkorn,$AK$131)+$CX$50*VLOOKUP(1,Foderkorn,$AY$131),IF(VLOOKUP(Alt2nr,_Afg07,$BR$131)=4,VLOOKUP(2,Foderkorn,$AK$131)+$CX$51*VLOOKUP(2,Foderkorn,$AY$131),0))),0)","v":0}]
[]
["Maskiner og arbejde",null,{"$f":"IF(Afgnr>1,IF(VLOOKUP(Afgnr,_Afg07,$BR$131)=1,VLOOKUP(Afgnr,_Afg07,$CT$5),IF(VLOOKUP(Afgnr,_Afg07,$BR$131)=3,VLOOKUP(1,Foderkorn,$CT$5),IF(VLOOKUP(Afgnr,_Afg07,$BR$131)=4,VLOOKUP(2,Foderkorn,$CT$5),0))),0)","v":0},null,null,null,{"$f":"IF(Alt1nr>1,IF(VLOOKUP(Alt1nr,_Afg07,$BR$131)=1,VLOOKUP(Alt1nr,_Afg07,$CT$5),IF(VLOOKUP(Alt1nr,_Afg07,$BR$131)=3,VLOOKUP(1,Foderkorn,$CT$5),IF(VLOOKUP(Alt1nr,_Afg07,$BR$131)=4,VLOOKUP(2,Foderkorn,$CT$5),0))),0)","v":0},null,null,null,{"$f":"IF(Alt2nr>1,IF(VLOOKUP(Alt2nr,_Afg07,$BR$131)=1,VLOOKUP(Alt2nr,_Afg07,$CT$5),IF(VLOOKUP(Alt2nr,_Afg07,$BR$131)=3,VLOOKUP(1,Foderkorn,$CT$5),IF(VLOOKUP(Alt2nr,_Afg07,$BR$131)=4,VLOOKUP(2,Foderkorn,$CT$5),0))),0)","v":0}]
[]
["Tørring",null,{"$f":"IF(AND(Afgnr>1,$CU$3<>4),IF(VLOOKUP(Afgnr,_Afg07,$BR$131)=1,VLOOKUP(Afgnr,_Afg07,Tørrenr)*C$29,IF(VLOOKUP(Afgnr,_Afg07,$BR$131)=3,VLOOKUP(1,Foderkorn,Tørrenr)*$CX$50,IF(VLOOKUP(Afgnr,_Afg07,$BR$131)=4,VLOOKUP(2,Foderkorn,Tørrenr)*$CX$51,))),0)","v":0},null,null,null,{"$f":"IF(AND(Alt1nr>1,$CU$3<>4),IF(VLOOKUP(Alt1nr,_Afg07,$BR$131)=1,VLOOKUP(Alt1nr,_Afg07,Tørrenr)*G$29,IF(VLOOKUP(Alt1nr,_Afg07,$BR$131)=3,VLOOKUP(1,Foderkorn,Tørrenr)*$CX$50,IF(VLOOKUP(Alt1nr,_Afg07,$BR$131)=4,VLOOKUP(2,Foderkorn,Tørrenr)*$CX$51,))),0)","v":0},null,null,null,{"$f":"IF(AND(Alt2nr>1,$CU$3<>4),IF(VLOOKUP(Alt2nr,_Afg07,$BR$131)=1,VLOOKUP(Alt2nr,_Afg07,Tørrenr)*K$29,IF(VLOOKUP(Alt2nr,_Afg07,$BR$131)=3,VLOOKUP(1,Foderkorn,Tørrenr)*$CX$50,IF(VLOOKUP(Alt2nr,_Afg07,$BR$131)=4,VLOOKUP(2,Foderkorn,Tørrenr)*$CX$51,))),0)","v":0}]
[]
["Alle omkostninger, foderkorn",null,{"$f":"C424+C425+C444+C446+C448+C450","v":0},null,null,null,{"$f":"G424+G425+G444+G446+G448+G450","v":0},null,null,null,{"$f":"K424+K425+K444+K446+K448+K450","v":0}]

{"sheet":"Ark2","index":1,"n_rows":373,"n_cols":50,"rows_kept":373,"cut":false,"hidden":false,"merged":[[76,11,77,16],[81,11,82,16],[61,11,62,16],[66,11,67,16],[40,11,41,16],[45,11,46,16],[200,7,202,12],[122,11,123,16],[158,6,158,7],[146,9,146,10],[160,6,160,7],[53,2,53,8],[210,7,212,12],[96,0,97,1],[107,0,109,0],[112,0,114,0],[117,0,119,0],[122,0,124,0],[71,11,72,16],[117,11,118,16],[148,9,148,10],[127,11,128,16],[132,11,133,16],[137,11,138,16],[158,9,158,10],[146,6,146,7],[148,6,148,7],[150,6,150,7],[152,6,152,7],[154,6,154,7],[156,6,156,7],[156,9,156,10],[150,9,150,10],[152,9,152,10],[154,9,154,10],[99,2,99,8],[0,0,0,16],[5,18,18,26],[195,7,197,12],[71,0,73,0],[76,0,78,0],[81,0,83,0],[86,0,88,0],[91,0,93,0],[50,0,51,1],[4,0,5,1],[15,0,17,0],[20,0,22,0],[61,0,63,0],[15,11,16,16],[20,11,21,16],[25,11,26,16],[30,11,31,16],[35,11,36,16],[25,0,27,0],[30,0,32,0],[35,0,37,0],[40,0,42,0],[45,0,47,0],[7,2,7,8],[372,7,372,8],[364,10,364,11],[366,10,366,11],[368,10,368,11],[370,10,370,11],[372,10,372,11],[362,10,362,11],[362,7,362,8],[364,7,364,8],[366,7,366,8],[368,7,368,8],[370,7,370,8],[362,4,362,5],[364,4,364,5],[366,4,366,5],[368,4,368,5],[370,4,370,5],[372,4,372,5],[127,0,129,0],[132,0,134,0],[137,0,139,0],[185,0,187,0],[190,0,192,0],[195,0,197,0],[200,0,202,0],[205,0,207,0],[180,2,180,8],[190,7,192,12],[210,0,212,0],[215,0,217,0],[228,0,230,0],[233,0,235,0],[238,0,240,0],[313,6,313,7],[215,7,217,12],[228,7,230,12],[317,6,317,7],[317,9,317,10],[301,7,303,12],[291,7,293,12],[276,7,278,12],[281,7,283,12],[286,7,288,12],[296,7,298,12],[233,7,235,12],[238,7,240,12],[266,2,266,8],[243,7,245,12],[248,7,250,12],[253,7,255,12],[258,7,260,12],[271,7,273,12],[61,18,62,26],[315,6,315,7],[315,9,315,10],[313,9,313,10],[276,0,278,0],[281,0,283,0],[286,0,288,0],[291,0,293,0],[296,0,298,0],[301,0,303,0],[243,0,245,0],[248,0,250,0],[253,0,255,0],[258,0,260,0],[271,0,273,0],[66,0,68,0],[223,2,223,8],[160,9,160,10],[185,7,187,12],[205,7,207,12],[86,11,87,16],[91,11,92,16],[107,11,108,16],[112,11,113,16],[342,9,342,10],[344,9,344,10],[327,6,327,7],[327,9,327,10],[319,9,319,10],[329,9,329,10],[340,9,340,10],[321,6,321,7],[323,6,323,7],[323,9,323,10],[325,6,325,7],[325,9,325,10],[321,9,321,10],[319,6,319,7]]}
["Sædskifteplan m. foderproduktion. Foderbehov (korn)."]
[]
[]
[]
["Delsædskifte 1"]
[null,null,null,null,null,null,null,null,null,null,null,null,null,null,null,null,null,null,"Dette regneark kan anvendes til at udarbejde en sædskifteplan med op til 3 delsædskifter.\n\nFoderproduktionen (korn til svin) bliver beregnet ud fra sædskifteplanen.\n\nI regnearket kan man endvidere beregne foderbehovet (korn til svin). Foderbehovet fordeles på kornarter.\n\nDu kan angive både afgrøder og efterafgrøde.\nMan kan også dele arealet melem 2 afgrøder.\n"]
[]
[null,"Marker/ejendomme:",null,null,null,null,null,null,null,null,null,null,null,null,null,null,null,null,null,null,null,null,null,null,null,null,null,null,null,null,null,null,"Udbyttenr2"]
[]
[null,"Jordtype",null,null,null,null,null,null,null,null,null,null,null,null,null,null,null,null,null,null,null,null,null,null,null,null,null,null,null,null,null,4,{"$f":"IF(AF10=1,5,IF(AF10=2,6,IF(AF10=3,7,IF(AF10=4,8,IF(AF10=5,9,\"\")))))","v":8},"Areal",null,null,null,null,"Database"]
[null,null,null,null,null,null,null,null,null,null,null,null,null,null,null,null,null,null,null,null,null,null,null,null,null,null,null,null,null,null,null,null,null,"til fordeling","Fordelt_areal"]
[null,"Samlet areal",null,"ha",null,null,null,null,null,null,null,null,null,null,null,null,null,null,null,null,null,null,null,null,null,null,null,null,null,null,null,null,null,{"$f":"C12-AH50","v":0},{"$f":"Areal_fordel/Antal_skifter","v":{"$error":"#DIV/0!"}}]
[]
["Afgrødefølge",null,"  Areal",null,null,null," Udbytte pr. ha",null,null,null,null,"Kommentarer",null,null,null,null,null,null,null,null,null,null,null,null,null,null,null,null,null,null,null,null,"Antal","Areal","Efter-","Areal",null,null,"Afgnr","Areal","Udbyt_ha","Udbyt_alt","Efterafgrøde"]
[null,null,null,null,null,null,null,null,null,null,null,null,null,null,null,null,null,null,null,null,null,null,null,null,null,null,null,null,null,null,"Afgrødefølge",null,"skifter","indtastet","afgrøde","indtastet efterafgrøde"]
[1,null,{"$f":"IF(E16>0,\"\",IF(AND(AF16>1,AF18>1,AI16+AI18=0),Fordelt_areal/2,IF(AF16>1,Fordelt_areal,\"\")))","v":""},{"$f":"IF(C16<>\"\",\"ha\",\"\")","v":""},null,"ha",{"$f":"IF(I16<>\"\",\"\",IF(VLOOKUP(AF16,_Afg07,Udbyttenr2)=0,\"\",VLOOKUP(AF16,_Afg07,Udbyttenr2)))","v":""},{"$f":"IF(G16=\"\",\"\",IF(AF16>1,IF(VLOOKUP(AF16,_Afg07,3)<>\"\",VLOOKUP(AF16,_Afg07,3),\"\"),\"\"))","v":""},null,"hkg",null,null,null,null,null,null,null,null,null,null,null,null,null,null,null,null,null,null,null,null,{"$f":"A16","v":1},1,{"$f":"IF(AND(AF16>1,AH16=0),1,0)","v":0},{"$f":"IF(AND(E16<>\"\",VLOOKUP(AF16,_Afg07,3)<>\"\"),E16,0)","v":0},{"$f":"IF(AND(AF16>1,VLOOKUP(AF16,_Afg07,3)=\"\"),1,0)","v":0},{"$f":"IF(AND(E16<>\"\",AF16>1,VLOOKUP(AF16,_Afg07,3)=\"\"),E16,0)","v":0},null,null,{"$f":"AF16","v":1},{"$f":"IF(E16<>\"\",E16,C16)","v":""},{"$f":"IF(I16<>\"\",I16,G16)","v":""},{"$f":"IF(ISERROR(AN16*AO16),0,AN16*AO16)","v":0},{"$f":"AI16","v":0}]
[null,null,null,null,null,null,null,null,null,null,null,null,null,null,null,null,null,null,null,null,null,null,null,null,null,null,null,null,null,null,null,null,null,null,null,null,null,null,{"$f":"AF17","v":0},{"$f":"IF(E17<>\"\",E17,C17)","v":0},{"$f":"IF(I17<>\"\",I17,G17)","v":0},{"$f":"IF(ISERROR(AN17*AO17),0,AN17*AO17)","v":0},{"$f":"AI17","v":0}]
[null,null,{"$f":"IF(E18>0,\"\",IF(E16>0,\"\",IF(AND(AF18>1,AI16+AI18=0),Fordelt_areal/2,IF(AF18>1,Fordelt_areal,\"\"))))","v":""},{"$f":"IF(C18<>\"\",\"ha\",\"\")","v":""},null,"ha",{"$f":"IF(I18<>\"\",\"\",IF(VLOOKUP(AF18,_Afg07,Udbyttenr2)=0,\"\",VLOOKUP(AF18,_Afg07,Udbyttenr2)))","v":""},{"$f":"IF(G18=\"\",\"\",IF(AF18>1,IF(VLOOKUP(AF18,_Afg07,3)<>\"\",VLOOKUP(AF18,_Afg07,3),\"\"),\"\"))","v":""},null,"hkg",null,null,null,null,null,null,null,null,null,null,null,null,null,null,null,null,null,null,null,null,null,1,null,{"$f":"IF(AND(E18<>\"\",VLOOKUP(AF18,_Afg07,3)<>\"\"),E18,0)","v":0},{"$f":"IF(AND(AF18>1,VLOOKUP(AF18,_Afg07,3)=\"\"),1,0)","v":0},{"$f":"IF(AND(E18<>\"\",AF18>1,VLOOKUP(AF18,_Afg07,3)=\"\"),E18,0)","v":0},null,null,1,"","",0,0]
[null,null,null,null,null,null,null,null,null,null,null,null,null,null,null,null,null,null,null,null,null,null,null,null,null,null,null,null,null,null,null,null,null,null,null,null,null,null,0,0,0,0,0]
[null,null,null,null,null,null,null,null,null,null,null,null,null,null,null,null,null,null,null,null,null,null,null,null,null,null,null,null,null,null,null,null,null,null,null,null,null,null,0,0,0,0,0]
[2,null,{"$f":"IF(E21>0,\"\",IF(AND(AF21>1,AF23>1,AI21+AI23=0),Fordelt_areal/2,IF(AF21>1,Fordelt_areal,\"\")))","v":""},{"$f":"IF(C21<>\"\",\"ha\",\"\")","v":""},null,"ha",{"$f":"IF(I21<>\"\",\"\",IF(VLOOKUP(AF21,_Afg07,Udbyttenr2)=0,\"\",VLOOKUP(AF21,_Afg07,Udbyttenr2)))","v":""},{"$f":"IF(G21=\"\",\"\",IF(AF21>1,IF(VLOOKUP(AF21,_Afg07,3)<>\"\",VLOOKUP(AF21,_Afg07,3),\"\"),\"\"))","v":""},null,"hkg",null,null,null,null,null,null,null,null,null,null,null,null,null,null,null,null,null,null,null,null,{"$f":"A21","v":2},1,{"$f":"IF(AND(AF21>1,AH21=0),1,0)","v":0},{"$f":"IF(AND(E21<>\"\",VLOOKUP(AF21,_Afg07,3)<>\"\"),E21,0)","v":0},{"$f":"IF(AND(AF21>1,VLOOKUP(AF21,_Afg07,3)=\"\"),1,0)","v":0},{"$f":"IF(AND(E21<>\"\",AF21>1,VLOOKUP(AF21,_Afg07,3)=\"\"),E21,0)","v":0},null,null,1,"","",0,0]
[null,null,null,null,null,null,null,null,null,null,null,null,null,null,null,null,null,null,null,null,null,null,null,null,null,null,null,null,null,null,null,null,null,null,null,null,null,null,0,0,0,0,0]
[null,null,{"$f":"IF(E23>0,\"\",IF(E21>0,\"\",IF(AND(AF23>1,AI21+AI23=0),Fordelt_areal/2,IF(AF23>1,Fordelt_areal,\"\"))))","v":""},{"$f":"IF(C23<>\"\",\"ha\",\"\")","v":""},null,"ha",{"$f":"IF(I23<>\"\",\"\",IF(VLOOKUP(AF23,_Afg07,Udbyttenr2)=0,\"\",VLOOKUP(AF23,_Afg07,Udbyttenr2)))","v":""},{"$f":"IF(G23=\"\",\"\",IF(AF23>1,IF(VLOOKUP(AF23,_Afg07,3)<>\"\",VLOOKUP(AF23,_Afg07,3),\"\"),\"\"))","v":""},null,"hkg",null,null,null,null,null,null,null,null,null,null,null,null,null,null,null,null,null,null,null,null,null,1,null,{"$f":"IF(AND(E23<>\"\",VLOOKUP(AF23,_Afg07,3)<>\"\"),E23,0)","v":0},{"$f":"IF(AND(AF23>1,VLOOKUP(AF23,_Afg07,3)=\"\"),1,0)","v":0},{"$f":"IF(AND(E23<>\"\",AF23>1,VLOOKUP(AF23,_Afg07,3)=\"\"),E23,0)","v":0},null,null,1,"","",0,0]
[null,null,null,null,null,null,null,null,null,null,null,null,null,null,null,null,null,null,null,null,null,null,null,null,null,null,null,null,null,null,null,null,null,null,null,null,null,null,0,0,0,0,0]
[null,null,null,null,null,null,null,null,null,null,null,null,null,null,null,null,null,null,null,null,null,null,null,null,null,null,null,null,null,null,null,null,null,null,null,null,null,null,0,0,0,0,0]
[3,null,{"$f":"IF(E26>0,\"\",IF(AND(AF26>1,AF28>1,AI26+AI28=0),Fordelt_areal/2,IF(AF26>1,Fordelt_areal,\"\")))","v":""},{"$f":"IF(C26<>\"\",\"ha\",\"\")","v":""},null,"ha",{"$f":"IF(I26<>\"\",\"\",IF(VLOOKUP(AF26,_Afg07,Udbyttenr2)=0,\"\",VLOOKUP(AF26,_Afg07,Udbyttenr2)))","v":""},{"$f":"IF(G26=\"\",\"\",IF(AF26>1,IF(VLOOKUP(AF26,_Afg07,3)<>\"\",VLOOKUP(AF26,_Afg07,3),\"\"),\"\"))","v":""},null,"hkg",null,null,null,null,null,null,null,null,null,null,null,null,null,null,null,null,null,null,null,null,{"$f":"A26","v":3},1,{"$f":"IF(AND(AF26>1,AH26=0),1,0)","v":0},{"$f":"IF(AND(E26<>\"\",VLOOKUP(AF26,_Afg07,3)<>\"\"),E26,0)","v":0},{"$f":"IF(AND(AF26>1,VLOOKUP(AF26,_Afg07,3)=\"\"),1,0)","v":0},{"$f":"IF(AND(E26<>\"\",AF26>1,VLOOKUP(AF26,_Afg07,3)=\"\"),E26,0)","v":0},null,null,1,"","",0,0]
[null,null,null,null,null,null,null,null,null,null,null,null,null,null,null,null,null,null,null,null,null,null,null,null,null,null,null,null,null,null,null,null,null,null,null,null,null,null,0,0,0,0,0]
[null,null,{"$f":"IF(E28>0,\"\",IF(E26>0,\"\",IF(AND(AF28>1,AI26+AI28=0),Fordelt_areal/2,IF(AF28>1,Fordelt_areal,\"\"))))","v":""},{"$f":"IF(C28<>\"\",\"ha\",\"\")","v":""},null,"ha",{"$f":"IF(I28<>\"\",\"\",IF(VLOOKUP(AF28,_Afg07,Udbyttenr2)=0,\"\",VLOOKUP(AF28,_Afg07,Udbyttenr2)))","v":""},{"$f":"IF(G28=\"\",\"\",IF(AF28>1,IF(VLOOKUP(AF28,_Afg07,3)<>\"\",VLOOKUP(AF28,_Afg07,3),\"\"),\"\"))","v":""},null,"hkg",null,null,null,null,null,null,null,null,null,null,null,null,null,null,null,null,null,null,null,null,null,1,null,{"$f":"IF(AND(E28<>\"\",VLOOKUP(AF28,_Afg07,3)<>\"\"),E28,0)","v":0},{"$f":"IF(AND(AF28>1,VLOOKUP(AF28,_Afg07,3)=\"\"),1,0)","v":0},{"$f":"IF(AND(E28<>\"\",AF28>1,VLOOKUP(AF28,_Afg07,3)=\"\"),E28,0)","v":0},null,null,1,"","",0,0]
[null,null,null,null,null,null,null,null,null,null,null,null,null,null,null,null,null,null,null,null,null,null,null,null,null,null,null,null,null,null,null,null,null,null,null,null,null,null,0,0,0,0,0]
[null,null,null,null,null,null,null,null,null,null,null,null,null,null,null,null,null,null,null,null,null,null,null,null,null,null,null,null,null,null,null,null,null,null,null,null,null,null,0,0,0,0,0]
[4,null,{"$f":"IF(E31>0,\"\",IF(AND(AF31>1,AF33>1,AI31+AI33=0),Fordelt_areal/2,IF(AF31>1,Fordelt_areal,\"\")))","v":""},{"$f":"IF(C31<>\"\",\"ha\",\"\")","v":""},null,"ha",{"$f":"IF(I31<>\"\",\"\",IF(VLOOKUP(AF31,_Afg07,Udbyttenr2)=0,\"\",VLOOKUP(AF31,_Afg07,Udbyttenr2)))","v":""},{"$f":"IF(G31=\"\",\"\",IF(AF31>1,IF(VLOOKUP(AF31,_Afg07,3)<>\"\",VLOOKUP(AF31,_Afg07,3),\"\"),\"\"))","v":""},null,"hkg",null,null,null,null,null,null,null,null,null,null,null,null,null,null,null,null,null,null,null,null,{"$f":"A31","v":4},1,{"$f":"IF(AND(AF31>1,AH31=0),1,0)","v":0},{"$f":"IF(AND(E31<>\"\",VLOOKUP(AF31,_Afg07,3)<>\"\"),E31,0)","v":0},{"$f":"IF(AND(AF31>1,VLOOKUP(AF31,_Afg07,3)=\"\"),1,0)","v":0},{"$f":"IF(AND(E31<>\"\",AF31>1,VLOOKUP(AF31,_Afg07,3)=\"\"),E31,0)","v":0},null,null,1,"","",0,0]
[null,null,null,null,null,null,null,null,null,null,null,null,null,null,null,null,null,null,null,null,null,null,null,null,null,null,null,null,null,null,null,null,null,null,null,null,null,null,0,0,0,0,0]
[null,null,{"$f":"IF(E33>0,\"\",IF(E31>0,\"\",IF(AND(AF33>1,AI31+AI33=0),Fordelt_areal/2,IF(AF33>1,Fordelt_areal,\"\"))))","v":""},{"$f":"IF(C33<>\"\",\"ha\",\"\")","v":""},null,"ha",{"$f":"IF(I33<>\"\",\"\",IF(VLOOKUP(AF33,_Afg07,Udbyttenr2)=0,\"\",VLOOKUP(AF33,_Afg07,Udbyttenr2)))","v":""},{"$f":"IF(G33=\"\",\"\",IF(AF33>1,IF(VLOOKUP(AF33,_Afg07,3)<>\"\",VLOOKUP(AF33,_Afg07,3),\"\"),\"\"))","v":""},null,"hkg",null,null,null,null,null,null,null,null,null,null,null,null,null,null,null,null,null,null,null,null,null,1,null,{"$f":"IF(AND(E33<>\"\",VLOOKUP(AF33,_Afg07,3)<>\"\"),E33,0)","v":0},{"$f":"IF(AND(AF33>1,VLOOKUP(AF33,_Afg07,3)=\"\"),1,0)","v":0},{"$f":"IF(AND(E33<>\"\",AF33>1,VLOOKUP(AF33,_Afg07,3)=\"\"),E33,0)","v":0},null,null,1,"","",0,0]
[null,null,null,null,null,null,null,null,null,null,null,null,null,null,null,null,null,null,null,null,null,null,null,null,null,null,null,null,null,null,null,null,null,null,null,null,null,null,0,0,0,0,0]
[null,null,null,null,null,null,null,null,null,null,null,null,null,null,null,null,null,null,null,null,null,null,null,null,null,null,null,null,null,null,null,null,null,null,null,null,null,null,0,0,0,0,0]
[5,null,{"$f":"IF(E36>0,\"\",IF(AND(AF36>1,AF38>1,AI36+AI38=0),Fordelt_areal/2,IF(AF36>1,Fordelt_areal,\"\")))","v":""},{"$f":"IF(C36<>\"\",\"ha\",\"\")","v":""},null,"ha",{"$f":"IF(I36<>\"\",\"\",IF(VLOOKUP(AF36,_Afg07,Udbyttenr2)=0,\"\",VLOOKUP(AF36,_Afg07,Udbyttenr2)))","v":""},{"$f":"IF(G36=\"\",\"\",IF(AF36>1,IF(VLOOKUP(AF36,_Afg07,3)<>\"\",VLOOKUP(AF36,_Afg07,3),\"\"),\"\"))","v":""},null,"hkg",null,null,null,null,null,null,null,null,null,null,null,null,null,null,null,null,null,null,null,null,{"$f":"A36","v":5},1,{"$f":"IF(AND(AF36>1,AH36=0),1,0)","v":0},{"$f":"IF(AND(E36<>\"\",VLOOKUP(AF36,_Afg07,3)<>\"\"),E36,0)","v":0},{"$f":"IF(AND(AF36>1,VLOOKUP(AF36,_Afg07,3)=\"\"),1,0)","v":0},{"$f":"IF(AND(E36<>\"\",AF36>1,VLOOKUP(AF36,_Afg07,3)=\"\"),E36,0)","v":0},null,null,1,"","",0,0]
[null,null,null,null,null,null,null,null,null,null,null,null,null,null,null,null,null,null,null,null,null,null,null,null,null,null,null,null,null,null,null,null,null,null,null,null,null,null,0,0,0,0,0]
[null,null,{"$f":"IF(E38>0,\"\",IF(E36>0,\"\",IF(AND(AF38>1,AI36+AI38=0),Fordelt_areal/2,IF(AF38>1,Fordelt_areal,\"\"))))","v":""},{"$f":"IF(C38<>\"\",\"ha\",\"\")","v":""},null,"ha",{"$f":"IF(I38<>\"\",\"\",IF(VLOOKUP(AF38,_Afg07,Udbyttenr2)=0,\"\",VLOOKUP(AF38,_Afg07,Udbyttenr2)))","v":""},{"$f":"IF(G38=\"\",\"\",IF(AF38>1,IF(VLOOKUP(AF38,_Afg07,3)<>\"\",VLOOKUP(AF38,_Afg07,3),\"\"),\"\"))","v":""},null,"hkg",null,null,null,null,null,null,null,null,null,null,null,null,null,null,null,null,null,null,null,null,null,1,null,{"$f":"IF(AND(E38<>\"\",VLOOKUP(AF38,_Afg07,3)<>\"\"),E38,0)","v":0},{"$f":"IF(AND(AF38>1,VLOOKUP(AF38,_Afg07,3)=\"\"),1,0)","v":0},{"$f":"IF(AND(E38<>\"\",AF38>1,VLOOKUP(AF38,_Afg07,3)=\"\"),E38,0)","v":0},null,null,1,"","",0,0]
[null,null,null,null,null,null,null,null,null,null,null,null,null,null,null,null,null,null,null,null,null,null,null,null,null,null,null,null,null,null,null,null,null,null,null,null,null,null,0,0,0,0,0]
[null,null,null,null,null,null,null,null,null,null,null,null,null,null,null,null,null,null,null,null,null,null,null,null,null,null,null,null,null,null,null,null,null,null,null,null,null,null,0,0,0,0,0]
[6,null,{"$f":"IF(E41>0,\"\",IF(AND(AF41>1,AF43>1,AI41+AI43=0),Fordelt_areal/2,IF(AF41>1,Fordelt_areal,\"\")))","v":""},{"$f":"IF(C41<>\"\",\"ha\",\"\")","v":""},null,"ha",{"$f":"IF(I41<>\"\",\"\",IF(VLOOKUP(AF41,_Afg07,Udbyttenr2)=0,\"\",VLOOKUP(AF41,_Afg07,Udbyttenr2)))","v":""},{"$f":"IF(G41=\"\",\"\",IF(AF41>1,IF(VLOOKUP(AF41,_Afg07,3)<>\"\",VLOOKUP(AF41,_Afg07,3),\"\"),\"\"))","v":""},null,"hkg",null,null,null,null,null,null,null,null,null,null,null,null,null,null,null,null,null,null,null,null,{"$f":"A41","v":6},1,{"$f":"IF(AND(AF41>1,AH41=0),1,0)","v":0},{"$f":"IF(AND(E41<>\"\",VLOOKUP(AF41,_Afg07,3)<>\"\"),E41,0)","v":0},{"$f":"IF(AND(AF41>1,VLOOKUP(AF41,_Afg07,3)=\"\"),1,0)","v":0},{"$f":"IF(AND(E41<>\"\",AF41>1,VLOOKUP(AF41,_Afg07,3)=\"\"),E41,0)","v":0},null,null,1,"","",0,0]
[null,null,null,null,null,null,null,null,null,null,null,null,null,null,null,null,null,null,null,null,null,null,null,null,null,null,null,null,null,null,null,null,null,null,null,null,null,null,0,0,0,0,0]
[null,null,{"$f":"IF(E43>0,\"\",IF(E41>0,\"\",IF(AND(AF43>1,AI41+AI43=0),Fordelt_areal/2,IF(AF43>1,Fordelt_areal,\"\"))))","v":""},{"$f":"IF(C43<>\"\",\"ha\",\"\")","v":""},null,"ha",{"$f":"IF(I43<>\"\",\"\",IF(VLOOKUP(AF43,_Afg07,Udbyttenr2)=0,\"\",VLOOKUP(AF43,_Afg07,Udbyttenr2)))","v":""},{"$f":"IF(G43=\"\",\"\",IF(AF43>1,IF(VLOOKUP(AF43,_Afg07,3)<>\"\",VLOOKUP(AF43,_Afg07,3),\"\"),\"\"))","v":""},null,"hkg",null,null,null,null,null,null,null,null,null,null,null,null,null,null,null,null,null,null,null,null,null,1,null,{"$f":"IF(AND(E43<>\"\",VLOOKUP(AF43,_Afg07,3)<>\"\"),E43,0)","v":0},{"$f":"IF(AND(AF43>1,VLOOKUP(AF43,_Afg07,3)=\"\"),1,0)","v":0},{"$f":"IF(AND(E43<>\"\",AF43>1,VLOOKUP(AF43,_Afg07,3)=\"\"),E43,0)","v":0},null,null,1,"","",0,0]
[null,null,null,null,null,null,null,null,null,null,null,null,null,null,null,null,null,null,null,null,null,null,null,null,null,null,null,null,null,null,null,null,null,null,null,null,null,null,0,0,0,0,0]
[null,null,null,null,null,null,null,null,null,null,null,null,null,null,null,null,null,null,null,null,null,null,null,null,null,null,null,null,null,null,null,null,null,null,null,null,null,null,0,0,0,0,0]
[7,null,{"$f":"IF(E46>0,\"\",IF(AND(AF46>1,AF48>1,AI46+AI48=0),Fordelt_areal/2,IF(AF46>1,Fordelt_areal,\"\")))","v":""},{"$f":"IF(C46<>\"\",\"ha\",\"\")","v":""},null,"ha",{"$f":"IF(I46<>\"\",\"\",IF(VLOOKUP(AF46,_Afg07,Udbyttenr2)=0,\"\",VLOOKUP(AF46,_Afg07,Udbyttenr2)))","v":""},{"$f":"IF(G46=\"\",\"\",IF(AF46>1,IF(VLOOKUP(AF46,_Afg07,3)<>\"\",VLOOKUP(AF46,_Afg07,3),\"\"),\"\"))","v":""},null,"hkg",null,null,null,null,null,null,null,null,null,null,null,null,null,null,null,null,null,null,null,null,{"$f":"A46","v":7},1,{"$f":"IF(AND(AF46>1,AH46=0),1,0)","v":0},{"$f":"IF(AND(E46<>\"\",VLOOKUP(AF46,_Afg07,3)<>\"\"),E46,0)","v":0},{"$f":"IF(AND(AF46>1,VLOOKUP(AF46,_Afg07,3)=\"\"),1,0)","v":0},{"$f":"IF(AND(E46<>\"\",AF46>1,VLOOKUP(AF46,_Afg07,3)=\"\"),E46,0)","v":0},null,null,1,"","",0,0]
[null,null,null,null,null,null,null,null,null,null,null,null,null,null,null,null,null,null,null,null,null,null,null,null,null,null,null,null,null,null,null,null,null,null,null,null,null,null,0,0,0,0,0]
[null,null,{"$f":"IF(E48>0,\"\",IF(E46>0,\"\",IF(AND(AF48>1,AI46+AI48=0),Fordelt_areal/2,IF(AF48>1,Fordelt_areal,\"\"))))","v":""},{"$f":"IF(C48<>\"\",\"ha\",\"\")","v":""},null,"ha",{"$f":"IF(I48<>\"\",\"\",IF(VLOOKUP(AF48,_Afg07,Udbyttenr2)=0,\"\",VLOOKUP(AF48,_Afg07,Udbyttenr2)))","v":""},{"$f":"IF(G48=\"\",\"\",IF(AF48>1,IF(VLOOKUP(AF48,_Afg07,3)<>\"\",VLOOKUP(AF48,_Afg07,3),\"\"),\"\"))","v":""},null,"hkg",null,null,null,null,null,null,null,null,null,null,null,null,null,null,null,null,null,null,null,null,null,1,null,{"$f":"IF(AND(E48<>\"\",VLOOKUP(AF48,_Afg07,3)<>\"\"),E48,0)","v":0},{"$f":"IF(AND(AF48>1,VLOOKUP(AF48,_Afg07,3)=\"\"),1,0)","v":0},{"$f":"IF(AND(E48<>\"\",AF48>1,VLOOKUP(AF48,_Afg07,3)=\"\"),E48,0)","v":0},null,null,1,"","",0,0]
[]
[null,null,null,null,null,null,null,null,null,null,null,null,null,null,null,null,null,null,null,null,null,null,null,null,null,null,null,null,null,null,"Sum",null,{"$f":"AG16+AG18+AG21+AG23+AG26+AG28+AG31+AG33+AG36+AG38+AG41+AG43+AG46+AG48","v":0},{"$f":"AH16+AH18+AH21+AH23+AH26+AH28+AH31+AH33+AH36+AH38+AH41+AH43+AH46+AH48","v":0},null,{"$f":"AJ16+AJ18+AJ21+AJ23+AJ26+AJ28+AJ31+AJ33+AJ36+AJ38+AJ41+AJ43+AJ46+AJ48","v":0}]
["Delsædskifte 2"]
[]
[]
[null,"Marker/ejendomme:",null,null,null,null,null,null,null,null,null,null,null,null,null,null,null,null,null,null,null,null,null,null,null,null,null,null,null,null,null,null,"Udbyttenr3"]
[]
[null,"Jordtype",null,null,null,null,null,null,null,null,null,null,null,null,null,null,null,null,null,null,null,null,null,null,null,null,null,null,null,null,null,4,{"$f":"IF(AF56=1,5,IF(AF56=2,6,IF(AF56=3,7,IF(AF56=4,8,IF(AF56=5,9,\"\")))))","v":8},"Areal"]
[null,null,null,null,null,null,null,null,null,null,null,null,null,null,null,null,null,null,null,null,null,null,null,null,null,null,null,null,null,null,null,null,null,"til fordeling","Fordelt_areal"]
[null,"Samlet areal",null,"ha",null,null,null,null,null,null,null,null,null,null,null,null,null,null,null,null,null,null,null,null,null,null,null,null,null,null,null,null,null,{"$f":"C58-AH96","v":0},{"$f":"Areal_fordel2/Antal_skifter2","v":{"$error":"#DIV/0!"}}]
[]
["Afgrødefølge",null,"  Areal",null,null,null," Udbytte pr. ha",null,null,null,null,"Kommentarer",null,null,null,null,null,null,null,null,null,null,null,null,null,null,null,null,null,null,null,null,"Antal","Areal","Efter-","Areal"]
[null,null,null,null,null,null,null,null,null,null,null,null,null,null,null,null,null,null,null,null,null,null,null,null,null,null,null,null,null,null,"Afgrødefølge",null,"skifter","indtastet","afgrøde","indtastet efterafgrøde"]
[1,null,{"$f":"IF(E62>0,\"\",IF(AND(AF62>1,AF64>1,AI62+AI64=0),Fordelt_areal2/2,IF(AF62>1,Fordelt_areal2,\"\")))","v":""},{"$f":"IF(C62<>\"\",\"ha\",\"\")","v":""},null,"ha",{"$f":"IF(I62<>\"\",\"\",IF(VLOOKUP(AF62,_Afg07,Udbyttenr3)=0,\"\",VLOOKUP(AF62,_Afg07,Udbyttenr3)))","v":""},{"$f":"IF(G62=\"\",\"\",IF(AF62>1,IF(VLOOKUP(AF62,_Afg07,3)<>\"\",VLOOKUP(AF62,_Afg07,3),\"\"),\"\"))","v":""},null,"hkg",null,null,null,null,null,null,null,null,"Du kan angive både afgrøde og efterafgrøde. \nMan kan også dele arealet mellem 2 afgrøder.",null,null,null,null,null,null,null,null,null,null,null,{"$f":"A62","v":1},1,{"$f":"IF(AND(AF62>1,AH62=0),1,0)","v":0},{"$f":"IF(AND(E62<>\"\",VLOOKUP(AF62,_Afg07,3)<>\"\"),E62,0)","v":0},{"$f":"IF(AND(AF62>1,VLOOKUP(AF62,_Afg07,3)=\"\"),1,0)","v":0},{"$f":"IF(AND(E62<>\"\",AF62>1,VLOOKUP(AF62,_Afg07,3)=\"\"),E62,0)","v":0},null,null,1,"","",0,{"$f":"AI62","v":0}]
[null,null,null,null,null,null,null,null,null,null,null,null,null,null,null,null,null,null,null,null,null,null,null,null,null,null,null,null,null,null,null,null,null,null,null,null,null,null,0,0,0,0,0]
[null,null,{"$f":"IF(E64>0,\"\",IF(E62>0,\"\",IF(AND(AF64>1,AI62+AI64=0),Fordelt_areal2/2,IF(AF64>1,Fordelt_areal2,\"\"))))","v":""},{"$f":"IF(C64<>\"\",\"ha\",\"\")","v":""},null,"ha",{"$f":"IF(I64<>\"\",\"\",IF(VLOOKUP(AF64,_Afg07,Udbyttenr3)=0,\"\",VLOOKUP(AF64,_Afg07,Udbyttenr3)))","v":""},{"$f":"IF(G64=\"\",\"\",IF(AF64>1,IF(VLOOKUP(AF64,_Afg07,3)<>\"\",VLOOKUP(AF64,_Afg07,3),\"\"),\"\"))","v":""},null,"hkg",null,null,null,null,null,null,null,null,null,null,null,null,null,null,null,null,null,null,null,null,null,1,null,{"$f":"IF(AND(E64<>\"\",VLOOKUP(AF64,_Afg07,3)<>\"\"),E64,0)","v":0},{"$f":"IF(AND(AF64>1,VLOOKUP(AF64,_Afg07,3)=\"\"),1,0)","v":0},{"$f":"IF(AND(E64<>\"\",AF64>1,VLOOKUP(AF64,_Afg07,3)=\"\"),E64,0)","v":0},null,null,1,"","",0,0]
[null,null,null,null,null,null,null,null,null,null,null,null,null,null,null,null,null,null,null,null,null,null,null,null,null,null,null,null,null,null,null,null,null,null,null,null,null,null,0,0,0,0,0]
[null,null,null,null,null,null,null,null,null,null,null,null,null,null,null,null,null,null,null,null,null,null,null,null,null,null,null,null,null,null,null,null,null,null,null,null,null,null,0,0,0,0,0]
[2,null,{"$f":"IF(E67>0,\"\",IF(AND(AF67>1,AF69>1,AI67+AI69=0),Fordelt_areal2/2,IF(AF67>1,Fordelt_areal2,\"\")))","v":""},{"$f":"IF(C67<>\"\",\"ha\",\"\")","v":""},null,"ha",{"$f":"IF(I67<>\"\",\"\",IF(VLOOKUP(AF67,_Afg07,Udbyttenr3)=0,\"\",VLOOKUP(AF67,_Afg07,Udbyttenr3)))","v":""},{"$f":"IF(G67=\"\",\"\",IF(AF67>1,IF(VLOOKUP(AF67,_Afg07,3)<>\"\",VLOOKUP(AF67,_Afg07,3),\"\"),\"\"))","v":""},null,"hkg",null,null,null,null,null,null,null,null,null,null,null,null,null,null,null,null,null,null,null,null,{"$f":"A67","v":2},1,{"$f":"IF(AND(AF67>1,AH67=0),1,0)","v":0},{"$f":"IF(AND(E67<>\"\",VLOOKUP(AF67,_Afg07,3)<>\"\"),E67,0)","v":0},{"$f":"IF(AND(AF67>1,VLOOKUP(AF67,_Afg07,3)=\"\"),1,0)","v":0},{"$f":"IF(AND(E67<>\"\",AF67>1,VLOOKUP(AF67,_Afg07,3)=\"\"),E67,0)","v":0},null,null,1,"","",0,0]
[null,null,null,null,null,null,null,null,null,null,null,null,null,null,null,null,null,null,null,null,null,null,null,null,null,null,null,null,null,null,null,null,null,null,null,null,null,null,0,0,0,0,0]
[null,null,{"$f":"IF(E69>0,\"\",IF(E67>0,\"\",IF(AND(AF69>1,AI67+AI69=0),Fordelt_areal2/2,IF(AF69>1,Fordelt_areal2,\"\"))))","v":""},{"$f":"IF(C69<>\"\",\"ha\",\"\")","v":""},null,"ha",{"$f":"IF(I69<>\"\",\"\",IF(VLOOKUP(AF69,_Afg07,Udbyttenr3)=0,\"\",VLOOKUP(AF69,_Afg07,Udbyttenr3)))","v":""},{"$f":"IF(G69=\"\",\"\",IF(AF69>1,IF(VLOOKUP(AF69,_Afg07,3)<>\"\",VLOOKUP(AF69,_Afg07,3),\"\"),\"\"))","v":""},null,"hkg",null,null,null,null,null,null,null,null,null,null,null,null,null,null,null,null,null,null,null,null,null,1,null,{"$f":"IF(AND(E69<>\"\",VLOOKUP(AF69,_Afg07,3)<>\"\"),E69,0)","v":0},{"$f":"IF(AND(AF69>1,VLOOKUP(AF69,_Afg07,3)=\"\"),1,0)","v":0},{"$f":"IF(AND(E69<>\"\",AF69>1,VLOOKUP(AF69,_Afg07,3)=\"\"),E69,0)","v":0},null,null,1,"","",0,0]
[null,null,null,null,null,null,null,null,null,null,null,null,null,null,null,null,null,null,null,null,null,null,null,null,null,null,null,null,null,null,null,null,null,null,null,null,null,null,0,0,0,0,0]
[null,null,null,null,null,null,null,null,null,null,null,null,null,null,null,null,null,null,null,null,null,null,null,null,null,null,null,null,null,null,null,2,null,null,null,null,null,null,2,0,0,0,0]
[3,null,{"$f":"IF(E72>0,\"\",IF(AND(AF72>1,AF74>1,AI72+AI74=0),Fordelt_areal2/2,IF(AF72>1,Fordelt_areal2,\"\")))","v":""},{"$f":"IF(C72<>\"\",\"ha\",\"\")","v":""},null,"ha",{"$f":"IF(I72<>\"\",\"\",IF(VLOOKUP(AF72,_Afg07,Udbyttenr3)=0,\"\",VLOOKUP(AF72,_Afg07,Udbyttenr3)))","v":""},{"$f":"IF(G72=\"\",\"\",IF(AF72>1,IF(VLOOKUP(AF72,_Afg07,3)<>\"\",VLOOKUP(AF72,_Afg07,3),\"\"),\"\"))","v":""},null,"hkg",null,null,null,null,null,null,null,null,null,null,null,null,null,null,null,null,null,null,null,null,{"$f":"A72","v":3},1,{"$f":"IF(AND(AF72>1,AH72=0),1,0)","v":0},{"$f":"IF(AND(E72<>\"\",VLOOKUP(AF72,_Afg07,3)<>\"\"),E72,0)","v":0},{"$f":"IF(AND(AF72>1,VLOOKUP(AF72,_Afg07,3)=\"\"),1,0)","v":0},{"$f":"IF(AND(E72<>\"\",AF72>1,VLOOKUP(AF72,_Afg07,3)=\"\"),E72,0)","v":0},null,null,1,"","",0,0]
[null,null,null,null,null,null,null,null,null,null,null,null,null,null,null,null,null,null,null,null,null,null,null,null,null,null,null,null,null,null,null,null,null,null,null,null,null,null,0,0,0,0,0]
[null,null,{"$f":"IF(E74>0,\"\",IF(E72>0,\"\",IF(AND(AF74>1,AI72+AI74=0),Fordelt_areal2/2,IF(AF74>1,Fordelt_areal2,\"\"))))","v":""},{"$f":"IF(C74<>\"\",\"ha\",\"\")","v":""},null,"ha",{"$f":"IF(I74<>\"\",\"\",IF(VLOOKUP(AF74,_Afg07,Udbyttenr3)=0,\"\",VLOOKUP(AF74,_Afg07,Udbyttenr3)))","v":""},{"$f":"IF(G74=\"\",\"\",IF(AF74>1,IF(VLOOKUP(AF74,_Afg07,3)<>\"\",VLOOKUP(AF74,_Afg07,3),\"\"),\"\"))","v":""},null,"hkg",null,null,null,null,null,null,null,null,null,null,null,null,null,null,null,null,null,null,null,null,null,1,null,{"$f":"IF(AND(E74<>\"\",VLOOKUP(AF74,_Afg07,3)<>\"\"),E74,0)","v":0},{"$f":"IF(AND(AF74>1,VLOOKUP(AF74,_Afg07,3)=\"\"),1,0)","v":0},{"$f":"IF(AND(E74<>\"\",AF74>1,VLOOKUP(AF74,_Afg07,3)=\"\"),E74,0)","v":0},null,null,1,"","",0,0]
[null,null,null,null,null,null,null,null,null,null,null,null,null,null,null,null,null,null,null,null,null,null,null,null,null,null,null,null,null,null,null,null,null,null,null,null,null,null,0,0,0,0,0]
[null,null,null,null,null,null,null,null,null,null,null,null,null,null,null,null,null,null,null,null,null,null,null,null,null,null,null,null,null,null,null,null,null,null,null,null,null,null,0,0,0,0,0]
[4,null,{"$f":"IF(E77>0,\"\",IF(AND(AF77>1,AF79>1,AI77+AI79=0),Fordelt_areal2/2,IF(AF77>1,Fordelt_areal2,\"\")))","v":""},{"$f":"IF(C77<>\"\",\"ha\",\"\")","v":""},null,"ha",{"$f":"IF(I77<>\"\",\"\",IF(VLOOKUP(AF77,_Afg07,Udbyttenr3)=0,\"\",VLOOKUP(AF77,_Afg07,Udbyttenr3)))","v":""},{"$f":"IF(G77=\"\",\"\",IF(AF77>1,IF(VLOOKUP(AF77,_Afg07,3)<>\"\",VLOOKUP(AF77,_Afg07,3),\"\"),\"\"))","v":""},null,"hkg",null,null,null,null,null,null,null,null,null,null,null,null,null,null,null,null,null,null,null,null,{"$f":"A77","v":4},1,{"$f":"IF(AND(AF77>1,AH77=0),1,0)","v":0},{"$f":"IF(AND(E77<>\"\",VLOOKUP(AF77,_Afg07,3)<>\"\"),E77,0)","v":0},{"$f":"IF(AND(AF77>1,VLOOKUP(AF77,_Afg07,3)=\"\"),1,0)","v":0},{"$f":"IF(AND(E77<>\"\",AF77>1,VLOOKUP(AF77,_Afg07,3)=\"\"),E77,0)","v":0},null,null,1,"","",0,0]
[null,null,null,null,null,null,null,null,null,null,null,null,null,null,null,null,null,null,null,null,null,null,null,null,null,null,null,null,null,null,null,null,null,null,null,null,null,null,0,0,0,0,0]
[null,null,{"$f":"IF(E79>0,\"\",IF(E77>0,\"\",IF(AND(AF79>1,AI77+AI79=0),Fordelt_areal2/2,IF(AF79>1,Fordelt_areal2,\"\"))))","v":""},{"$f":"IF(C79<>\"\",\"ha\",\"\")","v":""},null,"ha",{"$f":"IF(I79<>\"\",\"\",IF(VLOOKUP(AF79,_Afg07,Udbyttenr3)=0,\"\",VLOOKUP(AF79,_Afg07,Udbyttenr3)))","v":""},{"$f":"IF(G79=\"\",\"\",IF(AF79>1,IF(VLOOKUP(AF79,_Afg07,3)<>\"\",VLOOKUP(AF79,_Afg07,3),\"\"),\"\"))","v":""},null,"hkg",null,null,null,null,null,null,null,null,null,null,null,null,null,null,null,null,null,null,null,null,null,1,null,{"$f":"IF(AND(E79<>\"\",VLOOKUP(AF79,_Afg07,3)<>\"\"),E79,0)","v":0},{"$f":"IF(AND(AF79>1,VLOOKUP(AF79,_Afg07,3)=\"\"),1,0)","v":0},{"$f":"IF(AND(E79<>\"\",AF79>1,VLOOKUP(AF79,_Afg07,3)=\"\"),E79,0)","v":0},null,null,1,"","",0,0]
[null,null,null,null,null,null,null,null,null,null,null,null,null,null,null,null,null,null,null,null,null,null,null,null,null,null,null,null,null,null,null,null,null,null,null,null,null,null,0,0,0,0,0]
[null,null,null,null,null,null,null,null,null,null,null,null,null,null,null,null,null,null,null,null,null,null,null,null,null,null,null,null,null,null,null,null,null,null,null,null,null,null,{"$f":"AF81","v":0},{"$f":"IF(E81<>\"\",E81,C81)","v":0},{"$f":"IF(I81<>\"\",I81,G81)","v":0},{"$f":"IF(ISERROR(AN81*AO81),0,AN81*AO81)","v":0},0]
[5,null,{"$f":"IF(E82>0,\"\",IF(AND(AF82>1,AF84>1,AI82+AI84=0),Fordelt_areal2/2,IF(AF82>1,Fordelt_areal2,\"\")))","v":""},{"$f":"IF(C82<>\"\",\"ha\",\"\")","v":""},null,"ha",{"$f":"IF(I82<>\"\",\"\",IF(VLOOKUP(AF82,_Afg07,Udbyttenr3)=0,\"\",VLOOKUP(AF82,_Afg07,Udbyttenr3)))","v":""},{"$f":"IF(G82=\"\",\"\",IF(AF82>1,IF(VLOOKUP(AF82,_Afg07,3)<>\"\",VLOOKUP(AF82,_Afg07,3),\"\"),\"\"))","v":""},null,"hkg",null,null,null,null,null,null,null,null,null,null,null,null,null,null,null,null,null,null,null,null,{"$f":"A82","v":5},1,{"$f":"IF(AND(AF82>1,AH82=0),1,0)","v":0},{"$f":"IF(AND(E82<>\"\",VLOOKUP(AF82,_Afg07,3)<>\"\"),E82,0)","v":0},{"$f":"IF(AND(AF82>1,VLOOKUP(AF82,_Afg07,3)=\"\"),1,0)","v":0},{"$f":"IF(AND(E82<>\"\",AF82>1,VLOOKUP(AF82,_Afg07,3)=\"\"),E82,0)","v":0},null,null,1,"","",0,0]
[null,null,null,null,null,null,null,null,null,null,null,null,null,null,null,null,null,null,null,null,null,null,null,null,null,null,null,null,null,null,null,null,null,null,null,null,null,null,0,0,0,0,0]
[null,null,{"$f":"IF(E84>0,\"\",IF(E82>0,\"\",IF(AND(AF84>1,AI82+AI84=0),Fordelt_areal2/2,IF(AF84>1,Fordelt_areal2,\"\"))))","v":""},{"$f":"IF(C84<>\"\",\"ha\",\"\")","v":""},null,"ha",{"$f":"IF(I84<>\"\",\"\",IF(VLOOKUP(AF84,_Afg07,Udbyttenr3)=0,\"\",VLOOKUP(AF84,_Afg07,Udbyttenr3)))","v":""},{"$f":"IF(G84=\"\",\"\",IF(AF84>1,IF(VLOOKUP(AF84,_Afg07,3)<>\"\",VLOOKUP(AF84,_Afg07,3),\"\"),\"\"))","v":""},null,"hkg",null,null,null,null,null,null,null,null,null,null,null,null,null,null,null,null,null,null,null,null,null,1,null,{"$f":"IF(AND(E84<>\"\",VLOOKUP(AF84,_Afg07,3)<>\"\"),E84,0)","v":0},{"$f":"IF(AND(AF84>1,VLOOKUP(AF84,_Afg07,3)=\"\"),1,0)","v":0},{"$f":"IF(AND(E84<>\"\",AF84>1,VLOOKUP(AF84,_Afg07,3)=\"\"),E84,0)","v":0},null,null,1,"","",0,0]
[null,null,null,null,null,null,null,null,null,null,null,null,null,null,null,null,null,null,null,null,null,null,null,null,null,null,null,null,null,null,null,null,null,null,null,null,null,null,0,0,0,0,0]
[null,null,null,null,null,null,null,null,null,null,null,null,null,null,null,null,null,null,null,null,null,null,null,null,null,null,null,null,null,null,null,null,null,null,null,null,null,null,0,0,0,0,0]
[6,null,{"$f":"IF(E87>0,\"\",IF(AND(AF87>1,AF89>1,AI87+AI89=0),Fordelt_areal2/2,IF(AF87>1,Fordelt_areal2,\"\")))","v":""},{"$f":"IF(C87<>\"\",\"ha\",\"\")","v":""},null,"ha",{"$f":"IF(I87<>\"\",\"\",IF(VLOOKUP(AF87,_Afg07,Udbyttenr3)=0,\"\",VLOOKUP(AF87,_Afg07,Udbyttenr3)))","v":""},{"$f":"IF(G87=\"\",\"\",IF(AF87>1,IF(VLOOKUP(AF87,_Afg07,3)<>\"\",VLOOKUP(AF87,_Afg07,3),\"\"),\"\"))","v":""},null,"hkg",null,null,null,null,null,null,null,null,null,null,null,null,null,null,null,null,null,null,null,null,{"$f":"A87","v":6},1,{"$f":"IF(AND(AF87>1,AH87=0),1,0)","v":0},{"$f":"IF(AND(E87<>\"\",VLOOKUP(AF87,_Afg07,3)<>\"\"),E87,0)","v":0},{"$f":"IF(AND(AF87>1,VLOOKUP(AF87,_Afg07,3)=\"\"),1,0)","v":0},{"$f":"IF(AND(E87<>\"\",AF87>1,VLOOKUP(AF87,_Afg07,3)=\"\"),E87,0)","v":0},null,null,1,"","",0,0]
[null,null,null,null,null,null,null,null,null,null,null,null,null,null,null,null,null,null,null,null,null,null,null,null,null,null,null,null,null,null,null,null,null,null,null,null,null,null,0,0,0,0,0]
[null,null,{"$f":"IF(E89>0,\"\",IF(E87>0,\"\",IF(AND(AF89>1,AI87+AI89=0),Fordelt_areal2/2,IF(AF89>1,Fordelt_areal2,\"\"))))","v":""},{"$f":"IF(C89<>\"\",\"ha\",\"\")","v":""},null,"ha",{"$f":"IF(I89<>\"\",\"\",IF(VLOOKUP(AF89,_Afg07,Udbyttenr3)=0,\"\",VLOOKUP(AF89,_Afg07,Udbyttenr3)))","v":""},{"$f":"IF(G89=\"\",\"\",IF(AF89>1,IF(VLOOKUP(AF89,_Afg07,3)<>\"\",VLOOKUP(AF89,_Afg07,3),\"\"),\"\"))","v":""},null,"hkg",null,null,null,null,null,null,null,null,null,null,null,null,null,null,null,null,null,null,null,null,null,1,null,{"$f":"IF(AND(E89<>\"\",VLOOKUP(AF89,_Afg07,3)<>\"\"),E89,0)","v":0},{"$f":"IF(AND(AF89>1,VLOOKUP(AF89,_Afg07,3)=\"\"),1,0)","v":0},{"$f":"IF(AND(E89<>\"\",AF89>1,VLOOKUP(AF89,_Afg07,3)=\"\"),E89,0)","v":0},null,null,1,"","",0,0]
[null,null,null,null,null,null,null,null,null,null,null,null,null,null,null,null,null,null,null,null,null,null,null,null,null,null,null,null,null,null,null,null,null,null,null,null,null,null,0,0,0,0,0]
[null,null,null,null,null,null,null,null,null,null,null,null,null,null,null,null,null,null,null,null,null,null,null,null,null,null,null,null,null,null,null,null,null,null,null,null,null,null,0,0,0,0,0]
[7,null,{"$f":"IF(E92>0,\"\",IF(AND(AF92>1,AF94>1,AI92+AI94=0),Fordelt_areal2/2,IF(AF92>1,Fordelt_areal2,\"\")))","v":""},{"$f":"IF(C92<>\"\",\"ha\",\"\")","v":""},null,"ha",{"$f":"IF(I92<>\"\",\"\",IF(VLOOKUP(AF92,_Afg07,Udbyttenr3)=0,\"\",VLOOKUP(AF92,_Afg07,Udbyttenr3)))","v":""},{"$f":"IF(G92=\"\",\"\",IF(AF92>1,IF(VLOOKUP(AF92,_Afg07,3)<>\"\",VLOOKUP(AF92,_Afg07,3),\"\"),\"\"))","v":""},null,"hkg",null,null,null,null,null,null,null,null,null,null,null,null,null,null,null,null,null,null,null,null,{"$f":"A92","v":7},1,{"$f":"IF(AND(AF92>1,AH92=0),1,0)","v":0},{"$f":"IF(AND(E92<>\"\",VLOOKUP(AF92,_Afg07,3)<>\"\"),E92,0)","v":0},{"$f":"IF(AND(AF92>1,VLOOKUP(AF92,_Afg07,3)=\"\"),1,0)","v":0},{"$f":"IF(AND(E92<>\"\",AF92>1,VLOOKUP(AF92,_Afg07,3)=\"\"),E92,0)","v":0},null,null,1,"","",0,0]
[null,null,null,null,null,null,null,null,null,null,null,null,null,null,null,null,null,null,null,null,null,null,null,null,null,null,null,null,null,null,null,null,null,null,null,null,null,null,0,0,0,0,0]
[null,null,{"$f":"IF(E94>0,\"\",IF(E92>0,\"\",IF(AND(AF94>1,AI92+AI94=0),Fordelt_areal2/2,IF(AF94>1,Fordelt_areal2,\"\"))))","v":""},{"$f":"IF(C94<>\"\",\"ha\",\"\")","v":""},null,"ha",{"$f":"IF(I94<>\"\",\"\",IF(VLOOKUP(AF94,_Afg07,Udbyttenr3)=0,\"\",VLOOKUP(AF94,_Afg07,Udbyttenr3)))","v":""},{"$f":"IF(G94=\"\",\"\",IF(AF94>1,IF(VLOOKUP(AF94,_Afg07,3)<>\"\",VLOOKUP(AF94,_Afg07,3),\"\"),\"\"))","v":""},null,"hkg",null,null,null,null,null,null,null,null,null,null,null,null,null,null,null,null,null,null,null,null,null,1,null,{"$f":"IF(AND(E94<>\"\",VLOOKUP(AF94,_Afg07,3)<>\"\"),E94,0)","v":0},{"$f":"IF(AND(AF94>1,VLOOKUP(AF94,_Afg07,3)=\"\"),1,0)","v":0},{"$f":"IF(AND(E94<>\"\",AF94>1,VLOOKUP(AF94,_Afg07,3)=\"\"),E94,0)","v":0},null,null,1,"","",0,0]
[]
[null,null,null,null,null,null,null,null,null,null,null,null,null,null,null,null,null,null,null,null,null,null,null,null,null,null,null,null,null,null,"Sum",null,{"$f":"AG62+AG64+AG67+AG69+AG72+AG74+AG77+AG79+AG82+AG84+AG87+AG89+AG92+AG94","v":0},{"$f":"AH62+AH64+AH67+AH69+AH72+AH74+AH77+AH79+AH82+AH84+AH87+AH89+AH92+AH94","v":0},null,{"$f":"AJ62+AJ64+AJ67+AJ69+AJ72+AJ74+AJ77+AJ79+AJ82+AJ84+AJ87+AJ89+AJ92+AJ94","v":0}]
["Delsædskifte 3"]
[]
[]
[null,"Marker/ejendomme:",null,null,null,null,null,null,null,null,null,null,null,null,null,null,null,null,null,null,null,null,null,null,null,null,null,null,null,null,null,null,"Udbyttenr4"]
[]
[null,"Jordtype",null,null,null,null,null,null,null,null,null,null,null,null,null,null,null,null,null,null,null,null,null,null,null,null,null,null,null,null,null,4,{"$f":"IF(AF102=1,5,IF(AF102=2,6,IF(AF102=3,7,IF(AF102=4,8,IF(AF102=5,9,\"\")))))","v":8},"Areal"]
[null,null,null,null,null,null,null,null,null,null,null,null,null,null,null,null,null,null,null,null,null,null,null,null,null,null,null,null,null,null,null,null,null,"til fordeling","Fordelt_areal"]
[null,"Samlet areal",null,"ha",null,null,null,null,null,null,null,null,null,null,null,null,null,null,null,null,null,null,null,null,null,null,null,null,null,null,null,null,null,{"$f":"C104-AH142","v":0},{"$f":"Areal_fordel3/Antal_skifter3","v":{"$error":"#DIV/0!"}}]
[]
["Afgrødefølge",null,"  Areal",null,null,null," Udbytte pr. ha",null,null,null,null,"Kommentarer",null,null,null,null,null,null,null,null,null,null,null,null,null,null,null,null,null,null,null,null,"Antal","Areal","Efter-","Areal"]
[null,null,null,null,null,null,null,null,null,null,null,null,null,null,null,null,null,null,null,null,null,null,null,null,null,null,null,null,null,null,"Afgrødefølge",null,"skifter","indtastet","afgrøde","indtastet efterafgrøde"]
[1,null,{"$f":"IF(E108>0,\"\",IF(AND(AF108>1,AF110>1,AI108+AI110=0),Fordelt_areal3/2,IF(AF108>1,Fordelt_areal3,\"\")))","v":""},{"$f":"IF(C108<>\"\",\"ha\",\"\")","v":""},null,"ha",{"$f":"IF(I108<>\"\",\"\",IF(VLOOKUP(AF108,_Afg07,Udbyttenr4)=0,\"\",VLOOKUP(AF108,_Afg07,Udbyttenr4)))","v":""},{"$f":"IF(G108=\"\",\"\",IF(AF108>1,IF(VLOOKUP(AF108,_Afg07,3)<>\"\",VLOOKUP(AF108,_Afg07,3),\"\"),\"\"))","v":""},null,"hkg",null,null,null,null,null,null,null,null,null,null,null,null,null,null,null,null,null,null,null,null,{"$f":"A108","v":1},1,{"$f":"IF(AND(AF108>1,AH108=0),1,0)","v":0},{"$f":"IF(AND(E108<>\"\",VLOOKUP(AF108,_Afg07,3)<>\"\"),E108,0)","v":0},{"$f":"IF(AND(AF108>1,VLOOKUP(AF108,_Afg07,3)=\"\"),1,0)","v":0},{"$f":"IF(AND(E108<>\"\",AF108>1,VLOOKUP(AF108,_Afg07,3)=\"\"),E108,0)","v":0},null,null,1,"","",0,{"$f":"AI108","v":0}]
[null,null,null,null,null,null,null,null,null,null,null,null,null,null,null,null,null,null,null,null,null,null,null,null,null,null,null,null,null,null,null,null,null,null,null,null,null,null,0,0,0,0,0]
[null,null,{"$f":"IF(E110>0,\"\",IF(E108>0,\"\",IF(AND(AF110>1,AI108+AI110=0),Fordelt_areal3/2,IF(AF110>1,Fordelt_areal3,\"\"))))","v":""},{"$f":"IF(C110<>\"\",\"ha\",\"\")","v":""},null,"ha",{"$f":"IF(I110<>\"\",\"\",IF(VLOOKUP(AF110,_Afg07,Udbyttenr4)=0,\"\",VLOOKUP(AF110,_Afg07,Udbyttenr4)))","v":""},{"$f":"IF(G110=\"\",\"\",IF(AF110>1,IF(VLOOKUP(AF110,_Afg07,3)<>\"\",VLOOKUP(AF110,_Afg07,3),\"\"),\"\"))","v":""},null,"hkg",null,null,null,null,null,null,null,null,null,null,null,null,null,null,null,null,null,null,null,null,null,1,null,{"$f":"IF(AND(E110<>\"\",VLOOKUP(AF110,_Afg07,3)<>\"\"),E110,0)","v":0},{"$f":"IF(AND(AF110>1,VLOOKUP(AF110,_Afg07,3)=\"\"),1,0)","v":0},{"$f":"IF(AND(E110<>\"\",AF110>1,VLOOKUP(AF110,_Afg07,3)=\"\"),E110,0)","v":0},null,null,1,"","",0,0]
[null,null,null,null,null,null,null,null,null,null,null,null,null,null,null,null,null,null,null,null,null,null,null,null,null,null,null,null,null,null,null,null,null,null,null,null,null,null,0,0,0,0,0]
[null,null,null,null,null,null,null,null,null,null,null,null,null,null,null,null,null,null,null,null,null,null,null,null,null,null,null,null,null,null,null,null,null,null,null,null,null,null,0,0,0,0,0]
[2,null,{"$f":"IF(E113>0,\"\",IF(AND(AF113>1,AF115>1,AI113+AI115=0),Fordelt_areal3/2,IF(AF113>1,Fordelt_areal3,\"\")))","v":""},{"$f":"IF(C113<>\"\",\"ha\",\"\")","v":""},null,"ha",{"$f":"IF(I113<>\"\",\"\",IF(VLOOKUP(AF113,_Afg07,Udbyttenr4)=0,\"\",VLOOKUP(AF113,_Afg07,Udbyttenr4)))","v":""},{"$f":"IF(G113=\"\",\"\",IF(AF113>1,IF(VLOOKUP(AF113,_Afg07,3)<>\"\",VLOOKUP(AF113,_Afg07,3),\"\"),\"\"))","v":""},null,"hkg",null,null,null,null,null,null,null,null,null,null,null,null,null,null,null,null,null,null,null,null,{"$f":"A113","v":2},1,{"$f":"IF(AND(AF113>1,AH113=0),1,0)","v":0},{"$f":"IF(AND(E113<>\"\",VLOOKUP(AF113,_Afg07,3)<>\"\"),E113,0)","v":0},{"$f":"IF(AND(AF113>1,VLOOKUP(AF113,_Afg07,3)=\"\"),1,0)","v":0},{"$f":"IF(AND(E113<>\"\",AF113>1,VLOOKUP(AF113,_Afg07,3)=\"\"),E113,0)","v":0},null,null,1,"","",0,0]
[null,null,null,null,null,null,null,null,null,null,null,null,null,null,null,null,null,null,null,null,null,null,null,null,null,null,null,null,null,null,null,null,null,null,null,null,null,null,0,0,0,0,0]
[null,null,{"$f":"IF(E115>0,\"\",IF(E113>0,\"\",IF(AND(AF115>1,AI113+AI115=0),Fordelt_areal3/2,IF(AF115>1,Fordelt_areal3,\"\"))))","v":""},{"$f":"IF(C115<>\"\",\"ha\",\"\")","v":""},null,"ha",{"$f":"IF(I115<>\"\",\"\",IF(VLOOKUP(AF115,_Afg07,Udbyttenr4)=0,\"\",VLOOKUP(AF115,_Afg07,Udbyttenr4)))","v":""},{"$f":"IF(G115=\"\",\"\",IF(AF115>1,IF(VLOOKUP(AF115,_Afg07,3)<>\"\",VLOOKUP(AF115,_Afg07,3),\"\"),\"\"))","v":""},null,"hkg",null,null,null,null,null,null,null,null,null,null,null,null,null,null,null,null,null,null,null,null,null,1,null,{"$f":"IF(AND(E115<>\"\",VLOOKUP(AF115,_Afg07,3)<>\"\"),E115,0)","v":0},{"$f":"IF(AND(AF115>1,VLOOKUP(AF115,_Afg07,3)=\"\"),1,0)","v":0},{"$f":"IF(AND(E115<>\"\",AF115>1,VLOOKUP(AF115,_Afg07,3)=\"\"),E115,0)","v":0},null,null,1,"","",0,0]
[null,null,null,null,null,null,null,null,null,null,null,null,null,null,null,null,null,null,null,null,null,null,null,null,null,null,null,null,null,null,null,null,null,null,null,null,null,null,0,0,0,0,0]
[null,null,null,null,null,null,null,null,null,null,null,null,null,null,null,null,null,null,null,null,null,null,null,null,null,null,null,null,null,null,null,null,null,null,null,null,null,null,0,0,0,0,0]
[3,null,{"$f":"IF(E118>0,\"\",IF(AND(AF118>1,AF120>1,AI118+AI120=0),Fordelt_areal3/2,IF(AF118>1,Fordelt_areal3,\"\")))","v":""},{"$f":"IF(C118<>\"\",\"ha\",\"\")","v":""},null,"ha",{"$f":"IF(I118<>\"\",\"\",IF(VLOOKUP(AF118,_Afg07,Udbyttenr4)=0,\"\",VLOOKUP(AF118,_Afg07,Udbyttenr4)))","v":""},{"$f":"IF(G118=\"\",\"\",IF(AF118>1,IF(VLOOKUP(AF118,_Afg07,3)<>\"\",VLOOKUP(AF118,_Afg07,3),\"\"),\"\"))","v":""},null,"hkg",null,null,null,null,null,null,null,null,null,null,null,null,null,null,null,null,null,null,null,null,{"$f":"A118","v":3},1,{"$f":"IF(AND(AF118>1,AH118=0),1,0)","v":0},{"$f":"IF(AND(E118<>\"\",VLOOKUP(AF118,_Afg07,3)<>\"\"),E118,0)","v":0},{"$f":"IF(AND(AF118>1,VLOOKUP(AF118,_Afg07,3)=\"\"),1,0)","v":0},{"$f":"IF(AND(E118<>\"\",AF118>1,VLOOKUP(AF118,_Afg07,3)=\"\"),E118,0)","v":0},null,null,1,"","",0,0]
[null,null,null,null,null,null,null,null,null,null,null,null,null,null,null,null,null,null,null,null,null,null,null,null,null,null,null,null,null,null,null,null,null,null,null,null,null,null,0,0,0,0,0]
[null,null,{"$f":"IF(E120>0,\"\",IF(E118>0,\"\",IF(AND(AF120>1,AI118+AI120=0),Fordelt_areal3/2,IF(AF120>1,Fordelt_areal3,\"\"))))","v":""},{"$f":"IF(C120<>\"\",\"ha\",\"\")","v":""},null,"ha",{"$f":"IF(I120<>\"\",\"\",IF(VLOOKUP(AF120,_Afg07,Udbyttenr4)=0,\"\",VLOOKUP(AF120,_Afg07,Udbyttenr4)))","v":""},{"$f":"IF(G120=\"\",\"\",IF(AF120>1,IF(VLOOKUP(AF120,_Afg07,3)<>\"\",VLOOKUP(AF120,_Afg07,3),\"\"),\"\"))","v":""},null,"hkg",null,null,null,null,null,null,null,null,null,null,null,null,null,null,null,null,null,null,null,null,null,1,null,{"$f":"IF(AND(E120<>\"\",VLOOKUP(AF120,_Afg07,3)<>\"\"),E120,0)","v":0},{"$f":"IF(AND(AF120>1,VLOOKUP(AF120,_Afg07,3)=\"\"),1,0)","v":0},{"$f":"IF(AND(E120<>\"\",AF120>1,VLOOKUP(AF120,_Afg07,3)=\"\"),E120,0)","v":0},null,null,1,"","",0,0]
[null,null,null,null,null,null,null,null,null,null,null,null,null,null,null,null,null,null,null,null,null,null,null,null,null,null,null,null,null,null,null,null,null,null,null,null,null,null,0,0,0,0,0]
[null,null,null,null,null,null,null,null,null,null,null,null,null,null,null,null,null,null,null,null,null,null,null,null,null,null,null,null,null,null,null,null,null,null,null,null,null,null,0,0,0,0,0]
[4,null,{"$f":"IF(E123>0,\"\",IF(AND(AF123>1,AF125>1,AI123+AI125=0),Fordelt_areal3/2,IF(AF123>1,Fordelt_areal3,\"\")))","v":""},{"$f":"IF(C123<>\"\",\"ha\",\"\")","v":""},null,"ha",{"$f":"IF(I123<>\"\",\"\",IF(VLOOKUP(AF123,_Afg07,Udbyttenr4)=0,\"\",VLOOKUP(AF123,_Afg07,Udbyttenr4)))","v":""},{"$f":"IF(G123=\"\",\"\",IF(AF123>1,IF(VLOOKUP(AF123,_Afg07,3)<>\"\",VLOOKUP(AF123,_Afg07,3),\"\"),\"\"))","v":""},null,"hkg",null,null,null,null,null,null,null,null,null,null,null,null,null,null,null,null,null,null,null,null,{"$f":"A123","v":4},1,{"$f":"IF(AND(AF123>1,AH123=0),1,0)","v":0},{"$f":"IF(AND(E123<>\"\",VLOOKUP(AF123,_Afg07,3)<>\"\"),E123,0)","v":0},{"$f":"IF(AND(AF123>1,VLOOKUP(AF123,_Afg07,3)=\"\"),1,0)","v":0},{"$f":"IF(AND(E123<>\"\",AF123>1,VLOOKUP(AF123,_Afg07,3)=\"\"),E123,0)","v":0},null,null,1,"","",0,0]
[null,null,null,null,null,null,null,null,null,null,null,null,null,null,null,null,null,null,null,null,null,null,null,null,null,null,null,null,null,null,null,null,null,null,null,null,null,null,0,0,0,0,0]
[null,null,{"$f":"IF(E125>0,\"\",IF(E123>0,\"\",IF(AND(AF125>1,AI123+AI125=0),Fordelt_areal3/2,IF(AF125>1,Fordelt_areal3,\"\"))))","v":""},{"$f":"IF(C125<>\"\",\"ha\",\"\")","v":""},null,"ha",{"$f":"IF(I125<>\"\",\"\",IF(VLOOKUP(AF125,_Afg07,Udbyttenr4)=0,\"\",VLOOKUP(AF125,_Afg07,Udbyttenr4)))","v":""},{"$f":"IF(G125=\"\",\"\",IF(AF125>1,IF(VLOOKUP(AF125,_Afg07,3)<>\"\",VLOOKUP(AF125,_Afg07,3),\"\"),\"\"))","v":""},null,"hkg",null,null,null,null,null,null,null,null,null,null,null,null,null,null,null,null,null,null,null,null,null,1,null,{"$f":"IF(AND(E125<>\"\",VLOOKUP(AF125,_Afg07,3)<>\"\"),E125,0)","v":0},{"$f":"IF(AND(AF125>1,VLOOKUP(AF125,_Afg07,3)=\"\"),1,0)","v":0},{"$f":"IF(AND(E125<>\"\",AF125>1,VLOOKUP(AF125,_Afg07,3)=\"\"),E125,0)","v":0},null,null,1,"","",0,0]
[null,null,null,null,null,null,null,null,null,null,null,null,null,null,null,null,null,null,null,null,null,null,null,null,null,null,null,null,null,null,null,null,null,null,null,null,null,null,0,0,0,0,0]
[null,null,null,null,null,null,null,null,null,null,null,null,null,null,null,null,null,null,null,null,null,null,null,null,null,null,null,null,null,null,null,null,null,null,null,null,null,null,0,0,0,0,0]
[5,null,{"$f":"IF(E128>0,\"\",IF(AND(AF128>1,AF130>1,AI128+AI130=0),Fordelt_areal3/2,IF(AF128>1,Fordelt_areal3,\"\")))","v":""},{"$f":"IF(C128<>\"\",\"ha\",\"\")","v":""},null,"ha",{"$f":"IF(I128<>\"\",\"\",IF(VLOOKUP(AF128,_Afg07,Udbyttenr4)=0,\"\",VLOOKUP(AF128,_Afg07,Udbyttenr4)))","v":""},{"$f":"IF(G128=\"\",\"\",IF(AF128>1,IF(VLOOKUP(AF128,_Afg07,3)<>\"\",VLOOKUP(AF128,_Afg07,3),\"\"),\"\"))","v":""},null,"hkg",null,null,null,null,null,null,null,null,null,null,null,null,null,null,null,null,null,null,null,null,{"$f":"A128","v":5},1,{"$f":"IF(AND(AF128>1,AH128=0),1,0)","v":0},{"$f":"IF(AND(E128<>\"\",VLOOKUP(AF128,_Afg07,3)<>\"\"),E128,0)","v":0},{"$f":"IF(AND(AF128>1,VLOOKUP(AF128,_Afg07,3)=\"\"),1,0)","v":0},{"$f":"IF(AND(E128<>\"\",AF128>1,VLOOKUP(AF128,_Afg07,3)=\"\"),E128,0)","v":0},null,null,1,"","",0,0]
[null,null,null,null,null,null,null,null,null,null,null,null,null,null,null,null,null,null,null,null,null,null,null,null,null,null,null,null,null,null,null,null,null,null,null,null,null,null,0,0,0,0,0]
[null,null,{"$f":"IF(E130>0,\"\",IF(E128>0,\"\",IF(AND(AF130>1,AI128+AI130=0),Fordelt_areal3/2,IF(AF130>1,Fordelt_areal3,\"\"))))","v":""},{"$f":"IF(C130<>\"\",\"ha\",\"\")","v":""},null,"ha",{"$f":"IF(I130<>\"\",\"\",IF(VLOOKUP(AF130,_Afg07,Udbyttenr4)=0,\"\",VLOOKUP(AF130,_Afg07,Udbyttenr4)))","v":""},{"$f":"IF(G130=\"\",\"\",IF(AF130>1,IF(VLOOKUP(AF130,_Afg07,3)<>\"\",VLOOKUP(AF130,_Afg07,3),\"\"),\"\"))","v":""},null,"hkg",null,null,null,null,null,null,null,null,null,null,null,null,null,null,null,null,null,null,null,null,null,1,null,{"$f":"IF(AND(E130<>\"\",VLOOKUP(AF130,_Afg07,3)<>\"\"),E130,0)","v":0},{"$f":"IF(AND(AF130>1,VLOOKUP(AF130,_Afg07,3)=\"\"),1,0)","v":0},{"$f":"IF(AND(E130<>\"\",AF130>1,VLOOKUP(AF130,_Afg07,3)=\"\"),E130,0)","v":0},null,null,1,"","",0,0]
[null,null,null,null,null,null,null,null,null,null,null,null,null,null,null,null,null,null,null,null,null,null,null,null,null,null,null,null,null,null,null,null,null,null,null,null,null,null,0,0,0,0,0]
[null,null,null,null,null,null,null,null,null,null,null,null,null,null,null,null,null,null,null,null,null,null,null,null,null,null,null,null,null,null,null,null,null,null,null,null,null,null,0,0,0,0,0]
[6,null,{"$f":"IF(E133>0,\"\",IF(AND(AF133>1,AF135>1,AI133+AI135=0),Fordelt_areal3/2,IF(AF133>1,Fordelt_areal3,\"\")))","v":""},{"$f":"IF(C133<>\"\",\"ha\",\"\")","v":""},null,"ha",{"$f":"IF(I133<>\"\",\"\",IF(VLOOKUP(AF133,_Afg07,Udbyttenr4)=0,\"\",VLOOKUP(AF133,_Afg07,Udbyttenr4)))","v":""},{"$f":"IF(G133=\"\",\"\",IF(AF133>1,IF(VLOOKUP(AF133,_Afg07,3)<>\"\",VLOOKUP(AF133,_Afg07,3),\"\"),\"\"))","v":""},null,"hkg",null,null,null,null,null,null,null,null,null,null,null,null,null,null,null,null,null,null,null,null,{"$f":"A133","v":6},1,{"$f":"IF(AND(AF133>1,AH133=0),1,0)","v":0},{"$f":"IF(AND(E133<>\"\",VLOOKUP(AF133,_Afg07,3)<>\"\"),E133,0)","v":0},{"$f":"IF(AND(AF133>1,VLOOKUP(AF133,_Afg07,3)=\"\"),1,0)","v":0},{"$f":"IF(AND(E133<>\"\",AF133>1,VLOOKUP(AF133,_Afg07,3)=\"\"),E133,0)","v":0},null,null,1,"","",0,0]
[null,null,null,null,null,null,null,null,null,null,null,null,null,null,null,null,null,null,null,null,null,null,null,null,null,null,null,null,null,null,null,null,null,null,null,null,null,null,0,0,0,0,0]
[null,null,{"$f":"IF(E135>0,\"\",IF(E133>0,\"\",IF(AND(AF135>1,AI133+AI135=0),Fordelt_areal3/2,IF(AF135>1,Fordelt_areal3,\"\"))))","v":""},{"$f":"IF(C135<>\"\",\"ha\",\"\")","v":""},null,"ha",{"$f":"IF(I135<>\"\",\"\",IF(VLOOKUP(AF135,_Afg07,Udbyttenr4)=0,\"\",VLOOKUP(AF135,_Afg07,Udbyttenr4)))","v":""},{"$f":"IF(G135=\"\",\"\",IF(AF135>1,IF(VLOOKUP(AF135,_Afg07,3)<>\"\",VLOOKUP(AF135,_Afg07,3),\"\"),\"\"))","v":""},null,"hkg",null,null,null,null,null,null,null,null,null,null,null,null,null,null,null,null,null,null,null,null,null,1,null,{"$f":"IF(AND(E135<>\"\",VLOOKUP(AF135,_Afg07,3)<>\"\"),E135,0)","v":0},{"$f":"IF(AND(AF135>1,VLOOKUP(AF135,_Afg07,3)=\"\"),1,0)","v":0},{"$f":"IF(AND(E135<>\"\",AF135>1,VLOOKUP(AF135,_Afg07,3)=\"\"),E135,0)","v":0},null,null,1,"","",0,0]
[null,null,null,null,null,null,null,null,null,null,null,null,null,null,null,null,null,null,null,null,null,null,null,null,null,null,null,null,null,null,null,null,null,null,null,null,null,null,0,0,0,0,0]
[null,null,null,null,null,null,null,null,null,null,null,null,null,null,null,null,null,null,null,null,null,null,null,null,null,null,null,null,null,null,null,null,null,null,null,null,null,null,0,0,0,0,0]
[7,null,{"$f":"IF(E138>0,\"\",IF(AND(AF138>1,AF140>1,AI138+AI140=0),Fordelt_areal3/2,IF(AF138>1,Fordelt_areal3,\"\")))","v":""},{"$f":"IF(C138<>\"\",\"ha\",\"\")","v":""},null,"ha",{"$f":"IF(I138<>\"\",\"\",IF(VLOOKUP(AF138,_Afg07,Udbyttenr4)=0,\"\",VLOOKUP(AF138,_Afg07,Udbyttenr4)))","v":""},{"$f":"IF(G138=\"\",\"\",IF(AF138>1,IF(VLOOKUP(AF138,_Afg07,3)<>\"\",VLOOKUP(AF138,_Afg07,3),\"\"),\"\"))","v":""},null,"hkg",null,null,null,null,null,null,null,null,null,null,null,null,null,null,null,null,null,null,null,null,{"$f":"A138","v":7},1,{"$f":"IF(AND(AF138>1,AH138=0),1,0)","v":0},{"$f":"IF(AND(E138<>\"\",VLOOKUP(AF138,_Afg07,3)<>\"\"),E138,0)","v":0},{"$f":"IF(AND(AF138>1,VLOOKUP(AF138,_Afg07,3)=\"\"),1,0)","v":0},{"$f":"IF(AND(E138<>\"\",AF138>1,VLOOKUP(AF138,_Afg07,3)=\"\"),E138,0)","v":0},null,null,1,"","",0,0]
[null,null,null,null,null,null,null,null,null,null,null,null,null,null,null,null,null,null,null,null,null,null,null,null,null,null,null,null,null,null,null,null,null,null,null,null,null,null,0,0,0,0,0]
[null,null,{"$f":"IF(E140>0,\"\",IF(E138>0,\"\",IF(AND(AF140>1,AI138+AI140=0),Fordelt_areal3/2,IF(AF140>1,Fordelt_areal3,\"\"))))","v":""},{"$f":"IF(C140<>\"\",\"ha\",\"\")","v":""},null,"ha",{"$f":"IF(I140<>\"\",\"\",IF(VLOOKUP(AF140,_Afg07,Udbyttenr4)=0,\"\",VLOOKUP(AF140,_Afg07,Udbyttenr4)))","v":""},{"$f":"IF(G140=\"\",\"\",IF(AF140>1,IF(VLOOKUP(AF140,_Afg07,3)<>\"\",VLOOKUP(AF140,_Afg07,3),\"\"),\"\"))","v":""},null,"hkg",null,null,null,null,null,null,null,null,null,null,null,null,null,null,null,null,null,null,null,null,null,1,null,{"$f":"IF(AND(E140<>\"\",VLOOKUP(AF140,_Afg07,3)<>\"\"),E140,0)","v":0},{"$f":"IF(AND(AF140>1,VLOOKUP(AF140,_Afg07,3)=\"\"),1,0)","v":0},{"$f":"IF(AND(E140<>\"\",AF140>1,VLOOKUP(AF140,_Afg07,3)=\"\"),E140,0)","v":0},null,null,1,"","",0,0]
[]
[null,null,null,null,null,null,null,null,null,null,null,null,null,null,null,null,null,null,null,null,null,null,null,null,null,null,null,null,null,null,"Sum",null,{"$f":"AG108+AG110+AG113+AG115+AG118+AG120+AG123+AG125+AG128+AG130+AG133+AG135+AG138+AG140","v":0},{"$f":"AH108+AH110+AH113+AH115+AH118+AH120+AH123+AH125+AH128+AH130+AH133+AH135+AH138+AH140","v":0},null,{"$f":"AJ108+AJ110+AJ113+AJ115+AJ118+AJ120+AJ123+AJ125+AJ128+AJ130+AJ133+AJ135+AJ138+AJ140","v":0}]
["Samlet produktion",null,null,null,null,null,null,null,null,null,null,null,null,null,null,null,null,null,null,null,null,null,null,null,null,null,null,null,null,null,null,null,null,null,"Foderproduktion fordelt på korntyper"]
[null,null,null,null,null,null,null,null,null,null,null,null,null,null,null,null,null,null,null,null,null,null,null,null,null,null,null,null,null,null,null,null,null,null,"Hvede",null,"Byg",null,"Havre",null,"Rug",null,"Triticale",null,"Majs",null,null,null,"Areal med efterafgrøder"]
[null,"Afgrøder","Areal",null,"Gns. udbytte",null,null,"Udbytte i alt",null,"Foderudbytte",null,null,null,null,null,null,null,null,null,null,null,null,null,null,null,null,null,null,null,null,null,null,null,null,null,null,null,null,null,null,null,null,null,null,null,null,null,null,null,"Efterafgrøde"]
[null,null,null,null,null,null,null,null,null,null,null,null,null,null,null,null,null,null,null,null,null,null,null,null,null,null,null,null,null,null,null,"Afgnr","Foderudbytte",null,"Hkg","Fesv","Hkg","Fesv","Hkg","Fesv","Hkg","Fesv","Hkg","Fesv","Hkg","Fesv",null,null,null,1]
[null,null,{"$f":"IF(AF147>1,IF(DSUM(Base,2,$AF146:$AF147)=0,\"\",DSUM(Base,2,$AF146:$AF147)))","v":false},{"$f":"IF(C147=\"\",\"\",\"ha\")","v":"ha"},{"$f":"IF(ISERROR(G147/C147),\"\",G147/C147)","v":""},{"$f":"IF(E147=\"\",\"\",\"hkg\")","v":""},{"$f":"IF(DSUM(Base,4,$AF146:$AF147)=0,\"\",DSUM(Base,4,$AF146:$AF147))","v":""},null,{"$f":"IF(G147=\"\",\"\",\"hkg\")","v":""},{"$f":"IF(ISERROR(G147*VLOOKUP(AF147,_Afg07,'Ark1'!$BQ$131)),\"\",G147*VLOOKUP(AF147,_Afg07,'Ark1'!$BQ$131))","v":""},null,{"$f":"IF(J147=\"\",\"\",\"FEsv\")","v":""},null,null,null,null,null,null,null,null,null,null,null,null,null,null,null,null,null,null,null,1,{"$f":"IF(J147<>\"\",J147,0)","v":0},null,{"$f":"IF(VLOOKUP($AF147,_Afg07,'Ark1'!$CH$131)=\"Hvede\",$G147,0)","v":0},{"$f":"IF(VLOOKUP($AF147,_Afg07,'Ark1'!$CH$131)=\"Hvede\",$J147,0)","v":0},{"$f":"IF(VLOOKUP($AF147,_Afg07,'Ark1'!$CH$131)=\"Byg\",$G147,0)","v":0},{"$f":"IF(VLOOKUP($AF147,_Afg07,'Ark1'!$CH$131)=\"Byg\",$J147,0)","v":0},{"$f":"IF(VLOOKUP($AF147,_Afg07,'Ark1'!$CH$131)=\"Havre\",$G147,0)","v":0},{"$f":"IF(VLOOKUP($AF147,_Afg07,'Ark1'!$CH$131)=\"Havre\",$J147,0)","v":0},{"$f":"IF(VLOOKUP($AF147,_Afg07,'Ark1'!$CH$131)=\"Rug\",$G147,0)","v":0},{"$f":"IF(VLOOKUP($AF147,_Afg07,'Ark1'!$CH$131)=\"Rug\",$J147,0)","v":0},{"$f":"IF(VLOOKUP($AF147,_Afg07,'Ark1'!$CH$131)=\"Triticale\",$G147,0)","v":0},{"$f":"IF(VLOOKUP($AF147,_Afg07,'Ark1'!$CH$131)=\"Triticale\",$J147,0)","v":0},{"$f":"IF(VLOOKUP($AF147,_Afg07,'Ark1'!$CH$131)=\"Majs\",$G147,0)","v":0},{"$f":"IF(VLOOKUP($AF147,_Afg07,'Ark1'!$CH$131)=\"Majs\",$J147,0)","v":0},null,null,null,{"$f":"DSUM(Base,2,AX145:AX146)","v":0}]
[null,null,null,null,null,null,null,null,null,null,null,null,null,null,null,null,null,null,null,null,null,null,null,null,null,null,null,null,null,null,null,"Afgnr",null,null,null,null,null,null,null,null,null,null,null,null,null,null,null,null,null,{"$f":"IF(ISERROR(AX147*100/C310),\"\",ROUND(AX147*100/C310,1))","v":""}]
[null,null,{"$f":"IF(AF149>1,IF(DSUM(Base,2,$AF148:$AF149)=0,\"\",DSUM(Base,2,$AF148:$AF149)),\"\")","v":""},{"$f":"IF(C149=\"\",\"\",\"ha\")","v":""},{"$f":"IF(ISERROR(G149/C149),\"\",G149/C149)","v":""},{"$f":"IF(E149=\"\",\"\",\"hkg\")","v":""},{"$f":"IF(DSUM(Base,4,$AF148:$AF149)=0,\"\",DSUM(Base,4,$AF148:$AF149))","v":""},null,{"$f":"IF(G149=\"\",\"\",\"hkg\")","v":""},{"$f":"IF(ISERROR(G149*VLOOKUP(AF149,_Afg07,'Ark1'!$BQ$131)),\"\",G149*VLOOKUP(AF149,_Afg07,'Ark1'!$BQ$131))","v":""},null,{"$f":"IF(J149=\"\",\"\",\"FEsv\")","v":""},null,null,null,null,null,null,null,null,null,null,null,null,null,null,null,null,null,null,null,1,{"$f":"IF(J149<>\"\",J149,0)","v":0},null,{"$f":"IF(VLOOKUP($AF149,_Afg07,'Ark1'!$CH$131)=\"Hvede\",$G149,0)","v":0},{"$f":"IF(VLOOKUP($AF149,_Afg07,'Ark1'!$CH$131)=\"Hvede\",$J149,0)","v":0},{"$f":"IF(VLOOKUP($AF149,_Afg07,'Ark1'!$CH$131)=\"Byg\",$G149,0)","v":0},{"$f":"IF(VLOOKUP($AF149,_Afg07,'Ark1'!$CH$131)=\"Byg\",$J149,0)","v":0},{"$f":"IF(VLOOKUP($AF149,_Afg07,'Ark1'!$CH$131)=\"Havre\",$G149,0)","v":0},{"$f":"IF(VLOOKUP($AF149,_Afg07,'Ark1'!$CH$131)=\"Havre\",$J149,0)","v":0},{"$f":"IF(VLOOKUP($AF149,_Afg07,'Ark1'!$CH$131)=\"Rug\",$G149,0)","v":0},{"$f":"IF(VLOOKUP($AF149,_Afg07,'Ark1'!$CH$131)=\"Rug\",$J149,0)","v":0},{"$f":"IF(VLOOKUP($AF149,_Afg07,'Ark1'!$CH$131)=\"Triticale\",$G149,0)","v":0},{"$f":"IF(VLOOKUP($AF149,_Afg07,'Ark1'!$CH$131)=\"Triticale\",$J149,0)","v":0},{"$f":"IF(VLOOKUP($AF149,_Afg07,'Ark1'!$CH$131)=\"Majs\",$G149,0)","v":0},{"$f":"IF(VLOOKUP($AF149,_Afg07,'Ark1'!$CH$131)=\"Majs\",$J149,0)","v":0}]
[null,null,null,null,null,null,null,null,null,null,null,null,null,null,null,null,null,null,null,null,null,null,null,null,null,null,null,null,null,null,null,"Afgnr"]
[null,null,{"$f":"IF(AF151>1,IF(DSUM(Base,2,$AF150:$AF151)=0,\"\",DSUM(Base,2,$AF150:$AF151)),\"\")","v":""},{"$f":"IF(C151=\"\",\"\",\"ha\")","v":""},{"$f":"IF(ISERROR(G151/C151),\"\",G151/C151)","v":""},{"$f":"IF(E151=\"\",\"\",\"hkg\")","v":""},{"$f":"IF(DSUM(Base,4,$AF150:$AF151)=0,\"\",DSUM(Base,4,$AF150:$AF151))","v":""},null,{"$f":"IF(G151=\"\",\"\",\"hkg\")","v":""},{"$f":"IF(ISERROR(G151*VLOOKUP(AF151,_Afg07,'Ark1'!$BQ$131)),\"\",G151*VLOOKUP(AF151,_Afg07,'Ark1'!$BQ$131))","v":""},null,{"$f":"IF(J151=\"\",\"\",\"FEsv\")","v":""},null,null,null,null,null,null,null,null,null,null,null,null,null,null,null,null,null,null,null,1,{"$f":"IF(J151<>\"\",J151,0)","v":0},null,{"$f":"IF(VLOOKUP($AF151,_Afg07,'Ark1'!$CH$131)=\"Hvede\",$G151,0)","v":0},{"$f":"IF(VLOOKUP($AF151,_Afg07,'Ark1'!$CH$131)=\"Hvede\",$J151,0)","v":0},{"$f":"IF(VLOOKUP($AF151,_Afg07,'Ark1'!$CH$131)=\"Byg\",$G151,0)","v":0},{"$f":"IF(VLOOKUP($AF151,_Afg07,'Ark1'!$CH$131)=\"Byg\",$J151,0)","v":0},{"$f":"IF(VLOOKUP($AF151,_Afg07,'Ark1'!$CH$131)=\"Havre\",$G151,0)","v":0},{"$f":"IF(VLOOKUP($AF151,_Afg07,'Ark1'!$CH$131)=\"Havre\",$J151,0)","v":0},{"$f":"IF(VLOOKUP($AF151,_Afg07,'Ark1'!$CH$131)=\"Rug\",$G151,0)","v":0},{"$f":"IF(VLOOKUP($AF151,_Afg07,'Ark1'!$CH$131)=\"Rug\",$J151,0)","v":0},{"$f":"IF(VLOOKUP($AF151,_Afg07,'Ark1'!$CH$131)=\"Triticale\",$G151,0)","v":0},{"$f":"IF(VLOOKUP($AF151,_Afg07,'Ark1'!$CH$131)=\"Triticale\",$J151,0)","v":0},{"$f":"IF(VLOOKUP($AF151,_Afg07,'Ark1'!$CH$131)=\"Majs\",$G151,0)","v":0},{"$f":"IF(VLOOKUP($AF151,_Afg07,'Ark1'!$CH$131)=\"Majs\",$J151,0)","v":0}]
[null,null,null,null,null,null,null,null,null,null,null,null,null,null,null,null,null,null,null,null,null,null,null,null,null,null,null,null,null,null,null,"Afgnr"]
[null,null,{"$f":"IF(AF153>1,IF(DSUM(Base,2,$AF152:$AF153)=0,\"\",DSUM(Base,2,$AF152:$AF153)),\"\")","v":""},{"$f":"IF(C153=\"\",\"\",\"ha\")","v":""},{"$f":"IF(ISERROR(G153/C153),\"\",G153/C153)","v":""},{"$f":"IF(E153=\"\",\"\",\"hkg\")","v":""},{"$f":"IF(DSUM(Base,4,$AF152:$AF153)=0,\"\",DSUM(Base,4,$AF152:$AF153))","v":""},null,{"$f":"IF(G153=\"\",\"\",\"hkg\")","v":""},{"$f":"IF(ISERROR(G153*VLOOKUP(AF153,_Afg07,'Ark1'!$BQ$131)),\"\",G153*VLOOKUP(AF153,_Afg07,'Ark1'!$BQ$131))","v":""},null,{"$f":"IF(J153=\"\",\"\",\"FEsv\")","v":""},null,null,null,null,null,null,null,null,null,null,null,null,null,null,null,null,null,null,null,1,{"$f":"IF(J153<>\"\",J153,0)","v":0},null,{"$f":"IF(VLOOKUP($AF153,_Afg07,'Ark1'!$CH$131)=\"Hvede\",$G153,0)","v":0},{"$f":"IF(VLOOKUP($AF153,_Afg07,'Ark1'!$CH$131)=\"Hvede\",$J153,0)","v":0},{"$f":"IF(VLOOKUP($AF153,_Afg07,'Ark1'!$CH$131)=\"Byg\",$G153,0)","v":0},{"$f":"IF(VLOOKUP($AF153,_Afg07,'Ark1'!$CH$131)=\"Byg\",$J153,0)","v":0},{"$f":"IF(VLOOKUP($AF153,_Afg07,'Ark1'!$CH$131)=\"Havre\",$G153,0)","v":0},{"$f":"IF(VLOOKUP($AF153,_Afg07,'Ark1'!$CH$131)=\"Havre\",$J153,0)","v":0},{"$f":"IF(VLOOKUP($AF153,_Afg07,'Ark1'!$CH$131)=\"Rug\",$G153,0)","v":0},{"$f":"IF(VLOOKUP($AF153,_Afg07,'Ark1'!$CH$131)=\"Rug\",$J153,0)","v":0},{"$f":"IF(VLOOKUP($AF153,_Afg07,'Ark1'!$CH$131)=\"Triticale\",$G153,0)","v":0},{"$f":"IF(VLOOKUP($AF153,_Afg07,'Ark1'!$CH$131)=\"Triticale\",$J153,0)","v":0},{"$f":"IF(VLOOKUP($AF153,_Afg07,'Ark1'!$CH$131)=\"Majs\",$G153,0)","v":0},{"$f":"IF(VLOOKUP($AF153,_Afg07,'Ark1'!$CH$131)=\"Majs\",$J153,0)","v":0}]
[null,null,null,null,null,null,null,null,null,null,null,null,null,null,null,null,null,null,null,null,null,null,null,null,null,null,null,null,null,null,null,"Afgnr"]
[null,null,{"$f":"IF(AF155>1,IF(DSUM(Base,2,$AF154:$AF155)=0,\"\",DSUM(Base,2,$AF154:$AF155)),\"\")","v":""},{"$f":"IF(C155=\"\",\"\",\"ha\")","v":""},{"$f":"IF(ISERROR(G155/C155),\"\",G155/C155)","v":""},{"$f":"IF(E155=\"\",\"\",\"hkg\")","v":""},{"$f":"IF(DSUM(Base,4,$AF154:$AF155)=0,\"\",DSUM(Base,4,$AF154:$AF155))","v":""},null,{"$f":"IF(G155=\"\",\"\",\"hkg\")","v":""},{"$f":"IF(ISERROR(G155*VLOOKUP(AF155,_Afg07,'Ark1'!$BQ$131)),\"\",G155*VLOOKUP(AF155,_Afg07,'Ark1'!$BQ$131))","v":""},null,{"$f":"IF(J155=\"\",\"\",\"FEsv\")","v":""},null,null,null,null,null,null,null,null,null,null,null,null,null,null,null,null,null,null,null,1,{"$f":"IF(J155<>\"\",J155,0)","v":0},null,{"$f":"IF(VLOOKUP($AF155,_Afg07,'Ark1'!$CH$131)=\"Hvede\",$G155,0)","v":0},{"$f":"IF(VLOOKUP($AF155,_Afg07,'Ark1'!$CH$131)=\"Hvede\",$J155,0)","v":0},{"$f":"IF(VLOOKUP($AF155,_Afg07,'Ark1'!$CH$131)=\"Byg\",$G155,0)","v":0},{"$f":"IF(VLOOKUP($AF155,_Afg07,'Ark1'!$CH$131)=\"Byg\",$J155,0)","v":0},{"$f":"IF(VLOOKUP($AF155,_Afg07,'Ark1'!$CH$131)=\"Havre\",$G155,0)","v":0},{"$f":"IF(VLOOKUP($AF155,_Afg07,'Ark1'!$CH$131)=\"Havre\",$J155,0)","v":0},{"$f":"IF(VLOOKUP($AF155,_Afg07,'Ark1'!$CH$131)=\"Rug\",$G155,0)","v":0},{"$f":"IF(VLOOKUP($AF155,_Afg07,'Ark1'!$CH$131)=\"Rug\",$J155,0)","v":0},{"$f":"IF(VLOOKUP($AF155,_Afg07,'Ark1'!$CH$131)=\"Triticale\",$G155,0)","v":0},{"$f":"IF(VLOOKUP($AF155,_Afg07,'Ark1'!$CH$131)=\"Triticale\",$J155,0)","v":0},{"$f":"IF(VLOOKUP($AF155,_Afg07,'Ark1'!$CH$131)=\"Majs\",$G155,0)","v":0},{"$f":"IF(VLOOKUP($AF155,_Afg07,'Ark1'!$CH$131)=\"Majs\",$J155,0)","v":0}]
[null,null,null,null,null,null,null,null,null,null,null,null,null,null,null,null,null,null,null,null,null,null,null,null,null,null,null,null,null,null,null,"Afgnr"]
[null,null,{"$f":"IF(AF157>1,IF(DSUM(Base,2,$AF156:$AF157)=0,\"\",DSUM(Base,2,$AF156:$AF157)),\"\")","v":""},{"$f":"IF(C157=\"\",\"\",\"ha\")","v":""},{"$f":"IF(ISERROR(G157/C157),\"\",G157/C157)","v":""},{"$f":"IF(E157=\"\",\"\",\"hkg\")","v":""},{"$f":"IF(DSUM(Base,4,$AF156:$AF157)=0,\"\",DSUM(Base,4,$AF156:$AF157))","v":""},null,{"$f":"IF(G157=\"\",\"\",\"hkg\")","v":""},{"$f":"IF(ISERROR(G157*VLOOKUP(AF157,_Afg07,'Ark1'!$BQ$131)),\"\",G157*VLOOKUP(AF157,_Afg07,'Ark1'!$BQ$131))","v":""},null,{"$f":"IF(J157=\"\",\"\",\"FEsv\")","v":""},null,null,null,null,null,null,null,null,null,null,null,null,null,null,null,null,null,null,null,1,{"$f":"IF(J157<>\"\",J157,0)","v":0},null,{"$f":"IF(VLOOKUP($AF157,_Afg07,'Ark1'!$CH$131)=\"Hvede\",$G157,0)","v":0},{"$f":"IF(VLOOKUP($AF157,_Afg07,'Ark1'!$CH$131)=\"Hvede\",$J157,0)","v":0},{"$f":"IF(VLOOKUP($AF157,_Afg07,'Ark1'!$CH$131)=\"Byg\",$G157,0)","v":0},{"$f":"IF(VLOOKUP($AF157,_Afg07,'Ark1'!$CH$131)=\"Byg\",$J157,0)","v":0},{"$f":"IF(VLOOKUP($AF157,_Afg07,'Ark1'!$CH$131)=\"Havre\",$G157,0)","v":0},{"$f":"IF(VLOOKUP($AF157,_Afg07,'Ark1'!$CH$131)=\"Havre\",$J157,0)","v":0},{"$f":"IF(VLOOKUP($AF157,_Afg07,'Ark1'!$CH$131)=\"Rug\",$G157,0)","v":0},{"$f":"IF(VLOOKUP($AF157,_Afg07,'Ark1'!$CH$131)=\"Rug\",$J157,0)","v":0},{"$f":"IF(VLOOKUP($AF157,_Afg07,'Ark1'!$CH$131)=\"Triticale\",$G157,0)","v":0},{"$f":"IF(VLOOKUP($AF157,_Afg07,'Ark1'!$CH$131)=\"Triticale\",$J157,0)","v":0},{"$f":"IF(VLOOKUP($AF157,_Afg07,'Ark1'!$CH$131)=\"Majs\",$G157,0)","v":0},{"$f":"IF(VLOOKUP($AF157,_Afg07,'Ark1'!$CH$131)=\"Majs\",$J157,0)","v":0}]
[null,null,null,null,null,null,null,null,null,null,null,null,null,null,null,null,null,null,null,null,null,null,null,null,null,null,null,null,null,null,null,"Afgnr"]
[null,null,{"$f":"IF(AF159>1,IF(DSUM(Base,2,$AF158:$AF159)=0,\"\",DSUM(Base,2,$AF158:$AF159)),\"\")","v":""},{"$f":"IF(C159=\"\",\"\",\"ha\")","v":""},{"$f":"IF(ISERROR(G159/C159),\"\",G159/C159)","v":""},{"$f":"IF(E159=\"\",\"\",\"hkg\")","v":""},{"$f":"IF(DSUM(Base,4,$AF158:$AF159)=0,\"\",DSUM(Base,4,$AF158:$AF159))","v":""},null,{"$f":"IF(G159=\"\",\"\",\"hkg\")","v":""},{"$f":"IF(ISERROR(G159*VLOOKUP(AF159,_Afg07,'Ark1'!$BQ$131)),\"\",G159*VLOOKUP(AF159,_Afg07,'Ark1'!$BQ$131))","v":""},null,{"$f":"IF(J159=\"\",\"\",\"FEsv\")","v":""},null,null,null,null,null,null,null,null,null,null,null,null,null,null,null,null,null,null,null,1,{"$f":"IF(J159<>\"\",J159,0)","v":0},null,{"$f":"IF(VLOOKUP($AF159,_Afg07,'Ark1'!$CH$131)=\"Hvede\",$G159,0)","v":0},{"$f":"IF(VLOOKUP($AF159,_Afg07,'Ark1'!$CH$131)=\"Hvede\",$J159,0)","v":0},{"$f":"IF(VLOOKUP($AF159,_Afg07,'Ark1'!$CH$131)=\"Byg\",$G159,0)","v":0},{"$f":"IF(VLOOKUP($AF159,_Afg07,'Ark1'!$CH$131)=\"Byg\",$J159,0)","v":0},{"$f":"IF(VLOOKUP($AF159,_Afg07,'Ark1'!$CH$131)=\"Havre\",$G159,0)","v":0},{"$f":"IF(VLOOKUP($AF159,_Afg07,'Ark1'!$CH$131)=\"Havre\",$J159,0)","v":0},{"$f":"IF(VLOOKUP($AF159,_Afg07,'Ark1'!$CH$131)=\"Rug\",$G159,0)","v":0},{"$f":"IF(VLOOKUP($AF159,_Afg07,'Ark1'!$CH$131)=\"Rug\",$J159,0)","v":0},{"$f":"IF(VLOOKUP($AF159,_Afg07,'Ark1'!$CH$131)=\"Triticale\",$G159,0)","v":0},{"$f":"IF(VLOOKUP($AF159,_Afg07,'Ark1'!$CH$131)=\"Triticale\",$J159,0)","v":0},{"$f":"IF(VLOOKUP($AF159,_Afg07,'Ark1'!$CH$131)=\"Majs\",$G159,0)","v":0},{"$f":"IF(VLOOKUP($AF159,_Afg07,'Ark1'!$CH$131)=\"Majs\",$J159,0)","v":0}]
[null,null,null,null,null,null,null,null,null,"",null,null,null,null,null,null,null,null,null,null,null,null,null,null,null,null,null,null,null,null,null,"Afgnr"]
[null,null,{"$f":"IF(AF161>1,IF(DSUM(Base,2,$AF160:$AF161)=0,\"\",DSUM(Base,2,$AF160:$AF161)),\"\")","v":""},{"$f":"IF(C161=\"\",\"\",\"ha\")","v":""},{"$f":"IF(ISERROR(G161/C161),\"\",G161/C161)","v":""},{"$f":"IF(E161=\"\",\"\",\"hkg\")","v":""},{"$f":"IF(DSUM(Base,4,$AF160:$AF161)=0,\"\",DSUM(Base,4,$AF160:$AF161))","v":""},null,{"$f":"IF(G161=\"\",\"\",\"hkg\")","v":""},{"$f":"IF(ISERROR(G161*VLOOKUP(AF161,_Afg07,'Ark1'!$BQ$131)),\"\",G161*VLOOKUP(AF161,_Afg07,'Ark1'!$BQ$131))","v":""},null,{"$f":"IF(J161=\"\",\"\",\"FEsv\")","v":""},null,null,null,null,null,null,null,null,null,null,null,null,null,null,null,null,null,null,null,1,{"$f":"IF(J161<>\"\",J161,0)","v":0},null,{"$f":"IF(VLOOKUP($AF161,_Afg07,'Ark1'!$CH$131)=\"Hvede\",$G161,0)","v":0},{"$f":"IF(VLOOKUP($AF161,_Afg07,'Ark1'!$CH$131)=\"Hvede\",$J161,0)","v":0},{"$f":"IF(VLOOKUP($AF161,_Afg07,'Ark1'!$CH$131)=\"Byg\",$G161,0)","v":0},{"$f":"IF(VLOOKUP($AF161,_Afg07,'Ark1'!$CH$131)=\"Byg\",$J161,0)","v":0},{"$f":"IF(VLOOKUP($AF161,_Afg07,'Ark1'!$CH$131)=\"Havre\",$G161,0)","v":0},{"$f":"IF(VLOOKUP($AF161,_Afg07,'Ark1'!$CH$131)=\"Havre\",$J161,0)","v":0},{"$f":"IF(VLOOKUP($AF161,_Afg07,'Ark1'!$CH$131)=\"Rug\",$G161,0)","v":0},{"$f":"IF(VLOOKUP($AF161,_Afg07,'Ark1'!$CH$131)=\"Rug\",$J161,0)","v":0},{"$f":"IF(VLOOKUP($AF161,_Afg07,'Ark1'!$CH$131)=\"Triticale\",$G161,0)","v":0},{"$f":"IF(VLOOKUP($AF161,_Afg07,'Ark1'!$CH$131)=\"Triticale\",$J161,0)","v":0},{"$f":"IF(VLOOKUP($AF161,_Afg07,'Ark1'!$CH$131)=\"Majs\",$G161,0)","v":0},{"$f":"IF(VLOOKUP($AF161,_Afg07,'Ark1'!$CH$131)=\"Majs\",$J161,0)","v":0}]
[null,null,null,null,null,null,null,null,null,null,null,null,null,null,null,null,null,null,null,null,null,null,null,null,null,null,null,null,null,null,null,"I alt",{"$f":"AG147+AG149+AG151+AG153+AG155+AG157+AG159+AG161","v":0},null,{"$f":"AI147+AI149+AI151+AI153+AI155+AI157+AI159+AI161","v":0},0,0,0,0,0,0,0,0,0,0,0]
[]
["Foderbehov",null,null,null,null,null,null,null,null,null,null,null,null,null,null,null,null,"Andel i kornration (vægtpct.)",null,null,null,null,null,null,null,null,null,null,null,null,null,null,null,null,null,"Hkg af hver kornart"]
[]
[null,"Besætning",null,null,null,null,null,null,null," Foderforbrug",null,null,null,"Kornandel af Fesv",null,null,null,"Byg",null,"Havre",null,"Rug",null,"Triticale",null,"Majs",null,"Hvede",null,null,null,"Foderforbrug_FE","Korn-FE","Gns FE/kg korn","hkg korn","Byg","Havre","Rug","Triticale","Majs","Hvede"]
[]
[null,"Søer m. smågrise",null,"årssøer",null,null,null,null,null,1482,"FE",null,"FE",81,"%",null,"%",50,"%",null,"%",null,"%",null,"%",null,"%",{"$f":"100-R168-T168-V168-X168-Z168","v":50},"%",null,null,{"$f":"C168*IF(L168<>\"\",L168,J168)","v":0},{"$f":"AF168*IF(P168<>\"\",P168,N168)*0.01","v":0},{"$f":"R168*0.01*102+T168*0.01*87+V168*0.01*110+X168*0.01*113+Z168*0.01*122+AB168*0.01*115","v":108.5},{"$f":"AG168/AH168","v":0},{"$f":"$AI168*R168*0.01","v":0},{"$f":"$AI168*T168*0.01","v":0},{"$f":"$AI168*V168*0.01","v":0},{"$f":"$AI168*X168*0.01","v":0},{"$f":"$AI168*Z168*0.01","v":0},{"$f":"$AI168*AB168*0.01","v":0}]
[]
[null,"Smågrise",null,"stk.","Fra ",7,"kg   Til",32,"kg",1.98,"Fesv",null,"Fesv",68,"%",null,"%",22,"%",null,"%",null,"%",null,"%",null,"%",{"$f":"100-R170-T170-V170-X170-Z170","v":78},"%",null,null,{"$f":"C170*(H170-F170)*IF(L170<>\"\",L170,J170)","v":0},{"$f":"AF170*IF(P170<>\"\",P170,N170)*0.01","v":0},{"$f":"R170*0.01*102+T170*0.01*87+V170*0.01*110+X170*0.01*113+Z170*0.01*122+AB170*0.01*115","v":112.14},{"$f":"AG170/AH170","v":0},{"$f":"$AI170*R170*0.01","v":0},{"$f":"$AI170*T170*0.01","v":0},{"$f":"$AI170*V170*0.01","v":0},{"$f":"$AI170*X170*0.01","v":0},{"$f":"$AI170*Z170*0.01","v":0},{"$f":"$AI170*AB170*0.01","v":0}]
[]
[null,"Slagtesvin",null,"stk.","Fra ",32,"kg   Til",107,"kg",2.83,"Fesv",null,"Fesv",78,"%",null,"%",25,"%",null,"%",null,"%",null,"%",null,"%",{"$f":"100-R172-T172-V172-X172-Z172","v":75},"%",null,null,{"$f":"C172*(H172-F172)*IF(L172<>\"\",L172,J172)","v":0},{"$f":"AF172*IF(P172<>\"\",P172,N172)*0.01","v":0},{"$f":"R172*0.01*102+T172*0.01*87+V172*0.01*110+X172*0.01*113+Z172*0.01*122+AB172*0.01*115","v":111.75},{"$f":"AG172/AH172","v":0},{"$f":"$AI172*R172*0.01","v":0},{"$f":"$AI172*T172*0.01","v":0},{"$f":"$AI172*V172*0.01","v":0},{"$f":"$AI172*X172*0.01","v":0},{"$f":"$AI172*Z172*0.01","v":0},{"$f":"$AI172*AB172*0.01","v":0}]
[]
[null,null,null,null,null,null,null,null,null,null,null,null,null,null,null,null,null,null,null,null,null,null,null,null,null,null,null,null,null,null,null,null,null,null,"Sum",{"$f":"AJ168+AJ170+AJ172","v":0},0,0,0,0,0]
[]
["Udskrift"]
[{"$f":"\"Sædskifteplan\"","v":"Sædskifteplan"}]
[]
["Delsædskifte 1"]
[]
["Marker/ejendom:",null,{"$f":"IF(C8<>\"\",C8,\"\")","v":""}]
[]
["Areal sædskifte 1:",null,{"$f":"C12","v":0},{"$f":"IF(C183=\"\",\"\",\"ha\")","v":"ha"},null,{"$f":"VLOOKUP(JBnr2,Jordtyper,2)","v":"JB 5-6"}]
[]
[]
[1,{"$f":"IF(AF16>1,VLOOKUP(AF16,_Afg07,2),\"\")","v":""},{"$f":"IF(AN16>0,AN16,\"\")","v":""},{"$f":"IF(C186=\"\",\"\",\"ha\")","v":""},{"$f":"IF(AO16>0,AO16,\"\")","v":""},{"$f":"IF(E186=\"\",\"\",\"hkg\")","v":""},null,{"$f":"IF(L16=\"\",\"\",L16)","v":""}]
[]
[null,{"$f":"IF(AF18>1,VLOOKUP(AF18,_Afg07,2),\"\")","v":""},{"$f":"IF(AN18>0,AN18,\"\")","v":""},{"$f":"IF(C188=\"\",\"\",\"ha\")","v":""},{"$f":"IF(AO18>0,AO18,\"\")","v":""},{"$f":"IF(E188=\"\",\"\",\"hkg\")","v":""}]
[]
[]
[2,{"$f":"IF(AF21>1,VLOOKUP(AF21,_Afg07,2),\"\")","v":""},{"$f":"IF(AN21>0,AN21,\"\")","v":""},{"$f":"IF(C191=\"\",\"\",\"ha\")","v":""},{"$f":"IF(AO21>0,AO21,\"\")","v":""},{"$f":"IF(E191=\"\",\"\",\"hkg\")","v":""},null,{"$f":"IF(L21=\"\",\"\",L21)","v":""}]
[]
[null,{"$f":"IF(AF23>1,VLOOKUP(AF23,_Afg07,2),\"\")","v":""},{"$f":"IF(AN23>0,AN23,\"\")","v":""},{"$f":"IF(C193=\"\",\"\",\"ha\")","v":""},{"$f":"IF(AO23>0,AO23,\"\")","v":""},{"$f":"IF(E193=\"\",\"\",\"hkg\")","v":""}]
[]
[]
[3,{"$f":"IF(AF26>1,VLOOKUP(AF26,_Afg07,2),\"\")","v":""},{"$f":"IF(AN26>0,AN26,\"\")","v":""},{"$f":"IF(C196=\"\",\"\",\"ha\")","v":""},{"$f":"IF(AO26>0,AO26,\"\")","v":""},{"$f":"IF(E196=\"\",\"\",\"hkg\")","v":""},null,{"$f":"IF(L26=\"\",\"\",L26)","v":""}]
[]
[null,{"$f":"IF(AF28>1,VLOOKUP(AF28,_Afg07,2),\"\")","v":""},{"$f":"IF(AN28>0,AN28,\"\")","v":""},{"$f":"IF(C198=\"\",\"\",\"ha\")","v":""},{"$f":"IF(AO28>0,AO28,\"\")","v":""},{"$f":"IF(E198=\"\",\"\",\"hkg\")","v":""}]
[]
[]
[4,{"$f":"IF(AF31>1,VLOOKUP(AF31,_Afg07,2),\"\")","v":""},{"$f":"IF(AN31>0,AN31,\"\")","v":""},{"$f":"IF(C201=\"\",\"\",\"ha\")","v":""},{"$f":"IF(AO31>0,AO31,\"\")","v":""},{"$f":"IF(E201=\"\",\"\",\"hkg\")","v":""},null,{"$f":"IF(L31=\"\",\"\",L31)","v":""}]
[]
[null,{"$f":"IF(AF33>1,VLOOKUP(AF33,_Afg07,2),\"\")","v":""},{"$f":"IF(AN33>0,AN33,\"\")","v":""},{"$f":"IF(C203=\"\",\"\",\"ha\")","v":""},{"$f":"IF(AO33>0,AO33,\"\")","v":""},{"$f":"IF(E203=\"\",\"\",\"hkg\")","v":""}]
[]
[]
[5,{"$f":"IF(AF36>1,VLOOKUP(AF36,_Afg07,2),\"\")","v":""},{"$f":"IF(AN36>0,AN36,\"\")","v":""},{"$f":"IF(C206=\"\",\"\",\"ha\")","v":""},{"$f":"IF(AO36>0,AO36,\"\")","v":""},{"$f":"IF(E206=\"\",\"\",\"hkg\")","v":""},null,{"$f":"IF(L36=\"\",\"\",L36)","v":""}]
[]
[null,{"$f":"IF(AF38>1,VLOOKUP(AF38,_Afg07,2),\"\")","v":""},{"$f":"IF(AN38>0,AN38,\"\")","v":""},{"$f":"IF(C208=\"\",\"\",\"ha\")","v":""},{"$f":"IF(AO38>0,AO38,\"\")","v":""},{"$f":"IF(E208=\"\",\"\",\"hkg\")","v":""}]
[]
[]
[6,{"$f":"IF(AF41>1,VLOOKUP(AF41,_Afg07,2),\"\")","v":""},{"$f":"IF(AN41>0,AN41,\"\")","v":""},{"$f":"IF(C211=\"\",\"\",\"ha\")","v":""},{"$f":"IF(AO41>0,AO41,\"\")","v":""},{"$f":"IF(E211=\"\",\"\",\"hkg\")","v":""},null,{"$f":"IF(L41=\"\",\"\",L41)","v":""}]
[]
[null,{"$f":"IF(AF43>1,VLOOKUP(AF43,_Afg07,2),\"\")","v":""},{"$f":"IF(AN43>0,AN43,\"\")","v":""},{"$f":"IF(C213=\"\",\"\",\"ha\")","v":""},{"$f":"IF(AO43>0,AO43,\"\")","v":""},{"$f":"IF(E213=\"\",\"\",\"hkg\")","v":""}]
[]
[]
[7,{"$f":"IF(AF46>1,VLOOKUP(AF46,_Afg07,2),\"\")","v":""},{"$f":"IF(AN46>0,AN46,\"\")","v":""},{"$f":"IF(C216=\"\",\"\",\"ha\")","v":""},{"$f":"IF(AO46>0,AO46,\"\")","v":""},{"$f":"IF(E216=\"\",\"\",\"hkg\")","v":""},null,{"$f":"IF(L46=\"\",\"\",L46)","v":""}]
[]
[null,{"$f":"IF(AF48>1,VLOOKUP(AF48,_Afg07,2),\"\")","v":""},{"$f":"IF(AN48>0,AN48,\"\")","v":""},{"$f":"IF(C218=\"\",\"\",\"ha\")","v":""},{"$f":"IF(AO48>0,AO48,\"\")","v":""},{"$f":"IF(E218=\"\",\"\",\"hkg\")","v":""}]
[]
[]
[]
["Delsædskifte 2"]
[]
["Marker/ejendom:",null,{"$f":"IF(C54<>\"\",C54,\"\")","v":""}]
[]
["Areal sædskifte 2:",null,{"$f":"C58","v":0},{"$f":"IF(C226=\"\",\"\",\"ha\")","v":"ha"},null,{"$f":"VLOOKUP(JBnr3,Jordtyper,2)","v":"JB 5-6"}]
[]
[]
[1,{"$f":"IF(AF62>1,VLOOKUP(AF62,_Afg07,2),\"\")","v":""},{"$f":"IF(AN62>0,AN62,\"\")","v":""},{"$f":"IF(C229=\"\",\"\",\"ha\")","v":""},{"$f":"IF(AO62>0,AO62,\"\")","v":""},{"$f":"IF(E229=\"\",\"\",\"hkg\")","v":""},null,{"$f":"IF(L62=\"\",\"\",L62)","v":""}]
[]
[null,{"$f":"IF(AF64>1,VLOOKUP(AF64,_Afg07,2),\"\")","v":""},{"$f":"IF(AN64>0,AN64,\"\")","v":""},{"$f":"IF(C231=\"\",\"\",\"ha\")","v":""},{"$f":"IF(AO64>0,AO64,\"\")","v":""},{"$f":"IF(E231=\"\",\"\",\"hkg\")","v":""}]
[]
[]
[2,{"$f":"IF(AF67>1,VLOOKUP(AF67,_Afg07,2),\"\")","v":""},{"$f":"IF(AN67>0,AN67,\"\")","v":""},{"$f":"IF(C234=\"\",\"\",\"ha\")","v":""},{"$f":"IF(AO67>0,AO67,\"\")","v":""},{"$f":"IF(E234=\"\",\"\",\"hkg\")","v":""},null,{"$f":"IF(L67=\"\",\"\",L67)","v":""}]
[]
[null,{"$f":"IF(AF69>1,VLOOKUP(AF69,_Afg07,2),\"\")","v":""},{"$f":"IF(AN69>0,AN69,\"\")","v":""},{"$f":"IF(C236=\"\",\"\",\"ha\")","v":""},{"$f":"IF(AO69>0,AO69,\"\")","v":""},{"$f":"IF(E236=\"\",\"\",\"hkg\")","v":""}]
[]
[]
[3,{"$f":"IF(AF72>1,VLOOKUP(AF72,_Afg07,2),\"\")","v":""},{"$f":"IF(AN72>0,AN72,\"\")","v":""},{"$f":"IF(C239=\"\",\"\",\"ha\")","v":""},{"$f":"IF(AO72>0,AO72,\"\")","v":""},{"$f":"IF(E239=\"\",\"\",\"hkg\")","v":""},null,{"$f":"IF(L72=\"\",\"\",L72)","v":""}]
[]
[null,{"$f":"IF(AF74>1,VLOOKUP(AF74,_Afg07,2),\"\")","v":""},{"$f":"IF(AN74>0,AN74,\"\")","v":""},{"$f":"IF(C241=\"\",\"\",\"ha\")","v":""},{"$f":"IF(AO74>0,AO74,\"\")","v":""},{"$f":"IF(E241=\"\",\"\",\"hkg\")","v":""}]
[]
[]
[4,{"$f":"IF(AF77>1,VLOOKUP(AF77,_Afg07,2),\"\")","v":""},{"$f":"IF(AN77>0,AN77,\"\")","v":""},{"$f":"IF(C244=\"\",\"\",\"ha\")","v":""},{"$f":"IF(AO77>0,AO77,\"\")","v":""},{"$f":"IF(E244=\"\",\"\",\"hkg\")","v":""},null,{"$f":"IF(L77=\"\",\"\",L77)","v":""}]
[]
[null,{"$f":"IF(AF79>1,VLOOKUP(AF79,_Afg07,2),\"\")","v":""},{"$f":"IF(AN79>0,AN79,\"\")","v":""},{"$f":"IF(C246=\"\",\"\",\"ha\")","v":""},{"$f":"IF(AO79>0,AO79,\"\")","v":""},{"$f":"IF(E246=\"\",\"\",\"hkg\")","v":""}]
[]
[]
[5,{"$f":"IF(AF82>1,VLOOKUP(AF82,_Afg07,2),\"\")","v":""},{"$f":"IF(AN82>0,AN82,\"\")","v":""},{"$f":"IF(C249=\"\",\"\",\"ha\")","v":""},{"$f":"IF(AO82>0,AO82,\"\")","v":""},{"$f":"IF(E249=\"\",\"\",\"hkg\")","v":""},null,{"$f":"IF(L82=\"\",\"\",L82)","v":""}]
[]
[null,{"$f":"IF(AF84>1,VLOOKUP(AF84,_Afg07,2),\"\")","v":""},{"$f":"IF(AN84>0,AN84,\"\")","v":""},{"$f":"IF(C251=\"\",\"\",\"ha\")","v":""},{"$f":"IF(AO84>0,AO84,\"\")","v":""},{"$f":"IF(E251=\"\",\"\",\"hkg\")","v":""}]
[]
[]
[6,{"$f":"IF(AF87>1,VLOOKUP(AF87,_Afg07,2),\"\")","v":""},{"$f":"IF(AN87>0,AN87,\"\")","v":""},{"$f":"IF(C254=\"\",\"\",\"ha\")","v":""},{"$f":"IF(AO87>0,AO87,\"\")","v":""},{"$f":"IF(E254=\"\",\"\",\"hkg\")","v":""},null,{"$f":"IF(L87=\"\",\"\",L87)","v":""}]
[]
[null,{"$f":"IF(AF89>1,VLOOKUP(AF89,_Afg07,2),\"\")","v":""},{"$f":"IF(AN89>0,AN89,\"\")","v":""},{"$f":"IF(C256=\"\",\"\",\"ha\")","v":""},{"$f":"IF(AO89>0,AO89,\"\")","v":""},{"$f":"IF(E256=\"\",\"\",\"hkg\")","v":""}]
[]
[]
[7,{"$f":"IF(AF92>1,VLOOKUP(AF92,_Afg07,2),\"\")","v":""},{"$f":"IF(AN92>0,AN92,\"\")","v":""},{"$f":"IF(C259=\"\",\"\",\"ha\")","v":""},{"$f":"IF(AO92>0,AO92,\"\")","v":""},{"$f":"IF(E259=\"\",\"\",\"hkg\")","v":""},null,{"$f":"IF(L92=\"\",\"\",L92)","v":""}]
[]
[null,{"$f":"IF(AF94>1,VLOOKUP(AF94,_Afg07,2),\"\")","v":""},{"$f":"IF(AN94>0,AN94,\"\")","v":""},{"$f":"IF(C261=\"\",\"\",\"ha\")","v":""},{"$f":"IF(AO94>0,AO94,\"\")","v":""},{"$f":"IF(E261=\"\",\"\",\"hkg\")","v":""}]
[]
[{"$f":"\"Sædskifteplan - fortsat\"","v":"Sædskifteplan - fortsat"}]
[]
["Delsædskifte 3"]
[]
["Marker/ejendom:",null,{"$f":"IF(C100<>\"\",C100,\"\")","v":""}]
[]
["Areal sædskifte 3:",null,{"$f":"C104","v":0},{"$f":"IF(C269=\"\",\"\",\"ha\")","v":"ha"},null,{"$f":"VLOOKUP(JBnr4,Jordtyper,2)","v":"JB 5-6"}]
[]
[]
[1,{"$f":"IF(AF108>1,VLOOKUP(AF108,_Afg07,2),\"\")","v":""},{"$f":"IF(AN108>0,AN108,\"\")","v":""},{"$f":"IF(C272=\"\",\"\",\"ha\")","v":""},{"$f":"IF(AO108>0,AO108,\"\")","v":""},{"$f":"IF(E272=\"\",\"\",\"hkg\")","v":""},null,{"$f":"IF(L108=\"\",\"\",L108)","v":""}]
[]
[null,{"$f":"IF(AF110>1,VLOOKUP(AF110,_Afg07,2),\"\")","v":""},{"$f":"IF(AN110>0,AN110,\"\")","v":""},{"$f":"IF(C274=\"\",\"\",\"ha\")","v":""},{"$f":"IF(AO110>0,AO110,\"\")","v":""},{"$f":"IF(E274=\"\",\"\",\"hkg\")","v":""}]
[]
[]
[2,{"$f":"IF(AF113>1,VLOOKUP(AF113,_Afg07,2),\"\")","v":""},{"$f":"IF(AN113>0,AN113,\"\")","v":""},{"$f":"IF(C277=\"\",\"\",\"ha\")","v":""},{"$f":"IF(AO113>0,AO113,\"\")","v":""},{"$f":"IF(E277=\"\",\"\",\"hkg\")","v":""},null,{"$f":"IF(L113=\"\",\"\",L113)","v":""}]
[]
[null,{"$f":"IF(AF115>1,VLOOKUP(AF115,_Afg07,2),\"\")","v":""},{"$f":"IF(AN115>0,AN115,\"\")","v":""},{"$f":"IF(C279=\"\",\"\",\"ha\")","v":""},{"$f":"IF(AO115>0,AO115,\"\")","v":""},{"$f":"IF(E279=\"\",\"\",\"hkg\")","v":""}]
[]
[]
[3,{"$f":"IF(AF118>1,VLOOKUP(AF118,_Afg07,2),\"\")","v":""},{"$f":"IF(AN118>0,AN118,\"\")","v":""},{"$f":"IF(C282=\"\",\"\",\"ha\")","v":""},{"$f":"IF(AO118>0,AO118,\"\")","v":""},{"$f":"IF(E282=\"\",\"\",\"hkg\")","v":""},null,{"$f":"IF(L118=\"\",\"\",L118)","v":""}]
[]
[null,{"$f":"IF(AF120>1,VLOOKUP(AF120,_Afg07,2),\"\")","v":""},{"$f":"IF(AN120>0,AN120,\"\")","v":""},{"$f":"IF(C284=\"\",\"\",\"ha\")","v":""},{"$f":"IF(AO120>0,AO120,\"\")","v":""},{"$f":"IF(E284=\"\",\"\",\"hkg\")","v":""}]
[]
[]
[4,{"$f":"IF(AF123>1,VLOOKUP(AF123,_Afg07,2),\"\")","v":""},{"$f":"IF(AN123>0,AN123,\"\")","v":""},{"$f":"IF(C287=\"\",\"\",\"ha\")","v":""},{"$f":"IF(AO123>0,AO123,\"\")","v":""},{"$f":"IF(E287=\"\",\"\",\"hkg\")","v":""},null,{"$f":"IF(L123=\"\",\"\",L123)","v":""}]
[]
[null,{"$f":"IF(AF125>1,VLOOKUP(AF125,_Afg07,2),\"\")","v":""},{"$f":"IF(AN125>0,AN125,\"\")","v":""},{"$f":"IF(C289=\"\",\"\",\"ha\")","v":""},{"$f":"IF(AO125>0,AO125,\"\")","v":""},{"$f":"IF(E289=\"\",\"\",\"hkg\")","v":""}]
[]
[]
[5,{"$f":"IF(AF128>1,VLOOKUP(AF128,_Afg07,2),\"\")","v":""},{"$f":"IF(AN128>0,AN128,\"\")","v":""},{"$f":"IF(C292=\"\",\"\",\"ha\")","v":""},{"$f":"IF(AO128>0,AO128,\"\")","v":""},{"$f":"IF(E292=\"\",\"\",\"hkg\")","v":""},null,{"$f":"IF(L128=\"\",\"\",L128)","v":""}]
[]
[null,{"$f":"IF(AF130>1,VLOOKUP(AF130,_Afg07,2),\"\")","v":""},{"$f":"IF(AN130>0,AN130,\"\")","v":""},{"$f":"IF(C294=\"\",\"\",\"ha\")","v":""},{"$f":"IF(AO130>0,AO130,\"\")","v":""},{"$f":"IF(E294=\"\",\"\",\"hkg\")","v":""}]
[]
[]
[6,{"$f":"IF(AF133>1,VLOOKUP(AF133,_Afg07,2),\"\")","v":""},{"$f":"IF(AN133>0,AN133,\"\")","v":""},{"$f":"IF(C297=\"\",\"\",\"ha\")","v":""},{"$f":"IF(AO133>0,AO133,\"\")","v":""},{"$f":"IF(E297=\"\",\"\",\"hkg\")","v":""},null,{"$f":"IF(L133=\"\",\"\",L133)","v":""}]
[]
[null,{"$f":"IF(AF135>1,VLOOKUP(AF135,_Afg07,2),\"\")","v":""},{"$f":"IF(AN135>0,AN135,\"\")","v":""},{"$f":"IF(C299=\"\",\"\",\"ha\")","v":""},{"$f":"IF(AO135>0,AO135,\"\")","v":""},{"$f":"IF(E299=\"\",\"\",\"hkg\")","v":""}]
[]
[]
[7,{"$f":"IF(AF138>1,VLOOKUP(AF138,_Afg07,2),\"\")","v":""},{"$f":"IF(AN138>0,AN138,\"\")","v":""},{"$f":"IF(C302=\"\",\"\",\"ha\")","v":""},{"$f":"IF(AO138>0,AO138,\"\")","v":""},{"$f":"IF(E302=\"\",\"\",\"hkg\")","v":""},null,{"$f":"IF(L138=\"\",\"\",L138)","v":""}]
[]
[null,{"$f":"IF(AF140>1,VLOOKUP(AF140,_Afg07,2),\"\")","v":""},{"$f":"IF(AN140>0,AN140,\"\")","v":""},{"$f":"IF(C304=\"\",\"\",\"ha\")","v":""},{"$f":"IF(AO140>0,AO140,\"\")","v":""},{"$f":"IF(E304=\"\",\"\",\"hkg\")","v":""}]
[]
[]
[]
["Samlet produktion"]
[]
["Samlet areal",null,{"$f":"C183+C226+C269","v":0},{"$f":"IF(C310=\"\",\"\",\"ha\")","v":"ha"}]
[]
[null,null,"Areal",null,"Gns. udbytte",null,null,"Udbytte i alt",null,"Foderproduktion"]
[]
[{"$f":"IF(AF147>1,VLOOKUP(AF147,_Afg07,2),\"\")","v":""},null,{"$f":"C147","v":false},{"$f":"D147","v":"ha"},{"$f":"E147","v":""},{"$f":"F147","v":""},{"$f":"G147","v":""},null,{"$f":"I147","v":""},{"$f":"J147","v":""},null,{"$f":"L147","v":""}]
[]
[{"$f":"IF(AF149>1,VLOOKUP(AF149,_Afg07,2),\"\")","v":""},null,{"$f":"C149","v":""},{"$f":"D149","v":""},{"$f":"E149","v":""},{"$f":"F149","v":""},{"$f":"G149","v":""},null,{"$f":"I149","v":""},{"$f":"J149","v":""},null,{"$f":"L149","v":""}]
[]
[{"$f":"IF(AF151>1,VLOOKUP(AF151,_Afg07,2),\"\")","v":""},null,{"$f":"C151","v":""},{"$f":"D151","v":""},{"$f":"E151","v":""},{"$f":"F151","v":""},{"$f":"G151","v":""},null,{"$f":"I151","v":""},{"$f":"J151","v":""},null,{"$f":"L151","v":""}]
[]
[{"$f":"IF(AF153>1,VLOOKUP(AF153,_Afg07,2),\"\")","v":""},null,{"$f":"C153","v":""},{"$f":"D153","v":""},{"$f":"E153","v":""},{"$f":"F153","v":""},{"$f":"G153","v":""},null,{"$f":"I153","v":""},{"$f":"J153","v":""},null,{"$f":"L153","v":""}]
[]
[{"$f":"IF(AF155>1,VLOOKUP(AF155,_Afg07,2),\"\")","v":""},null,{"$f":"C155","v":""},{"$f":"D155","v":""},{"$f":"E155","v":""},{"$f":"F155","v":""},{"$f":"G155","v":""},null,{"$f":"I155","v":""},{"$f":"J155","v":""},null,{"$f":"L155","v":""}]
[]
[{"$f":"IF(AF157>1,VLOOKUP(AF157,_Afg07,2),\"\")","v":""},null,{"$f":"C157","v":""},{"$f":"D157","v":""},{"$f":"E157","v":""},{"$f":"F157","v":""},{"$f":"G157","v":""},null,{"$f":"I157","v":""},{"$f":"J157","v":""},null,{"$f":"L157","v":""}]
[]
[{"$f":"IF(AF159>1,VLOOKUP(AF159,_Afg07,2),\"\")","v":""},null,{"$f":"C159","v":""},{"$f":"D159","v":""},{"$f":"E159","v":""},{"$f":"F159","v":""},{"$f":"G159","v":""},null,{"$f":"I159","v":""},{"$f":"J159","v":""},null,{"$f":"L159","v":""}]
[]
[{"$f":"IF(AF161>1,VLOOKUP(AF161,_Afg07,2),\"\")","v":""},null,{"$f":"C161","v":""},{"$f":"D161","v":""},{"$f":"E161","v":""},{"$f":"F161","v":""},{"$f":"G161","v":""},null,{"$f":"I161","v":""},{"$f":"J161","v":""},null,{"$f":"L161","v":""}]
[]
[null,null,null,null,null,null,null,null,"I alt",{"$f":"AG162","v":0},null,{"$f":"IF(J330<>\"\",\"FEsv\",\"\")","v":"FEsv"}]
[]
[]
[{"$f":"\"Areal med efterafgrøder udgør \"&AX148&\" % af arealet.\"","v":"Areal med efterafgrøder udgør  % af arealet."}]
[]
[]
[]
["Foderbehov og foderproduktion (korn)"]
[]
["Besætning",null,null,null,null,null,null,null,null,null,null,null,"Foderbehov i korn (FEsv)"]
[]
["Søer m. smågrise",null,{"$f":"IF(C168<>\"\",C168,\"\")","v":""},{"$f":"IF(C341<>\"\",\"årssøer\",\"\")","v":""},null,null,null,null,null,{"$f":"IF(AG168=0,\"\",AG168)","v":""},null,{"$f":"IF(J341<>\"\",\"FE\",\"\")","v":""}]
[]
["Smågrise",null,{"$f":"IF(C170<>\"\",C170,\"\")","v":""},{"$f":"IF(C343<>\"\",\"stk.\",\"\")","v":""},{"$f":"IF(C343<>\"\",\"Fra\",\"\")","v":""},{"$f":"IF(C343<>\"\",F170,\"\")","v":""},{"$f":"IF(C343<>\"\",\"kg   Til\",\"\")","v":""},{"$f":"IF(C343<>\"\",H170,\"\")","v":""},{"$f":"IF(C343<>\"\",\"kg\",\"\")","v":""},{"$f":"IF(AG170=0,\"\",AG170)","v":""},null,{"$f":"IF(J343<>\"\",\"FEsv\",\"\")","v":""}]
[]
["Slagtesvin",null,{"$f":"IF(C172<>\"\",C172,\"\")","v":""},{"$f":"IF(C345<>\"\",\"stk.\",\"\")","v":""},{"$f":"IF(C345<>\"\",\"Fra\",\"\")","v":""},{"$f":"IF(C345<>\"\",F172,\"\")","v":""},{"$f":"IF(C345<>\"\",\"kg   Til\",\"\")","v":""},{"$f":"IF(C345<>\"\",H172,\"\")","v":""},{"$f":"IF(C345<>\"\",\"kg\",\"\")","v":""},{"$f":"IF(AG172=0,\"\",AG172)","v":""},null,{"$f":"IF(J345<>\"\",\"FEsv\",\"\")","v":""}]
[]
[]
["Kornarters andel af kornration (vægtpct.)"]
[]
[null,null,"Hvede",null,"Byg",null,"Havre",null,"Rug/Triticale",null,"Majs"]
[]
["Søer m. smågrise",null,{"$f":"IF(AB168<>\"\",AB168,\"\")","v":50},{"$f":"IF(C352<>\"\",\"%\",\"\")","v":"%"},{"$f":"IF(R168<>\"\",R168,\"\")","v":50},{"$f":"IF(E352<>\"\",\"%\",\"\")","v":"%"},{"$f":"IF(T168<>\"\",T168,\"\")","v":""},{"$f":"IF(G352<>\"\",\"%\",\"\")","v":""},{"$f":"IF(OR(V168<>\"\",X168<>\"\"),V168+X168,\"\")","v":""},{"$f":"IF(I352<>\"\",\"%\",\"\")","v":""},{"$f":"IF(Z168<>\"\",Z168,\"\")","v":""},{"$f":"IF(K352<>\"\",\"%\",\"\")","v":""}]
[]
["Smågrise",null,{"$f":"IF(AB170<>\"\",AB170,\"\")","v":78},{"$f":"IF(C354<>\"\",\"%\",\"\")","v":"%"},{"$f":"IF(R170<>\"\",R170,\"\")","v":22},{"$f":"IF(E354<>\"\",\"%\",\"\")","v":"%"},{"$f":"IF(T170<>\"\",T170,\"\")","v":""},{"$f":"IF(G354<>\"\",\"%\",\"\")","v":""},{"$f":"IF(OR(V170<>\"\",X170<>\"\"),V170+X170,\"\")","v":""},{"$f":"IF(I354<>\"\",\"%\",\"\")","v":""},{"$f":"IF(Z170<>\"\",Z170,\"\")","v":""},{"$f":"IF(K354<>\"\",\"%\",\"\")","v":""}]
[]
["Slagtesvin",null,{"$f":"IF(AB172<>\"\",AB172,\"\")","v":75},{"$f":"IF(C356<>\"\",\"%\",\"\")","v":"%"},{"$f":"IF(R172<>\"\",R172,\"\")","v":25},{"$f":"IF(E356<>\"\",\"%\",\"\")","v":"%"},{"$f":"IF(T172<>\"\",T172,\"\")","v":""},{"$f":"IF(G356<>\"\",\"%\",\"\")","v":""},{"$f":"IF(OR(V172<>\"\",X172<>\"\"),V172+X172,\"\")","v":""},{"$f":"IF(I356<>\"\",\"%\",\"\")","v":""},{"$f":"IF(Z172<>\"\",Z172,\"\")","v":""},{"$f":"IF(K356<>\"\",\"%\",\"\")","v":""}]
[]
[]
["Foderbehov og -produktion (korn)"]
[]
[null,null,null,"Foderbehov ",null,"Foderproduktion",null,null,null,"Skal købes ",null,null,"Kan sælges "]
[]
["Hvede",null,{"$f":"IF(AO174>0,AO174,\"\")","v":""},{"$f":"IF(C363<>\"\",\"Hkg\",\"\")","v":""},{"$f":"IF(ISERROR(AI162),\"\",IF(AI162>0,AI162,\"\"))","v":""},null,{"$f":"IF(E363<>\"\",\"Hkg\",\"\")","v":""},{"$f":"IF(ISERROR($AO$174-$AI$162),\"\",IF($AO$174-$AI$162>0,$AO$174-$AI$162,\"\"))","v":""},null,{"$f":"IF(H363<>\"\",\"Hkg\",\"\")","v":""},{"$f":"IF(ISERROR($AO$174-$AI$162),\"\",IF($AO$174-$AI$162<0,-($AO$174-$AI$162),\"\"))","v":""},null,{"$f":"IF(K363<>\"\",\"Hkg\",\"\")","v":""}]
[]
["Byg",null,{"$f":"IF(AJ174>0,AJ174,\"\")","v":""},{"$f":"IF(C365<>\"\",\"Hkg\",\"\")","v":""},{"$f":"IF(ISERROR(AK162),\"\",IF(AK162>0,AK162,\"\"))","v":""},null,{"$f":"IF(E365<>\"\",\"Hkg\",\"\")","v":""},{"$f":"IF(ISERROR($AJ$174-$AK$162),\"\",IF($AJ$174-$AK$162>0,$AJ$174-$AK$162,\"\"))","v":""},null,{"$f":"IF(H365<>\"\",\"Hkg\",\"\")","v":""},{"$f":"IF(ISERROR($AJ$174-$AK$162),\"\",IF($AJ$174-$AK$162<0,-($AJ$174-$AK$162),\"\"))","v":""},null,{"$f":"IF(K365<>\"\",\"Hkg\",\"\")","v":""}]
[]
["Havre",null,{"$f":"IF(AK174>0,AK174,\"\")","v":""},{"$f":"IF(C367<>\"\",\"Hkg\",\"\")","v":""},{"$f":"IF(ISERROR(AM162),\"\",IF(AM162>0,AM162,\"\"))","v":""},null,{"$f":"IF(E367<>\"\",\"Hkg\",\"\")","v":""},{"$f":"IF(ISERROR($AK$174-$AM$162),\"\",IF($AK$174-$AM$162>0,$AK$174-$AM$162,\"\"))","v":""},null,{"$f":"IF(H367<>\"\",\"Hkg\",\"\")","v":""},{"$f":"IF(ISERROR($AK$174-$AM$162),\"\",IF($AK$174-$AM$162<0,-($AK$174-$AM$162),\"\"))","v":""},null,{"$f":"IF(K367<>\"\",\"Hkg\",\"\")","v":""}]
[]
["Rug",null,{"$f":"IF(AL174>0,AL174,\"\")","v":""},{"$f":"IF(C369<>\"\",\"Hkg\",\"\")","v":""},{"$f":"IF(AO162>0,AO162,\"\")","v":""},null,{"$f":"IF(E369<>\"\",\"Hkg\",\"\")","v":""},{"$f":"IF($AL$174-$AO$162>0,$AL$174-$AO$162,\"\")","v":""},null,{"$f":"IF(H369<>\"\",\"Hkg\",\"\")","v":""},{"$f":"IF($AL$174-$AO$162<0,-($AL$174-$AO$162),\"\")","v":""},null,{"$f":"IF(K369<>\"\",\"Hkg\",\"\")","v":""}]
[]
["Triticale",null,{"$f":"IF(AM174>0,AM174,\"\")","v":""},{"$f":"IF(C371<>\"\",\"Hkg\",\"\")","v":""},{"$f":"IF(AQ162>0,AQ162,\"\")","v":""},null,{"$f":"IF(E371<>\"\",\"Hkg\",\"\")","v":""},{"$f":"IF($AM$174-$AQ$162>0,$AM$174-$AQ$162,\"\")","v":""},null,{"$f":"IF(H371<>\"\",\"Hkg\",\"\")","v":""},{"$f":"IF($AM$174-$AQ$162<0,-($AM$174-$AQ$162),\"\")","v":""},null,{"$f":"IF(K371<>\"\",\"Hkg\",\"\")","v":""}]
[]
["Majs",null,{"$f":"IF(AN174>0,AN174,\"\")","v":""},{"$f":"IF(C373<>\"\",\"Hkg\",\"\")","v":""},{"$f":"IF(AS162>0,AS162,\"\")","v":""},null,{"$f":"IF(E373<>\"\",\"Hkg\",\"\")","v":""},{"$f":"IF($AN$174-$AS$162>0,$AN$174-$AS$162,\"\")","v":""},null,{"$f":"IF(H373<>\"\",\"Hkg\",\"\")","v":""},{"$f":"IF($AN$174-$AS$162<0,-($AN$174-$AS$162),\"\")","v":""},null,{"$f":"IF(K373<>\"\",\"Hkg\",\"\")","v":""}]

{"sheet":"Ark3","index":2,"n_rows":17,"n_cols":11,"rows_kept":17,"cut":false,"hidden":false,"merged":[[5,1,10,6],[16,1,22,6]]}
[]
[]
[null,null,null,null,null,null,null,null,null,"Udgiver:","SEGES"]
[null,null,null,null,null,null,null,null,null,null,"Planter & Miljø"]
[null,null,null,null,null,null,null,null,null,"Udgivelsesdato:","2018-12-12"]
[null,"Med dette regneark kan man sammenligne økonomien i forskellige afgrøder og sædskifter. Forfrugtsværdi, husdyrgødning, om man er kornkøber eller -sælger, halmnedmuldning, tørring og lagring kan indregnes i de økonomiske konkurrenceforhold. \nDet er også muligt at beregne netto tidsforbrug i marken. ",null,null,null,null,null,null,null,"Forfatter:","Ove Lund / Søren Kolind Hvid / Marianne Haugaard-Christensen"]
[null,null,null,null,null,null,null,null,null,"Version:","1.30"]
[null,null,null,null,null,null,null,null,null,"Datagrundlag:","Budgetkalkuler 2018"]
[null,null,null,null,null,null,null,null,null,"Dokument:","Se artikel"]
[null,null,null,null,null,null,null,null,null,"Ansvar:","Se vilkår"]
[]
[]
[]
[]
[]
[]
[null,"Dette regneark kan anvendes til at opstille en sædskifteplan med op til 3 delsædskifter på en bedrift. Placering af efterafgrøder i sædskiftet kan angives. Endvidere beregnes produktionen af korn til svinefoder. Svinebesætningens foderbehov (korn) kan beregnes. \nBemærk at dette regneark ikke på nogen måde er sammenkædet med ovenstående regneark."]