{"text_format":"1","workbook":"xlsx","n_sheets":4,"sheets":["Vejledning","Indtastninger","Simulering","Udskrift"],"not_rendered":{"charts":2,"images":9,"macros":1,"external_links":0,"defined_names":3,"comments":0,"pivot_tables":0},"unopened":[],"bounds":{"document_bytes":16777216,"sheet_cells":100000,"rows_first":2000,"rows_last":500,"rows_between":2000,"halvings":0,"cell_chars":16384,"cell_head_chars":4096},"cells_cut":0,"cells_raw":0,"read":"whole","date_system":"1900"}

{"sheet":"Vejledning","index":0,"n_rows":136,"n_cols":2,"rows_kept":136,"cut":false,"hidden":false,"merged":[]}
[]
[]
[]
[]
[]
[]
[]
[]
[null,"Vejledning til brug af dette likviditetsstyringsværktøj"]
[]
[null,"Formål:"]
[null,"Værktøjet har til formål at skabe et overblik over den kommende periodes ind- og udbetalinger - altså likviditetsflowet."]
[null,"Med dette overblik kan du få indblik i, om likviditeten udvikler sig som forventet (jf. budget)."]
[null,"Såfremt likviditetsudviklingen afviger fra forventningen, har du mulighed for at iværksætte nogle handlinger,"]
[null,"så du kan være på forkant og bede om enten udsættelse af nogle betalinger og/eller midlertidig udvidelse af kreditrammen"]
[null," hos dit pengeinstitut."]
[]
[null,"Fane-beskrivelser:"]
[null,"\"Indtastning\": Denne fane anvendes til manuel indtastning af kommende ind- og udbetalinger, herunder betalings- og forfaldsdato."]
[null,"\"Simulering\": I denne fane har du mulighed for at simulere likviditetsflowet i en given periode."]
[null,"\"Udskrift\": Her vises likviditetsflowet, både med og uden forskydning i planlagt betalingsdato."]
[]
[null,"Sådan bruger du værktøjet:"]
[null,"Steps i fanen \"Indtastning\":"]
[1,"Indtast kommende ind- og udbetalinger i kolonne B, D & E."]
[]
[]
[]
[]
[]
[]
[null,"Har du f.eks. en faktura fra smeden med forfaldsdato den 1. november 2016, skal du indtaste følgende:"]
[null,"I kolonne B: Indtast forfaldsdato = 01-11-2016"]
[null,"I kolonne D: Indtast passende tekst  - det kan f.eks. være kreditornavn + hvad der er indkøbt, eller debitornavn + hvad der er solgt."]
[null,"I kolonne E: Indtast beløb - husk køb angives med et minus fortegn, f.eks. -1.000, mens salg angives uden fortegn, f.eks. 1.000"]
[null,"Kolonne C vil automatisk blive fyldt med samme dato som forfaldsdatoen, når processen sættes i gang."]
[]
[null,"Eksempel på udfyldt række:"]
[]
[]
[]
[]
[]
[]
[2,"derefter indtastes trækningsretten for de relevante måneder i kolonne I"]
[]
[3,"I kolonne I 3 og 4 taster du det tidsinterval du ønsker at få vist og arbejde videre med "]
[]
[4,"Når alle kommende ind- og udbetalinger er indtastet, trykker du på den grønne knap \"Opdater og sorter posteringer\""]
[]
[]
[]
[]
[]
[]
[]
[]
[]
[5,"Når processen bagved er færdig med at køre, så står man i \"Udskrift\" - fanen."]
[null,"Du bør vente til beregningsprocessen er gennemført før du går videre i arket, ellers risikerer du at det ikke virker efter hensigten"]
{"$rows_left_out":77}
{"sheet":"Indtastninger","index":1,"n_rows":25,"n_cols":14,"rows_kept":25,"cut":false,"hidden":false,"merged":[[1,7,1,8],[0,13,0,16],[3,1,3,4],[1,1,1,3]]}
[null,null,null,null,null,null,null,null,null,null,null,null,null,"Styringspanel"]
[null,{"$f":"\"Primo Saldo Kassekredit pr. \" & TEXT(I3,\"dd-mm-åååå\")","v":"Primo Saldo Kassekredit pr. 21-06-2017"},null,null,-1500000,null,null,"Tidsperiode"]
[null,null,null,null,null,null,null,"Start","2017-06-21",{"$f":"TODAY()","v":42907}]
[null,"Indsæt Dato m.m. herunder",null,null,null,null,null,"Slut","2017-07-21"]
[null,"Forfaldsdato","Betalingsdato","Tekst","Beløb",null,null,"Dato","Trækningsret"]
[null,"2017-06-22","2017-06-22","Maskiner",-27500,null,null,{"$f":"L6","v":"2017-06-01"},-1200000,{"$f":"TEXT(I3,\"dd-mm-åååå\")","v":"21-06-2017"},{"$f":"\"01-\"& RIGHT(J6,7)","v":"01-06-2017"},{"$f":"DATEVALUE(K6)","v":42887}]
[null,"2017-06-23","2017-06-23","moms",-40000,null,null,{"$f":"L7","v":"2017-07-01"},-1300000,null,{"$f":"LEFT(K6,3) & (IF(MONTH(L6)=12,1,MONTH(L6)+1)) &\"-\"& IF(MONTH(L6)=12,YEAR(L6)+1,YEAR(L6))","v":"01-7-2017"},{"$f":"DATEVALUE(K7)","v":42917}]
[null,"2017-06-23","2017-06-23","a-skat",-165000,null,"Løn","2017-08-01",-1450000,null,{"$f":"LEFT(K7,3) & (IF(MONTH(L7)=12,1,MONTH(L7)+1)) &\"-\"& IF(MONTH(L7)=12,YEAR(L7)+1,YEAR(L7))","v":"01-8-2017"},{"$f":"DATEVALUE(K8)","v":42948}]
[null,"2017-06-26","2017-06-26","løn",-90000,null,"A-skat","2017-09-01",-1000000,null,{"$f":"LEFT(K8,3) & (IF(MONTH(L8)=12,1,MONTH(L8)+1)) &\"-\"& IF(MONTH(L8)=12,YEAR(L8)+1,YEAR(L8))","v":"01-9-2017"},42979]
[null,"2017-06-28","2017-06-28","Smed",-10000,null,"Moms","2017-10-01",-1100000,null,"01-10-2017",43009]
[null,"2017-06-30","2017-06-30","Maskinstation",-70000,null,"DLG","2017-11-01",-1200000,null,"01-11-2017",43040]
[null,"2017-07-06","2017-07-06","DC - Smågrise",300000,null,"DC - Smågrise","2017-12-01",-600000,null,"01-12-2017",43070]
[null,"2017-07-06","2017-07-06","DC - Smågrise",250000,null,"Dyrlæge","2018-01-01",-750000,null,"01-1-2018",43101]
[null,"2017-07-06","2017-07-06","Brændstof",-60000,null,"Maskinstation","2018-02-01",-850000,null,"01-2-2018",43132]
[null,"2017-07-09","2017-07-09","DC - Smågrise",2000,null,"Smed","2018-03-01",-1000000,null,"01-3-2018",43160]
[null,"2017-07-09","2017-07-09","Foderstof",-25000,null,null,"2018-04-01",-1050000,null,"01-4-2018",43191]
[null,"2017-07-09","2017-07-09","Foderstof",-250000,null,null,{"$f":"L17","v":"2018-05-01"},-1100000,null,"01-5-2018",43221]
[null,"2017-07-09","2017-07-09","Foderstof",-250000]
[null,"2017-07-10","2017-07-10","Dyrlæge",-20000]
[null,"2017-07-10","2017-07-10","Maskinstation",-25000]
[null,"2017-07-10","2017-07-10","Moms",-75000]
[null,"2017-07-11","2017-07-11","DC - Smågrise",15250]
[null,"2017-07-12","2017-07-12","Maskinstation",-70000]
[null,"2017-07-13","2017-07-13","EU-støtte",596000]
[null,"2017-07-15","2017-07-15","Salg af korn",450000]

{"sheet":"Simulering","index":2,"n_rows":40,"n_cols":29,"rows_kept":40,"cut":false,"hidden":false,"merged":[[4,0,4,2],[5,0,5,2]]}
[null,null,null,null,null,null,null,null,null,null,null,null,null,null,null,null,null,null,null,null,null,null,null,null,"Dato","Trækningsret"]
["Start",{"$f":"Indtastninger!I3","v":"2017-06-21"},{"$f":"TODAY()","v":42907},null,null,null,null,null,null,null,null,null,null,null,null,null,null,null,null,null,null,null,null,null,"2017-06-01",-1200000,"21-06-2017","01-06-2017",42887]
["Slut",{"$f":"Indtastninger!I4","v":"2017-07-21"},null,null,null,null,null,null,null,null,null,null,null,null,null,null,null,null,null,null,null,null,null,null,"2017-07-01",-1300000,null,"01-7-2017",42917]
[null,null,null,null,null,null,null,null,null,null,null,null,null,null,null,null,null,null,null,null,null,null,null,null,"2017-08-01",-1450000,null,"01-8-2017",42948]
["Trækningsret start periode",null,null,{"$f":"IFERROR(VLOOKUP(B2,Indtastninger!$H$6:$I$1048576,2,TRUE),\"\")","v":-1200000},null,null,null,null,null,null,null,null,null,null,null,null,null,null,null,null,null,null,null,null,"2017-09-01",-1000000,null,"01-9-2017",42979]
["Primo saldo kassekredit",null,null,{"$f":"Indtastninger!E2","v":-1500000},null,null,null,null,null,null,null,null,null,null,null,null,null,null,null,null,null,null,null,null,"2017-10-01",-1100000,null,"01-10-2017",43009]
[null,null,null,null,null,null,null,null,null,null,null,null,null,null,null,null,null,null,null,null,null,null,null,null,"2017-11-01",-1200000,null,"01-11-2017",43040]
[null,"Start","Start",null,null,null,null,null,"Start","Start","Start","Start",null,null,null,null,null,null,null,null,null,null,null,null,"2017-12-01",-600000,null,"01-12-2017",43070]
[null,"Forfaldsdato","Betalingsdato","Tekst","Beløb","Saldo Kassekredit","Disponibelt beløb","Fravælg","her","her","her","her",null,null,null,null,null,null,null,null,null,null,null,null,"2018-01-01",-750000,null,"01-1-2018",43101]
[null,"2017-06-21","2017-06-21","Primo periode",null,-1500000,-300000,null,"2017-06-21",-1500000,null,-1200000,null,null,null,null,null,null,null,null,null,null,null,null,"2018-02-01",-850000,null,"01-2-2018",43132]
[null,"2017-06-22","2017-06-22","Maskiner",-27500,-1527500,null,null,"2017-06-22",-1527500,null,-1200000,null,null,null,null,null,null,null,null,null,null,null,null,"2018-03-01",-1000000,null,"01-3-2018",43160]
[null,"2017-06-23","2017-06-23","moms",-40000,-1567500,null,null,"2017-06-23",-1732500,null,-1200000,null,null,null,null,null,null,null,null,null,null,null,null,"2018-04-01",-1050000,null,"01-4-2018",43191]
[null,"2017-06-23","2017-06-23","a-skat",-165000,-1732500,null,null,"2017-06-24",-1732500,null,-1200000,null,null,null,null,null,null,null,null,null,null,null,null,"2018-05-01",-1100000,null,"01-5-2018",43221]
[null,"2017-06-26","2017-06-26","løn",-90000,-1822500,null,null,"2017-06-25",-1732500,null,-1200000]
[null,"2017-06-28","2017-06-28","Smed",-10000,-1832500,null,null,"2017-06-26",-1822500,null,-1200000]
[null,"2017-06-30","2017-06-30","Maskinstation",-70000,-1902500,null,null,"2017-06-27",-1822500,null,-1200000]
[null,"2017-07-06","2017-07-06","DC - Smågrise",300000,-1602500,null,null,"2017-06-28",-1832500,null,-1200000]
[null,"2017-07-06","2017-07-06","DC - Smågrise",250000,-1352500,null,null,"2017-06-29",-1832500,null,-1200000]
[null,"2017-07-06","2017-07-06","Brændstof",-60000,-1412500,null,null,"2017-06-30",-1902500,null,-1200000]
[null,"2017-07-09","2017-07-09","DC - Smågrise",2000,-1410500,null,null,"2017-07-01",-1902500,null,-1300000]
[null,"2017-07-09","2017-07-09","Foderstof",-25000,-1435500,null,null,"2017-07-02",-1902500,null,-1300000]
[null,"2017-07-09","2017-07-09","Foderstof",-250000,-1685500,null,null,"2017-07-03",-1902500,null,-1300000]
[null,"2017-07-09","2017-07-09","Foderstof",-250000,-1935500,null,null,"2017-07-04",-1902500,null,-1300000]
[null,"2017-07-10","2017-07-10","Dyrlæge",-20000,-1955500,null,null,"2017-07-05",-1902500,null,-1300000]
[null,"2017-07-10","2017-07-10","Maskinstation",-25000,-1980500,null,null,"2017-07-06",-1412500,null,-1300000]
[null,"2017-07-10","2017-07-10","Moms",-75000,-2055500,null,null,"2017-07-07",-1412500,null,-1300000]
[null,"2017-07-11","2017-07-11","DC - Smågrise",15250,-2040250,null,null,"2017-07-08",-1412500,null,-1300000]
[null,"2017-07-12","2017-07-12","Maskinstation",-70000,-2110250,null,null,"2017-07-09",-1935500,null,-1300000]
[null,"2017-07-13","2017-07-13","EU-støtte",596000,-1514250,null,null,"2017-07-10",-2055500,null,-1300000]
[null,"2017-07-15","2017-07-15","Salg af korn",450000,-1064250,null,null,"2017-07-11",-2040250,null,-1300000]
[null,null,null,null,null,null,null,null,"2017-07-12",-2110250,null,-1300000]
[null,null,null,null,null,null,null,null,"2017-07-13",-1514250,null,-1300000]
[null,null,null,null,null,null,null,null,"2017-07-14",-1514250,null,-1300000]
[null,null,null,null,null,null,null,null,"2017-07-15",-1064250,null,-1300000]
[null,null,null,null,null,null,null,null,"2017-07-16",-1064250,null,-1300000]
[null,null,null,null,null,null,null,null,"2017-07-17",-1064250,null,-1300000]
[null,null,null,null,null,null,null,null,"2017-07-18",-1064250,null,-1300000]
[null,null,null,null,null,null,null,null,"2017-07-19",-1064250,null,-1300000]
[null,null,null,null,null,null,null,null,"2017-07-20",-1064250,null,-1300000]
[null,null,null,null,null,null,null,null,"2017-07-21",-1064250,null,-1300000]

{"sheet":"Udskrift","index":3,"n_rows":91,"n_cols":12,"rows_kept":91,"cut":false,"hidden":false,"merged":[[75,8,75,9],[76,8,76,9],[77,8,77,9],[78,8,78,9],[71,8,71,9],[72,8,72,9],[88,8,88,9],[73,8,73,9],[67,8,67,9],[68,8,68,9],[69,8,69,9],[70,8,70,9],[74,8,74,9],[90,8,90,9],[79,8,79,9],[80,8,80,9],[81,8,81,9],[82,8,82,9],[83,8,83,9],[84,8,84,9],[85,8,85,9],[86,8,86,9],[87,8,87,9],[89,8,89,9],[60,8,60,9],[61,8,61,9],[62,8,62,9],[63,8,63,9],[64,8,64,9],[65,8,65,9],[66,8,66,9],[49,4,49,6],[55,8,55,9],[56,8,56,9],[57,8,57,9],[58,8,58,9],[49,8,49,9],[50,8,50,9],[51,8,51,9],[52,8,52,9],[42,8,42,9],[43,8,43,9],[56,4,56,6],[57,4,57,6],[44,8,44,9],[89,4,89,6],[71,4,71,6],[72,4,72,6],[73,4,73,6],[74,4,74,6],[67,4,67,6],[68,4,68,6],[69,4,69,6],[70,4,70,6],[87,4,87,6],[88,4,88,6],[61,4,61,6],[62,4,62,6],[63,4,63,6],[64,4,64,6],[65,4,65,6],[66,4,66,6],[55,4,55,6],[59,8,59,9],[90,4,90,6],[37,8,37,9],[38,8,38,9],[39,8,39,9],[40,8,40,9],[81,4,81,6],[82,4,82,6],[83,4,83,6],[84,4,84,6],[85,4,85,6],[86,4,86,6],[75,4,75,6],[76,4,76,6],[77,4,77,6],[78,4,78,6],[79,4,79,6],[80,4,80,6],[54,8,54,9],[53,8,53,9],[46,8,46,9],[45,8,45,9],[58,4,58,6],[59,4,59,6],[60,4,60,6],[36,8,36,9],[1,1,3,13],[50,4,50,6],[51,4,51,6],[52,4,52,6],[53,4,53,6],[54,4,54,6],[34,5,34,8],[36,4,36,6],[43,4,43,6],[44,4,44,6],[45,4,45,6],[46,4,46,6],[47,4,47,6],[48,4,48,6],[37,4,37,6],[38,4,38,6],[39,4,39,6],[40,4,40,6],[41,4,41,6],[42,4,42,6],[47,8,47,9],[48,8,48,9],[41,8,41,9]]}
[]
[null,"Udskrift af periodens likviditet"]
[]
[]
[]
[]
[]
[]
[]
[]
[]
[]
[]
[]
[]
[]
[]
[]
[]
[]
[]
[]
[]
[]
[]
[]
[]
[]
[]
[]
[]
[]
[]
[null,null,{"$f":"Simulering!$A$2","v":"Start"},{"$f":"Indtastninger!I3","v":"2017-06-21"},{"$f":"TODAY()","v":"2017-06-21"}]
[null,null,{"$f":"Simulering!$A$3","v":"Slut"},{"$f":"Simulering!$B$3","v":"2017-07-21"},null,{"$f":"Simulering!A6","v":"Primo saldo kassekredit"},null,null,null,{"$f":"Simulering!D6","v":-1500000}]
[]
[null,null,{"$f":"IF(Simulering!B9=0,\"\",Simulering!B9)","v":"Forfaldsdato"},{"$f":"IF(Simulering!C9=0,\"\",Simulering!C9)","v":"Betalingsdato"},{"$f":"IF(Simulering!D9=0,\"\",Simulering!D9)","v":"Tekst"},null,null,{"$f":"IF(Simulering!E9=0,\"\",Simulering!E9)","v":"Beløb"},{"$f":"IF(Simulering!F9=0,\"\",Simulering!F9)","v":"Saldo Kassekredit"},null,"Trækningsret"]
[null,null,{"$f":"IF(Simulering!B10=0,\"\",Simulering!B10)","v":"2017-06-21"},{"$f":"IF(Simulering!C10=0,\"\",Simulering!C10)","v":"2017-06-21"},{"$f":"IF(Simulering!D10=0,\"\",Simulering!D10)","v":"Primo periode"},null,null,{"$f":"IF(Simulering!E10=0,\"\",Simulering!E10)","v":""},{"$f":"IF(Simulering!F10=0,\"\",Simulering!F10)","v":-1500000},null,{"$f":"IFERROR(VLOOKUP(D38,Indtastninger!$H$6:$I$1048576,2,TRUE),\"\")","v":-1200000},{"$f":"IF(Simulering!H10=0,\"\",Simulering!H10)","v":""}]
[null,null,{"$f":"IF(Simulering!B11=0,\"\",Simulering!B11)","v":"2017-06-22"},{"$f":"IF(Simulering!C11=0,\"\",Simulering!C11)","v":"2017-06-22"},{"$f":"IF(Simulering!D11=0,\"\",Simulering!D11)","v":"Maskiner"},null,null,{"$f":"IF(Simulering!E11=0,\"\",Simulering!E11)","v":-27500},{"$f":"IF(Simulering!F11=0,\"\",Simulering!F11)","v":-1527500},null,{"$f":"IFERROR(VLOOKUP(D39,Indtastninger!$H$6:$I$1048576,2,TRUE),\"\")","v":-1200000},{"$f":"IF(Simulering!H11=0,\"\",Simulering!H11)","v":""}]
[null,null,{"$f":"IF(Simulering!B12=0,\"\",Simulering!B12)","v":"2017-06-23"},{"$f":"IF(Simulering!C12=0,\"\",Simulering!C12)","v":"2017-06-23"},{"$f":"IF(Simulering!D12=0,\"\",Simulering!D12)","v":"moms"},null,null,{"$f":"IF(Simulering!E12=0,\"\",Simulering!E12)","v":-40000},{"$f":"IF(Simulering!F12=0,\"\",Simulering!F12)","v":-1567500},null,{"$f":"IFERROR(VLOOKUP(D40,Indtastninger!$H$6:$I$1048576,2,TRUE),\"\")","v":-1200000},{"$f":"IF(Simulering!H12=0,\"\",Simulering!H12)","v":""}]
[null,null,{"$f":"IF(Simulering!B13=0,\"\",Simulering!B13)","v":"2017-06-23"},{"$f":"IF(Simulering!C13=0,\"\",Simulering!C13)","v":"2017-06-23"},{"$f":"IF(Simulering!D13=0,\"\",Simulering!D13)","v":"a-skat"},null,null,{"$f":"IF(Simulering!E13=0,\"\",Simulering!E13)","v":-165000},{"$f":"IF(Simulering!F13=0,\"\",Simulering!F13)","v":-1732500},null,{"$f":"IFERROR(VLOOKUP(D41,Indtastninger!$H$6:$I$1048576,2,TRUE),\"\")","v":-1200000},{"$f":"IF(Simulering!H13=0,\"\",Simulering!H13)","v":""}]
[null,null,{"$f":"IF(Simulering!B14=0,\"\",Simulering!B14)","v":"2017-06-26"},{"$f":"IF(Simulering!C14=0,\"\",Simulering!C14)","v":"2017-06-26"},{"$f":"IF(Simulering!D14=0,\"\",Simulering!D14)","v":"løn"},null,null,{"$f":"IF(Simulering!E14=0,\"\",Simulering!E14)","v":-90000},{"$f":"IF(Simulering!F14=0,\"\",Simulering!F14)","v":-1822500},null,{"$f":"IFERROR(VLOOKUP(D42,Indtastninger!$H$6:$I$1048576,2,TRUE),\"\")","v":-1200000},{"$f":"IF(Simulering!H14=0,\"\",Simulering!H14)","v":""}]
[null,null,{"$f":"IF(Simulering!B15=0,\"\",Simulering!B15)","v":"2017-06-28"},{"$f":"IF(Simulering!C15=0,\"\",Simulering!C15)","v":"2017-06-28"},{"$f":"IF(Simulering!D15=0,\"\",Simulering!D15)","v":"Smed"},null,null,{"$f":"IF(Simulering!E15=0,\"\",Simulering!E15)","v":-10000},{"$f":"IF(Simulering!F15=0,\"\",Simulering!F15)","v":-1832500},null,{"$f":"IFERROR(VLOOKUP(D43,Indtastninger!$H$6:$I$1048576,2,TRUE),\"\")","v":-1200000},{"$f":"IF(Simulering!H15=0,\"\",Simulering!H15)","v":""}]
[null,null,{"$f":"IF(Simulering!B16=0,\"\",Simulering!B16)","v":"2017-06-30"},{"$f":"IF(Simulering!C16=0,\"\",Simulering!C16)","v":"2017-06-30"},{"$f":"IF(Simulering!D16=0,\"\",Simulering!D16)","v":"Maskinstation"},null,null,{"$f":"IF(Simulering!E16=0,\"\",Simulering!E16)","v":-70000},{"$f":"IF(Simulering!F16=0,\"\",Simulering!F16)","v":-1902500},null,{"$f":"IFERROR(VLOOKUP(D44,Indtastninger!$H$6:$I$1048576,2,TRUE),\"\")","v":-1200000},{"$f":"IF(Simulering!H16=0,\"\",Simulering!H16)","v":""}]
[null,null,{"$f":"IF(Simulering!B17=0,\"\",Simulering!B17)","v":"2017-07-06"},{"$f":"IF(Simulering!C17=0,\"\",Simulering!C17)","v":"2017-07-06"},{"$f":"IF(Simulering!D17=0,\"\",Simulering!D17)","v":"DC - Smågrise"},null,null,{"$f":"IF(Simulering!E17=0,\"\",Simulering!E17)","v":300000},{"$f":"IF(Simulering!F17=0,\"\",Simulering!F17)","v":-1602500},null,{"$f":"IFERROR(VLOOKUP(D45,Indtastninger!$H$6:$I$1048576,2,TRUE),\"\")","v":-1300000},{"$f":"IF(Simulering!H17=0,\"\",Simulering!H17)","v":""}]
[null,null,{"$f":"IF(Simulering!B18=0,\"\",Simulering!B18)","v":"2017-07-06"},{"$f":"IF(Simulering!C18=0,\"\",Simulering!C18)","v":"2017-07-06"},{"$f":"IF(Simulering!D18=0,\"\",Simulering!D18)","v":"DC - Smågrise"},null,null,{"$f":"IF(Simulering!E18=0,\"\",Simulering!E18)","v":250000},{"$f":"IF(Simulering!F18=0,\"\",Simulering!F18)","v":-1352500},null,{"$f":"IFERROR(VLOOKUP(D46,Indtastninger!$H$6:$I$1048576,2,TRUE),\"\")","v":-1300000},{"$f":"IF(Simulering!H18=0,\"\",Simulering!H18)","v":""}]
[null,null,{"$f":"IF(Simulering!B19=0,\"\",Simulering!B19)","v":"2017-07-06"},{"$f":"IF(Simulering!C19=0,\"\",Simulering!C19)","v":"2017-07-06"},{"$f":"IF(Simulering!D19=0,\"\",Simulering!D19)","v":"Brændstof"},null,null,{"$f":"IF(Simulering!E19=0,\"\",Simulering!E19)","v":-60000},{"$f":"IF(Simulering!F19=0,\"\",Simulering!F19)","v":-1412500},null,{"$f":"IFERROR(VLOOKUP(D47,Indtastninger!$H$6:$I$1048576,2,TRUE),\"\")","v":-1300000},{"$f":"IF(Simulering!H19=0,\"\",Simulering!H19)","v":""}]
[null,null,{"$f":"IF(Simulering!B20=0,\"\",Simulering!B20)","v":"2017-07-09"},{"$f":"IF(Simulering!C20=0,\"\",Simulering!C20)","v":"2017-07-09"},{"$f":"IF(Simulering!D20=0,\"\",Simulering!D20)","v":"DC - Smågrise"},null,null,{"$f":"IF(Simulering!E20=0,\"\",Simulering!E20)","v":2000},{"$f":"IF(Simulering!F20=0,\"\",Simulering!F20)","v":-1410500},null,{"$f":"IFERROR(VLOOKUP(D48,Indtastninger!$H$6:$I$1048576,2,TRUE),\"\")","v":-1300000},{"$f":"IF(Simulering!H20=0,\"\",Simulering!H20)","v":""}]
[null,null,{"$f":"IF(Simulering!B21=0,\"\",Simulering!B21)","v":"2017-07-09"},{"$f":"IF(Simulering!C21=0,\"\",Simulering!C21)","v":"2017-07-09"},{"$f":"IF(Simulering!D21=0,\"\",Simulering!D21)","v":"Foderstof"},null,null,{"$f":"IF(Simulering!E21=0,\"\",Simulering!E21)","v":-25000},{"$f":"IF(Simulering!F21=0,\"\",Simulering!F21)","v":-1435500},null,{"$f":"IFERROR(VLOOKUP(D49,Indtastninger!$H$6:$I$1048576,2,TRUE),\"\")","v":-1300000},{"$f":"IF(Simulering!H21=0,\"\",Simulering!H21)","v":""}]
[null,null,{"$f":"IF(Simulering!B22=0,\"\",Simulering!B22)","v":"2017-07-09"},{"$f":"IF(Simulering!C22=0,\"\",Simulering!C22)","v":"2017-07-09"},{"$f":"IF(Simulering!D22=0,\"\",Simulering!D22)","v":"Foderstof"},null,null,{"$f":"IF(Simulering!E22=0,\"\",Simulering!E22)","v":-250000},{"$f":"IF(Simulering!F22=0,\"\",Simulering!F22)","v":-1685500},null,{"$f":"IFERROR(VLOOKUP(D50,Indtastninger!$H$6:$I$1048576,2,TRUE),\"\")","v":-1300000},{"$f":"IF(Simulering!H22=0,\"\",Simulering!H22)","v":""}]
[null,null,{"$f":"IF(Simulering!B23=0,\"\",Simulering!B23)","v":"2017-07-09"},{"$f":"IF(Simulering!C23=0,\"\",Simulering!C23)","v":"2017-07-09"},{"$f":"IF(Simulering!D23=0,\"\",Simulering!D23)","v":"Foderstof"},null,null,{"$f":"IF(Simulering!E23=0,\"\",Simulering!E23)","v":-250000},{"$f":"IF(Simulering!F23=0,\"\",Simulering!F23)","v":-1935500},null,{"$f":"IFERROR(VLOOKUP(D51,Indtastninger!$H$6:$I$1048576,2,TRUE),\"\")","v":-1300000},{"$f":"IF(Simulering!H23=0,\"\",Simulering!H23)","v":""}]
[null,null,{"$f":"IF(Simulering!B24=0,\"\",Simulering!B24)","v":"2017-07-10"},{"$f":"IF(Simulering!C24=0,\"\",Simulering!C24)","v":"2017-07-10"},{"$f":"IF(Simulering!D24=0,\"\",Simulering!D24)","v":"Dyrlæge"},null,null,{"$f":"IF(Simulering!E24=0,\"\",Simulering!E24)","v":-20000},{"$f":"IF(Simulering!F24=0,\"\",Simulering!F24)","v":-1955500},null,{"$f":"IFERROR(VLOOKUP(D52,Indtastninger!$H$6:$I$1048576,2,TRUE),\"\")","v":-1300000},{"$f":"IF(Simulering!H24=0,\"\",Simulering!H24)","v":""}]
[null,null,{"$f":"IF(Simulering!B25=0,\"\",Simulering!B25)","v":"2017-07-10"},{"$f":"IF(Simulering!C25=0,\"\",Simulering!C25)","v":"2017-07-10"},{"$f":"IF(Simulering!D25=0,\"\",Simulering!D25)","v":"Maskinstation"},null,null,{"$f":"IF(Simulering!E25=0,\"\",Simulering!E25)","v":-25000},{"$f":"IF(Simulering!F25=0,\"\",Simulering!F25)","v":-1980500},null,{"$f":"IFERROR(VLOOKUP(D53,Indtastninger!$H$6:$I$1048576,2,TRUE),\"\")","v":-1300000},{"$f":"IF(Simulering!H25=0,\"\",Simulering!H25)","v":""}]
[null,null,{"$f":"IF(Simulering!B26=0,\"\",Simulering!B26)","v":"2017-07-10"},{"$f":"IF(Simulering!C26=0,\"\",Simulering!C26)","v":"2017-07-10"},{"$f":"IF(Simulering!D26=0,\"\",Simulering!D26)","v":"Moms"},null,null,{"$f":"IF(Simulering!E26=0,\"\",Simulering!E26)","v":-75000},{"$f":"IF(Simulering!F26=0,\"\",Simulering!F26)","v":-2055500},null,{"$f":"IFERROR(VLOOKUP(D54,Indtastninger!$H$6:$I$1048576,2,TRUE),\"\")","v":-1300000},{"$f":"IF(Simulering!H26=0,\"\",Simulering!H26)","v":""}]
[null,null,{"$f":"IF(Simulering!B27=0,\"\",Simulering!B27)","v":"2017-07-11"},{"$f":"IF(Simulering!C27=0,\"\",Simulering!C27)","v":"2017-07-11"},{"$f":"IF(Simulering!D27=0,\"\",Simulering!D27)","v":"DC - Smågrise"},null,null,{"$f":"IF(Simulering!E27=0,\"\",Simulering!E27)","v":15250},{"$f":"IF(Simulering!F27=0,\"\",Simulering!F27)","v":-2040250},null,{"$f":"IFERROR(VLOOKUP(D55,Indtastninger!$H$6:$I$1048576,2,TRUE),\"\")","v":-1300000},{"$f":"IF(Simulering!H27=0,\"\",Simulering!H27)","v":""}]
[null,null,{"$f":"IF(Simulering!B28=0,\"\",Simulering!B28)","v":"2017-07-12"},{"$f":"IF(Simulering!C28=0,\"\",Simulering!C28)","v":"2017-07-12"},{"$f":"IF(Simulering!D28=0,\"\",Simulering!D28)","v":"Maskinstation"},null,null,{"$f":"IF(Simulering!E28=0,\"\",Simulering!E28)","v":-70000},{"$f":"IF(Simulering!F28=0,\"\",Simulering!F28)","v":-2110250},null,{"$f":"IFERROR(VLOOKUP(D56,Indtastninger!$H$6:$I$1048576,2,TRUE),\"\")","v":-1300000},{"$f":"IF(Simulering!H28=0,\"\",Simulering!H28)","v":""}]
[null,null,{"$f":"IF(Simulering!B29=0,\"\",Simulering!B29)","v":"2017-07-13"},{"$f":"IF(Simulering!C29=0,\"\",Simulering!C29)","v":"2017-07-13"},{"$f":"IF(Simulering!D29=0,\"\",Simulering!D29)","v":"EU-støtte"},null,null,{"$f":"IF(Simulering!E29=0,\"\",Simulering!E29)","v":596000},{"$f":"IF(Simulering!F29=0,\"\",Simulering!F29)","v":-1514250},null,{"$f":"IFERROR(VLOOKUP(D57,Indtastninger!$H$6:$I$1048576,2,TRUE),\"\")","v":-1300000},{"$f":"IF(Simulering!H29=0,\"\",Simulering!H29)","v":""}]
[null,null,{"$f":"IF(Simulering!B30=0,\"\",Simulering!B30)","v":"2017-07-15"},{"$f":"IF(Simulering!C30=0,\"\",Simulering!C30)","v":"2017-07-15"},{"$f":"IF(Simulering!D30=0,\"\",Simulering!D30)","v":"Salg af korn"},null,null,{"$f":"IF(Simulering!E30=0,\"\",Simulering!E30)","v":450000},{"$f":"IF(Simulering!F30=0,\"\",Simulering!F30)","v":-1064250},null,{"$f":"IFERROR(VLOOKUP(D58,Indtastninger!$H$6:$I$1048576,2,TRUE),\"\")","v":-1300000},{"$f":"IF(Simulering!H30=0,\"\",Simulering!H30)","v":""}]
[null,null,{"$f":"IF(Simulering!B31=0,\"\",Simulering!B31)","v":""},{"$f":"IF(Simulering!C31=0,\"\",Simulering!C31)","v":""},{"$f":"IF(Simulering!D31=0,\"\",Simulering!D31)","v":""},null,null,{"$f":"IF(Simulering!E31=0,\"\",Simulering!E31)","v":""},{"$f":"IF(Simulering!F31=0,\"\",Simulering!F31)","v":""},null,{"$f":"IFERROR(VLOOKUP(D59,Indtastninger!$H$6:$I$1048576,2,TRUE),\"\")","v":""},{"$f":"IF(Simulering!H31=0,\"\",Simulering!H31)","v":""}]
[null,null,{"$f":"IF(Simulering!B32=0,\"\",Simulering!B32)","v":""},{"$f":"IF(Simulering!C32=0,\"\",Simulering!C32)","v":""},{"$f":"IF(Simulering!D32=0,\"\",Simulering!D32)","v":""},null,null,{"$f":"IF(Simulering!E32=0,\"\",Simulering!E32)","v":""},{"$f":"IF(Simulering!F32=0,\"\",Simulering!F32)","v":""},null,{"$f":"IFERROR(VLOOKUP(D60,Indtastninger!$H$6:$I$1048576,2,TRUE),\"\")","v":""},{"$f":"IF(Simulering!H32=0,\"\",Simulering!H32)","v":""}]
{"$rows_left_out":31}