{"text_format":"1","workbook":"xlsx","n_sheets":16,"sheets":["Forside","Efterafgrøde beslutningsstøtte","Navne på afgrøder","Beslutningstræ","Karaktermatrice","Grundkarakterer","1. Anders","99. Andre efterafgrøder","Lister","Hjælpe beregning","Norm","Basis_norm","Norm lig basisnorm","Version","Afgrøder i regnearket","Anvendte kriterier"],"not_rendered":{"charts":0,"images":5,"macros":1,"external_links":0,"defined_names":18,"comments":2,"pivot_tables":0},"unopened":[],"bounds":{"document_bytes":16777216,"sheet_cells":100000,"rows_first":2000,"rows_last":500,"rows_between":2000,"halvings":0,"cell_chars":16384,"cell_head_chars":4096},"cells_cut":0,"cells_raw":0,"read":"whole","date_system":"1900"}

{"sheet":"Forside","index":0,"n_rows":26,"n_cols":1,"rows_kept":26,"cut":false,"hidden":false,"merged":[]}
[]
[]
["Beslutningsstøtteværktøj til valg af efter- og mellemafgrøder i økologisk jordbrug"]
[]
[]
["Beslutningsstøtteværktøjet kan for nuværende ikke håndtere de frivlillige efterafgrøder med støtte som bliver en del af landbrugspakkens implementering fra 2017, idet det endelige regelsæt ikke kendes ved værktøjets færdiggørelse."]
[]
["Gå til arket \"Efterafgrøde beslutningsstøtte\" for at starte beregneren"]
[]
[]
[]
[]
[]
[]
["Udviklingen af dette værktøj er støttet af: "]
[]
[]
[]
[]
[]
[]
[]
[]
[]
[]
["Værktøjet er i 2015 udviklet i regi af GUDP projektet OPTIplant, og er i  2017 omarbejdet til brug i økologisk landbrug med støtte fra den Europæiske Landbrugsfond for Udvikling af Landdistrikterne.  "]

{"sheet":"Efterafgrøde beslutningsstøtte","index":1,"n_rows":62,"n_cols":17,"rows_kept":62,"cut":false,"hidden":false,"merged":[[2,5,21,5],[10,2,15,3],[2,17,21,17],[2,18,21,18],[2,11,21,11],[2,12,21,12],[2,16,21,16],[2,4,21,4],[2,13,21,13],[2,14,21,14],[2,15,21,15],[2,6,21,6],[2,7,21,7],[2,8,21,8],[2,9,21,9],[2,10,21,10]]}
[{"$f":"Version!A1","v":"Version 1.12, 21. november 2021"}]
["Beslutningsstøtteværktøj til valg af efter- og mellemafgrøder i korn"]
[null,null,null,null,{"$f":"Beslutningstræ!HA40","v":"Seneste lovlige såtidspunkt"},{"$f":"Beslutningstræ!HB40","v":"Egnet til udsåning efter tidlig høst (10. august)"},{"$f":"Beslutningstræ!HC40","v":"Kvælstoffikserende"},{"$f":"Beslutningstræ!HD40","v":"Stor kvælstof-eftervirkning"},{"$f":"Beslutningstræ!HE40","v":"Bruttoomkostninger"},{"$f":"Beslutningstræ!HF40","v":"Nettoomkostninger"},{"$f":"Beslutningstræ!HG40","v":"Er afgrøden robust mod ukrudtsmidler?"},{"$f":"Beslutningstræ!HH40","v":"Afgrøden opformere kålbrok"},{"$f":"Beslutningstræ!HI40","v":"Der findes sorter, der er sanerende for roecystenematoder"},{"$f":"Beslutningstræ!HJ40","v":"Vinterfast"},{"$f":"Beslutningstræ!HK40","v":"Egen udsæd kan anvendes"},{"$f":"Beslutningstræ!HL40","v":"Hurtig og dyb rodvækst på lerjord"},{"$f":"Beslutningstræ!IH40","v":"Vejledning"}]
[]
["Obligatoriske spørgsmål"]
["Skal afgrøden kunne fungere som:"]
["Pligtig efterafgrøde"]
[]
["Hvilken afgrøde skal efterafgrøden sås i?"]
["Vårsæd"]
[]
["Hvornår skal afgrøden etableres?"]
["Efter høst af primærafgrøde"]
[]
["Jordtype på arealet"]
["Ler"]
[null,null,{"$f":"IF('Norm lig basisnorm'!D57=FALSE,\"Bemærk at der anvendes egne priser og/eller merudbytter i beregningerne\",IF('Norm lig basisnorm'!D57,\"\",\"FEJL\"))","v":"Bemærk at der anvendes egne priser og/eller merudbytter i beregningerne"}]
["N.B. Der sås altid vårsæd efter efterafgrøden - dvs. værktøjet kan ikke håndtere mellemafgrøder"]
["Vårsæd"]
[{"$f":"IF(OR(A7=\"Vælg funktion\",A7=\"Frivillig efterafgrøde\"),\"\",\"Vær opmærksom på, at gældende love og regler angående pligtige efter- og mellemafgrøder og MFO afgrøder er komplicerede og ændres jævnligt. Du skal selv kontrollere, at de efterafgrøder, du sår, overholder gældende regler.\")","v":"Vær opmærksom på, at gældende love og regler angående pligtige efter- og mellemafgrøder og MFO afgrøder er komplicerede og ændres jævnligt. Du skal selv kontrollere, at de efterafgrøder, du sår, overholder gældende regler."},null,null,{"$f":"IF(OR(A7=\"Kun MFO afgrøde\",A7=\"Pligtig efterafgrøde og MFO afgrøde\"),\"Husk at MFO afgrøder altid skal sås i blanding med mindst en anden art, med udtagelse af græsser der kan sås som udlæg i renbestand inden 31. maj\",\"\")","v":""}]
[]
["Udvælgelseskriterier.",null,null,{"$f":"Beslutningstræ!GZ80","v":"Efterafgrøde"}]
["Økonomi",null,null,{"$f":"(Beslutningstræ!GZ81)","v":"Vintervikke/vinterrug"},{"$f":"(Beslutningstræ!HA81)","v":"20. august"},{"$f":"(Beslutningstræ!HB81)","v":"Meget god"},{"$f":"(Beslutningstræ!HC81)","v":"Ja"},{"$f":"(Beslutningstræ!HD81)","v":"Stor"},{"$f":"(Beslutningstræ!HE81)","v":-969},{"$f":"(Beslutningstræ!HF81)","v":-529},{"$f":"(Beslutningstræ!HG81)","v":"Mod de fleste"},{"$f":"(Beslutningstræ!HH81)","v":"Aldrig"},{"$f":"(Beslutningstræ!HI81)","v":"Nej"},{"$f":"(Beslutningstræ!HJ81)","v":"Meget god"},{"$f":"(Beslutningstræ!HK81)","v":"Nej"},{"$f":"(Beslutningstræ!HK81)","v":"Nej"},{"$f":"IF(F23=\"\",\"\",IF(A$7<>\"Pligtig mellemafgrøde\",HYPERLINK(\"https://dyrk-plant.dlbr.dk/Web/(S(ikevr3oqnx5oe2t5cyfyknyq))/forms/Main.aspx?page=Vejledning&cropID=226\",\"Efterafgrøder\"),HYPERLINK(\"https://dyrk-plant.dlbr.dk/Web/(S(0x3ftyiaahcpttq0ljebuany))/forms/Main.aspx?page=Vejledning&cropID=238\",\"Mellemafgrøder\")))","v":"Efterafgrøder"}]
["Etableringsomkostninger (lav pris)","Ikke vigtigt",null,{"$f":"(Beslutningstræ!GZ82)","v":"Olieræddike og vintervikke"},{"$f":"(Beslutningstræ!HA82)","v":"20. august"},{"$f":"(Beslutningstræ!HB82)","v":"Meget god"},{"$f":"(Beslutningstræ!HC82)","v":"Ja"},{"$f":"(Beslutningstræ!HD82)","v":"Stor"},{"$f":"(Beslutningstræ!HE82)","v":-828},{"$f":"(Beslutningstræ!HF82)","v":52},{"$f":"(Beslutningstræ!HG82)","v":"Mod de fleste"},{"$f":"(Beslutningstræ!HH82)","v":"I mindre grad"},{"$f":"(Beslutningstræ!HI82)","v":"Nej"},{"$f":"(Beslutningstræ!HJ82)","v":"Udvintrer"},{"$f":"(Beslutningstræ!HK82)","v":"Nej"},{"$f":"(Beslutningstræ!HK82)","v":"Nej"},{"$f":"IF(F24=\"\",\"\",IF(A$7<>\"Pligtig mellemafgrøde\",HYPERLINK(\"https://dyrk-plant.dlbr.dk/Web/(S(ikevr3oqnx5oe2t5cyfyknyq))/forms/Main.aspx?page=Vejledning&cropID=226\",\"Efterafgrøder\"),HYPERLINK(\"https://dyrk-plant.dlbr.dk/Web/(S(0x3ftyiaahcpttq0ljebuany))/forms/Main.aspx?page=Vejledning&cropID=238\",\"Mellemafgrøder\")))","v":"Efterafgrøder"}]
[null,null,null,{"$f":"(Beslutningstræ!GZ83)","v":"Kløvergræs (blanding)"},{"$f":"(Beslutningstræ!HA83)","v":"1. august"},{"$f":"(Beslutningstræ!HB83)","v":"Meget god"},{"$f":"(Beslutningstræ!HC83)","v":"Ja"},{"$f":"(Beslutningstræ!HD83)","v":"Stor"},{"$f":"(Beslutningstræ!HE83)","v":-2145},{"$f":"(Beslutningstræ!HF83)","v":"-"},{"$f":"(Beslutningstræ!HG83)","v":"Mod visse"},{"$f":"(Beslutningstræ!HH83)","v":"Aldrig"},{"$f":"(Beslutningstræ!HI83)","v":"Nej"},{"$f":"(Beslutningstræ!HJ83)","v":"Meget god"},{"$f":"(Beslutningstræ!HK83)","v":"Nej"},{"$f":"(Beslutningstræ!HK83)","v":"Nej"},"Efterafgrøder"]
[null,null,null,{"$f":"(Beslutningstræ!GZ84)","v":"Vårbyg /Vikke /Gul Sennep"},{"$f":"(Beslutningstræ!HA84)","v":"20. august"},{"$f":"(Beslutningstræ!HB84)","v":"Meget god"},{"$f":"(Beslutningstræ!HC84)","v":"Ja"},{"$f":"(Beslutningstræ!HD84)","v":"Over middel"},{"$f":"(Beslutningstræ!HE84)","v":-789},{"$f":"(Beslutningstræ!HF84)","v":-348.5},{"$f":"(Beslutningstræ!HG84)","v":"Nej"},{"$f":"(Beslutningstræ!HH84)","v":"Aldrig"},{"$f":"(Beslutningstræ!HI84)","v":"Nej"},{"$f":"(Beslutningstræ!HJ84)","v":"Dårlig"},{"$f":"(Beslutningstræ!HK84)","v":"Nej"},{"$f":"(Beslutningstræ!HK84)","v":"Nej"},"Efterafgrøder"]
["Sædskiftesygdomme","Ikke vigtigt",null,{"$f":"(Beslutningstræ!GZ85)","v":"Olieræddike"},{"$f":"(Beslutningstræ!HA85)","v":"20. august"},{"$f":"(Beslutningstræ!HB85)","v":"Meget god"},{"$f":"(Beslutningstræ!HC85)","v":"Nej"},{"$f":"(Beslutningstræ!HD85)","v":"Over middel"},{"$f":"(Beslutningstræ!HE85)","v":-649},{"$f":"(Beslutningstræ!HF85)","v":231},{"$f":"(Beslutningstræ!HG85)","v":"Mod de fleste"},{"$f":"(Beslutningstræ!HH85)","v":"I mindre grad"},{"$f":"(Beslutningstræ!HI85)","v":"Mange"},{"$f":"(Beslutningstræ!HJ85)","v":"Udvintrer"},{"$f":"(Beslutningstræ!HK85)","v":"Nej"},{"$f":"(Beslutningstræ!HK85)","v":"Nej"},"Efterafgrøder"]
["Afgrøden må ikke opformere kålbrok","Ikke vigtigt",null,{"$f":"(Beslutningstræ!GZ86)","v":"Gul sennep"},{"$f":"(Beslutningstræ!HA86)","v":"20. august"},{"$f":"(Beslutningstræ!HB86)","v":"Meget god"},{"$f":"(Beslutningstræ!HC86)","v":"Nej"},{"$f":"(Beslutningstræ!HD86)","v":"Over middel"},{"$f":"(Beslutningstræ!HE86)","v":-503},{"$f":"(Beslutningstræ!HF86)","v":377},{"$f":"(Beslutningstræ!HG86)","v":"Mod de fleste"},{"$f":"(Beslutningstræ!HH86)","v":"Altid"},{"$f":"(Beslutningstræ!HI86)","v":"Mange"},{"$f":"(Beslutningstræ!HJ86)","v":"Udvintrer"},{"$f":"(Beslutningstræ!HK86)","v":"Nej"},{"$f":"(Beslutningstræ!HK86)","v":"Nej"},"Efterafgrøder"]
["Der findes sorter, der er sanerende for roecystenematoder","Ikke vigtigt",null,{"$f":"(Beslutningstræ!GZ87)","v":"Foderradise (Strukturator)"},{"$f":"(Beslutningstræ!HA87)","v":"20. august"},{"$f":"(Beslutningstræ!HB87)","v":"Meget god"},{"$f":"(Beslutningstræ!HC87)","v":"Nej"},{"$f":"(Beslutningstræ!HD87)","v":"Over middel"},{"$f":"(Beslutningstræ!HE87)","v":-913},{"$f":"(Beslutningstræ!HF87)","v":-33},{"$f":"(Beslutningstræ!HG87)","v":"Mod de fleste"},{"$f":"(Beslutningstræ!HH87)","v":"I mindre grad"},{"$f":"(Beslutningstræ!HI87)","v":"Nej"},{"$f":"(Beslutningstræ!HJ87)","v":"Udvintrer"},{"$f":"(Beslutningstræ!HK87)","v":"Nej"},{"$f":"(Beslutningstræ!HK87)","v":"Nej"},"Efterafgrøder"]
[null,null,null,{"$f":"(Beslutningstræ!GZ88)","v":"Honningurt"},{"$f":"(Beslutningstræ!HA88)","v":"20. august"},{"$f":"(Beslutningstræ!HB88)","v":"Meget god"},{"$f":"(Beslutningstræ!HC88)","v":"Nej"},{"$f":"(Beslutningstræ!HD88)","v":"Over middel"},{"$f":"(Beslutningstræ!HE88)","v":-2302},{"$f":"(Beslutningstræ!HF88)","v":-2082},{"$f":"(Beslutningstræ!HG88)","v":"Mod de fleste"},{"$f":"(Beslutningstræ!HH88)","v":"Aldrig"},{"$f":"(Beslutningstræ!HI88)","v":"Nej"},{"$f":"(Beslutningstræ!HJ88)","v":"Udvintrer"},{"$f":"(Beslutningstræ!HK88)","v":"Nej"},{"$f":"(Beslutningstræ!HK88)","v":"Nej"},"Efterafgrøder"]
["Vinterfasthed og rodvækst og udsæd ",null,null,{"$f":"(Beslutningstræ!GZ89)","v":"Vinterrug "},{"$f":"(Beslutningstræ!HA89)","v":"20. august"},{"$f":"(Beslutningstræ!HB89)","v":"Meget god"},{"$f":"(Beslutningstræ!HC89)","v":"Nej"},{"$f":"(Beslutningstræ!HD89)","v":"Middel"},{"$f":"(Beslutningstræ!HE89)","v":-849},{"$f":"(Beslutningstræ!HF89)","v":-409},{"$f":"(Beslutningstræ!HG89)","v":"Mod de fleste"},{"$f":"(Beslutningstræ!HH89)","v":"Aldrig"},{"$f":"(Beslutningstræ!HI89)","v":"Nej"},{"$f":"(Beslutningstræ!HJ89)","v":"Meget god"},{"$f":"(Beslutningstræ!HK89)","v":"Ja"},{"$f":"(Beslutningstræ!HK89)","v":"Ja"},"Efterafgrøder"]
["Vinterfast","Ikke vigtigt",null,{"$f":"(Beslutningstræ!GZ90)","v":"Havre"},{"$f":"(Beslutningstræ!HA90)","v":"20. august"},{"$f":"(Beslutningstræ!HB90)","v":"Meget god"},{"$f":"(Beslutningstræ!HC90)","v":"Nej"},{"$f":"(Beslutningstræ!HD90)","v":"Middel"},{"$f":"(Beslutningstræ!HE90)","v":-877},{"$f":"(Beslutningstræ!HF90)","v":-657},{"$f":"(Beslutningstræ!HG90)","v":"Mod de fleste"},{"$f":"(Beslutningstræ!HH90)","v":"Aldrig"},{"$f":"(Beslutningstræ!HI90)","v":"Nej"},{"$f":"(Beslutningstræ!HJ90)","v":"Dårlig"},{"$f":"(Beslutningstræ!HK90)","v":"Ja"},{"$f":"(Beslutningstræ!HK90)","v":"Ja"},"Efterafgrøder"]
["Egen udsæd kan anvendes","Ikke vigtigt",null,{"$f":"(Beslutningstræ!GZ91)","v":"Vårbyg"},{"$f":"(Beslutningstræ!HA91)","v":"20. august"},{"$f":"(Beslutningstræ!HB91)","v":"Meget god"},{"$f":"(Beslutningstræ!HC91)","v":"Nej"},{"$f":"(Beslutningstræ!HD91)","v":"Middel"},{"$f":"(Beslutningstræ!HE91)","v":-877},{"$f":"(Beslutningstræ!HF91)","v":-657},{"$f":"(Beslutningstræ!HG91)","v":"Mod de fleste"},{"$f":"(Beslutningstræ!HH91)","v":"Aldrig"},{"$f":"(Beslutningstræ!HI91)","v":"Nej"},{"$f":"(Beslutningstræ!HJ91)","v":"Dårlig"},{"$f":"(Beslutningstræ!HK91)","v":"Ja"},{"$f":"(Beslutningstræ!HK91)","v":"Ja"},"Efterafgrøder"]
["Hurtig og dyb rodvækst på lerjord","Ikke vigtigt",null,{"$f":"(Beslutningstræ!GZ92)","v":"Vinterrybs"},{"$f":"(Beslutningstræ!HA92)","v":"20. august"},{"$f":"(Beslutningstræ!HB92)","v":"Meget god"},{"$f":"(Beslutningstræ!HC92)","v":"Nej"},{"$f":"(Beslutningstræ!HD92)","v":"Middel"},{"$f":"(Beslutningstræ!HE92)","v":-1513},{"$f":"(Beslutningstræ!HF92)","v":-633},{"$f":"(Beslutningstræ!HG92)","v":"Nej"},{"$f":"(Beslutningstræ!HH92)","v":"Aldrig"},{"$f":"(Beslutningstræ!HI92)","v":"Nej"},{"$f":"(Beslutningstræ!HJ92)","v":"Meget god"},{"$f":"(Beslutningstræ!HK92)","v":"Ja"},{"$f":"(Beslutningstræ!HK92)","v":"Ja"},"Efterafgrøder"]
[null,null,null,{"$f":"(Beslutningstræ!GZ93)","v":"Hvidkløver/alm. rajgræs"},{"$f":"(Beslutningstræ!HA93)","v":"1. august"},{"$f":"(Beslutningstræ!HB93)","v":"God"},{"$f":"(Beslutningstræ!HC93)","v":"Ja"},{"$f":"(Beslutningstræ!HD93)","v":"Stor"},{"$f":"(Beslutningstræ!HE93)","v":-185},{"$f":"(Beslutningstræ!HF93)","v":"-"},{"$f":"(Beslutningstræ!HG93)","v":"Mod visse"},{"$f":"(Beslutningstræ!HH93)","v":"Aldrig"},{"$f":"(Beslutningstræ!HI93)","v":"Nej"},{"$f":"(Beslutningstræ!HJ93)","v":"Meget god"},{"$f":"(Beslutningstræ!HK93)","v":"Nej"},{"$f":"(Beslutningstræ!HK93)","v":"Nej"},"Efterafgrøder"]
["Egenskaber mht. kvælstof",null,null,{"$f":"(Beslutningstræ!GZ94)","v":"Vinterraps , linie"},{"$f":"(Beslutningstræ!HA94)","v":"20. august"},{"$f":"(Beslutningstræ!HB94)","v":"God"},{"$f":"(Beslutningstræ!HC94)","v":"Nej"},{"$f":"(Beslutningstræ!HD94)","v":"Over middel"},{"$f":"(Beslutningstræ!HE94)","v":-1136},{"$f":"(Beslutningstræ!HF94)","v":-476},{"$f":"(Beslutningstræ!HG94)","v":"Mod de fleste"},{"$f":"(Beslutningstræ!HH94)","v":"Altid"},{"$f":"(Beslutningstræ!HI94)","v":"Nej"},{"$f":"(Beslutningstræ!HJ94)","v":"Meget god"},{"$f":"(Beslutningstræ!HK94)","v":"Ja"},{"$f":"(Beslutningstræ!HK94)","v":"Ja"},"Efterafgrøder"]
["Kvælstoffikserende","Vigtigt",null,{"$f":"(Beslutningstræ!GZ95)","v":"Alm. rajgræs, dipl."},{"$f":"(Beslutningstræ!HA95)","v":"1.august"},{"$f":"(Beslutningstræ!HB95)","v":"God"},{"$f":"(Beslutningstræ!HC95)","v":"Nej"},{"$f":"(Beslutningstræ!HD95)","v":"Middel"},{"$f":"(Beslutningstræ!HE95)","v":-185},{"$f":"(Beslutningstræ!HF95)","v":"-"},{"$f":"(Beslutningstræ!HG95)","v":"Mod mange"},{"$f":"(Beslutningstræ!HH95)","v":"Aldrig"},{"$f":"(Beslutningstræ!HI95)","v":"Nej"},{"$f":"(Beslutningstræ!HJ95)","v":"Meget god"},{"$f":"(Beslutningstræ!HK95)","v":"Nej"},{"$f":"(Beslutningstræ!HK95)","v":"Nej"},"Efterafgrøder"]
["Stor kvælstof eftervirkning","Vigtigt",null,{"$f":"(Beslutningstræ!GZ96)","v":"Rødkløver/strandsvingel"},{"$f":"(Beslutningstræ!HA96)","v":"1. august"},{"$f":"(Beslutningstræ!HB96)","v":"Brugbar"},{"$f":"(Beslutningstræ!HC96)","v":"Ja"},{"$f":"(Beslutningstræ!HD96)","v":"Stor"},{"$f":"(Beslutningstræ!HE96)","v":-1355},{"$f":"(Beslutningstræ!HF96)","v":"-"},{"$f":"(Beslutningstræ!HG96)","v":"Mod visse"},{"$f":"(Beslutningstræ!HH96)","v":"Aldrig"},{"$f":"(Beslutningstræ!HI96)","v":"Nej"},{"$f":"(Beslutningstræ!HJ96)","v":"Meget god"},{"$f":"(Beslutningstræ!HK96)","v":"Nej"},{"$f":"(Beslutningstræ!HK96)","v":"Nej"},"Efterafgrøder"]
[null,null,null,{"$f":"(Beslutningstræ!GZ97)","v":"Triticale/Gul Sennep"},{"$f":"(Beslutningstræ!HA97)","v":"1. august"},{"$f":"(Beslutningstræ!HB97)","v":"Brugbar"},{"$f":"(Beslutningstræ!HC97)","v":"Nej"},{"$f":"(Beslutningstræ!HD97)","v":"Middel"},{"$f":"(Beslutningstræ!HE97)","v":-647},{"$f":"(Beslutningstræ!HF97)","v":"-"},{"$f":"(Beslutningstræ!HG97)","v":"Nej"},{"$f":"(Beslutningstræ!HH97)","v":"Aldrig"},{"$f":"(Beslutningstræ!HI97)","v":"Nej"},{"$f":"(Beslutningstræ!HJ97)","v":"Udvintrer"},{"$f":"(Beslutningstræ!HK97)","v":"Nej"},{"$f":"(Beslutningstræ!HK97)","v":"Nej"},"Efterafgrøder"]
[null,null,null,{"$f":"(Beslutningstræ!GZ98)","v":""},{"$f":"(Beslutningstræ!HA98)","v":""},{"$f":"(Beslutningstræ!HB98)","v":""},{"$f":"(Beslutningstræ!HC98)","v":""},{"$f":"(Beslutningstræ!HD98)","v":""},{"$f":"(Beslutningstræ!HE98)","v":""},{"$f":"(Beslutningstræ!HF98)","v":""},{"$f":"(Beslutningstræ!HG98)","v":""},{"$f":"(Beslutningstræ!HH98)","v":""},{"$f":"(Beslutningstræ!HI98)","v":""},{"$f":"(Beslutningstræ!HJ98)","v":""},{"$f":"(Beslutningstræ!HK98)","v":""},{"$f":"(Beslutningstræ!HK98)","v":""},""]
["SEGES P/S",null,null,{"$f":"(Beslutningstræ!GZ99)","v":""},{"$f":"(Beslutningstræ!HA99)","v":""},{"$f":"(Beslutningstræ!HB99)","v":""},{"$f":"(Beslutningstræ!HC99)","v":""},{"$f":"(Beslutningstræ!HD99)","v":""},{"$f":"(Beslutningstræ!HE99)","v":""},{"$f":"(Beslutningstræ!HF99)","v":""},{"$f":"(Beslutningstræ!HG99)","v":""},{"$f":"(Beslutningstræ!HH99)","v":""},{"$f":"(Beslutningstræ!HI99)","v":""},{"$f":"(Beslutningstræ!HJ99)","v":""},{"$f":"(Beslutningstræ!HK99)","v":""},{"$f":"(Beslutningstræ!HK99)","v":""},""]
["Udviklet af: ",null,null,{"$f":"(Beslutningstræ!GZ100)","v":""},{"$f":"(Beslutningstræ!HA100)","v":""},{"$f":"(Beslutningstræ!HB100)","v":""},{"$f":"(Beslutningstræ!HC100)","v":""},{"$f":"(Beslutningstræ!HD100)","v":""},{"$f":"(Beslutningstræ!HE100)","v":""},{"$f":"(Beslutningstræ!HF100)","v":""},{"$f":"(Beslutningstræ!HG100)","v":""},{"$f":"(Beslutningstræ!HH100)","v":""},{"$f":"(Beslutningstræ!HI100)","v":""},{"$f":"(Beslutningstræ!HJ100)","v":""},{"$f":"(Beslutningstræ!HK100)","v":""},{"$f":"(Beslutningstræ!HK100)","v":""},""]
["Kristoffer Piil",null,null,{"$f":"(Beslutningstræ!GZ101)","v":""},{"$f":"(Beslutningstræ!HA101)","v":""},{"$f":"(Beslutningstræ!HB101)","v":""},{"$f":"(Beslutningstræ!HC101)","v":""},{"$f":"(Beslutningstræ!HD101)","v":""},{"$f":"(Beslutningstræ!HE101)","v":""},{"$f":"(Beslutningstræ!HF101)","v":""},{"$f":"(Beslutningstræ!HG101)","v":""},{"$f":"(Beslutningstræ!HH101)","v":""},{"$f":"(Beslutningstræ!HI101)","v":""},{"$f":"(Beslutningstræ!HJ101)","v":""},{"$f":"(Beslutningstræ!HK101)","v":""},{"$f":"(Beslutningstræ!HK101)","v":""},""]
["Frank Oudshoorn",null,null,null,null,null,null,null,null,null,null,null,null,null,null,null,""]
["Casper Laursen",null,null,null,null,{"$f":"IF(Beslutningstræ!HA63=\"xx\",\"\",Beslutningstræ!HA63)","v":""},{"$f":"IF(Beslutningstræ!HB63=\"xx\",\"\",Beslutningstræ!HB63)","v":""},{"$f":"IF(Beslutningstræ!HC63=\"xx\",\"\",Beslutningstræ!HC63)","v":""},{"$f":"IF(Beslutningstræ!HD63=\"xx\",\"\",Beslutningstræ!HD63)","v":""},{"$f":"IF(Beslutningstræ!HE63=\"xx\",\"\",Beslutningstræ!HE63)","v":""},{"$f":"IF(Beslutningstræ!HF63=\"xx\",\"\",Beslutningstræ!HF63)","v":""},{"$f":"IF(Beslutningstræ!HG63=\"xx\",\"\",Beslutningstræ!HG63)","v":""},{"$f":"IF(Beslutningstræ!HH63=\"xx\",\"\",Beslutningstræ!HH63)","v":""},{"$f":"IF(Beslutningstræ!HI63=\"xx\",\"\",Beslutningstræ!HI63)","v":""},{"$f":"IF(Beslutningstræ!HJ63=\"xx\",\"\",Beslutningstræ!HJ63)","v":""},{"$f":"IF(Beslutningstræ!HK63=\"xx\",\"\",Beslutningstræ!HK63)","v":""},""]
["Hans S. Østergaard",null,null,null,null,{"$f":"IF(Beslutningstræ!HA64=\"xx\",\"\",Beslutningstræ!HA64)","v":""},{"$f":"IF(Beslutningstræ!HB64=\"xx\",\"\",Beslutningstræ!HB64)","v":""},{"$f":"IF(Beslutningstræ!HC64=\"xx\",\"\",Beslutningstræ!HC64)","v":""},{"$f":"IF(Beslutningstræ!HD64=\"xx\",\"\",Beslutningstræ!HD64)","v":""},{"$f":"IF(Beslutningstræ!HE64=\"xx\",\"\",Beslutningstræ!HE64)","v":""},{"$f":"IF(Beslutningstræ!HF64=\"xx\",\"\",Beslutningstræ!HF64)","v":""},{"$f":"IF(Beslutningstræ!HG64=\"xx\",\"\",Beslutningstræ!HG64)","v":""},{"$f":"IF(Beslutningstræ!HH64=\"xx\",\"\",Beslutningstræ!HH64)","v":""},{"$f":"IF(Beslutningstræ!HI64=\"xx\",\"\",Beslutningstræ!HI64)","v":""},{"$f":"IF(Beslutningstræ!HJ64=\"xx\",\"\",Beslutningstræ!HJ64)","v":""},{"$f":"IF(Beslutningstræ!HK64=\"xx\",\"\",Beslutningstræ!HK64)","v":""},""]
["Erik Maegaard",null,null,null,null,{"$f":"IF(Beslutningstræ!HA65=\"xx\",\"\",Beslutningstræ!HA65)","v":""},{"$f":"IF(Beslutningstræ!HB65=\"xx\",\"\",Beslutningstræ!HB65)","v":""},{"$f":"IF(Beslutningstræ!HC65=\"xx\",\"\",Beslutningstræ!HC65)","v":""},{"$f":"IF(Beslutningstræ!HD65=\"xx\",\"\",Beslutningstræ!HD65)","v":""},{"$f":"IF(Beslutningstræ!HE65=\"xx\",\"\",Beslutningstræ!HE65)","v":""},{"$f":"IF(Beslutningstræ!HF65=\"xx\",\"\",Beslutningstræ!HF65)","v":""},{"$f":"IF(Beslutningstræ!HG65=\"xx\",\"\",Beslutningstræ!HG65)","v":""},{"$f":"IF(Beslutningstræ!HH65=\"xx\",\"\",Beslutningstræ!HH65)","v":""},{"$f":"IF(Beslutningstræ!HI65=\"xx\",\"\",Beslutningstræ!HI65)","v":""},{"$f":"IF(Beslutningstræ!HJ65=\"xx\",\"\",Beslutningstræ!HJ65)","v":""},{"$f":"IF(Beslutningstræ!HK65=\"xx\",\"\",Beslutningstræ!HK65)","v":""},""]
[null,null,null,null,null,{"$f":"IF(Beslutningstræ!HA66=\"xx\",\"\",Beslutningstræ!HA66)","v":""},{"$f":"IF(Beslutningstræ!HB66=\"xx\",\"\",Beslutningstræ!HB66)","v":""},{"$f":"IF(Beslutningstræ!HC66=\"xx\",\"\",Beslutningstræ!HC66)","v":""},{"$f":"IF(Beslutningstræ!HD66=\"xx\",\"\",Beslutningstræ!HD66)","v":""},{"$f":"IF(Beslutningstræ!HE66=\"xx\",\"\",Beslutningstræ!HE66)","v":""},{"$f":"IF(Beslutningstræ!HF66=\"xx\",\"\",Beslutningstræ!HF66)","v":""},{"$f":"IF(Beslutningstræ!HG66=\"xx\",\"\",Beslutningstræ!HG66)","v":""},{"$f":"IF(Beslutningstræ!HH66=\"xx\",\"\",Beslutningstræ!HH66)","v":""},{"$f":"IF(Beslutningstræ!HI66=\"xx\",\"\",Beslutningstræ!HI66)","v":""},{"$f":"IF(Beslutningstræ!HJ66=\"xx\",\"\",Beslutningstræ!HJ66)","v":""},{"$f":"IF(Beslutningstræ!HK66=\"xx\",\"\",Beslutningstræ!HK66)","v":""},""]
["Udviklingen af dette værktøj er støttet af: ",null,null,null,null,{"$f":"IF(Beslutningstræ!HA67=\"xx\",\"\",Beslutningstræ!HA67)","v":""},{"$f":"IF(Beslutningstræ!HB67=\"xx\",\"\",Beslutningstræ!HB67)","v":""},{"$f":"IF(Beslutningstræ!HC67=\"xx\",\"\",Beslutningstræ!HC67)","v":""},{"$f":"IF(Beslutningstræ!HD67=\"xx\",\"\",Beslutningstræ!HD67)","v":""},{"$f":"IF(Beslutningstræ!HE67=\"xx\",\"\",Beslutningstræ!HE67)","v":""},{"$f":"IF(Beslutningstræ!HF67=\"xx\",\"\",Beslutningstræ!HF67)","v":""},{"$f":"IF(Beslutningstræ!HG67=\"xx\",\"\",Beslutningstræ!HG67)","v":""},{"$f":"IF(Beslutningstræ!HH67=\"xx\",\"\",Beslutningstræ!HH67)","v":""},{"$f":"IF(Beslutningstræ!HI67=\"xx\",\"\",Beslutningstræ!HI67)","v":""},{"$f":"IF(Beslutningstræ!HJ67=\"xx\",\"\",Beslutningstræ!HJ67)","v":""},{"$f":"IF(Beslutningstræ!HK67=\"xx\",\"\",Beslutningstræ!HK67)","v":""},""]
[null," ",null,null,null,{"$f":"IF(Beslutningstræ!HA68=\"xx\",\"\",Beslutningstræ!HA68)","v":""},{"$f":"IF(Beslutningstræ!HB68=\"xx\",\"\",Beslutningstræ!HB68)","v":""},{"$f":"IF(Beslutningstræ!HC68=\"xx\",\"\",Beslutningstræ!HC68)","v":""},{"$f":"IF(Beslutningstræ!HD68=\"xx\",\"\",Beslutningstræ!HD68)","v":""},{"$f":"IF(Beslutningstræ!HE68=\"xx\",\"\",Beslutningstræ!HE68)","v":""},{"$f":"IF(Beslutningstræ!HF68=\"xx\",\"\",Beslutningstræ!HF68)","v":""},{"$f":"IF(Beslutningstræ!HG68=\"xx\",\"\",Beslutningstræ!HG68)","v":""},{"$f":"IF(Beslutningstræ!HH68=\"xx\",\"\",Beslutningstræ!HH68)","v":""},{"$f":"IF(Beslutningstræ!HI68=\"xx\",\"\",Beslutningstræ!HI68)","v":""},{"$f":"IF(Beslutningstræ!HJ68=\"xx\",\"\",Beslutningstræ!HJ68)","v":""},{"$f":"IF(Beslutningstræ!HK68=\"xx\",\"\",Beslutningstræ!HK68)","v":""},""]
[null,null,null,null,null,{"$f":"IF(Beslutningstræ!HA69=\"xx\",\"\",Beslutningstræ!HA69)","v":""},{"$f":"IF(Beslutningstræ!HB69=\"xx\",\"\",Beslutningstræ!HB69)","v":""},{"$f":"IF(Beslutningstræ!HC69=\"xx\",\"\",Beslutningstræ!HC69)","v":""},{"$f":"IF(Beslutningstræ!HD69=\"xx\",\"\",Beslutningstræ!HD69)","v":""},{"$f":"IF(Beslutningstræ!HE69=\"xx\",\"\",Beslutningstræ!HE69)","v":""},{"$f":"IF(Beslutningstræ!HF69=\"xx\",\"\",Beslutningstræ!HF69)","v":""},{"$f":"IF(Beslutningstræ!HG69=\"xx\",\"\",Beslutningstræ!HG69)","v":""},{"$f":"IF(Beslutningstræ!HH69=\"xx\",\"\",Beslutningstræ!HH69)","v":""},{"$f":"IF(Beslutningstræ!HI69=\"xx\",\"\",Beslutningstræ!HI69)","v":""},{"$f":"IF(Beslutningstræ!HJ69=\"xx\",\"\",Beslutningstræ!HJ69)","v":""},{"$f":"IF(Beslutningstræ!HK69=\"xx\",\"\",Beslutningstræ!HK69)","v":""},""]
[null,null,null,null,null,null,null,null,null,null,null,null,null,null,null,null,""]
[null,null,null," ",null,null,null,null,null,null,null,null,null,null,null,null,""]
[null,null,null,null,null,null,null,null,null,null,null,null,null,null,null,null,""]
[null,null,null,null,null,null,null,null,null,null,null,null,null,null,null,null,""]
[null,null,null,null,null,null,null,null,null,null,null,null,null,null,null,null,""]
[null,null,null,null,null,null,null,null,null,null,null,null,null,null,null,null,""]
[null,null,null,null,null,null,null,null,null,null,null,null,null,null,null,null,""]
[null,null,null,null,null,null,null,null,null,null,null,null,null,null,null,null,""]
[]
[]
[null,null,null," "]

{"sheet":"Navne på afgrøder","index":2,"n_rows":35,"n_cols":2,"rows_kept":35,"cut":false,"hidden":false,"merged":[]}
["Såning sommer eller efter høst","Såning med primærafgrøde"]
["Alm. rajgræs, dipl.","Alm. rajgræs, dipl. Udlæg"]
["Blanding uden bælgsæd overvintrene","Blanding uden bælgsæd overvintrene"]
["Vårbyg /Vikke /Gul Sennep","Vårbyg /Vikke /Gul Sennep"]
["Rajgræs /cikorie /hvidkløver","Rajgræs /cikorie /hvidkløver"]
["Rødkløver","Rødkløver"]
["Vinterrug/fodervikke/olieræddike","Vinterrug/fodervikke/olieræddike"]
["Triticale/Gul Sennep","Triticale/Gul Sennep"]
["Frøgræs, udtjent","Frøgræs, udtjent"]
["Gul sennep","Gul sennep"]
["Olieræddike","Olieræddike"]
["Blanding med bælsæd udvintrene","Blanding med bælsæd udvintrene"]
["Vinterraps , linie","Vinterraps , linie"]
["Foderradise (Strukturator)","Foderradise (Strukturator)"]
["Havre","Havre"]
["Boghvede","Boghvede"]
["Vinterrybs","Vinterrybs"]
["Gul Lupin","Gul Lupin"]
["Vårbyg","Vårbyg"]
["vårbyg/fodervikke","vårbyg/fodervikke"]
["Vinterrug ","Vinterrug "]
["Olierædikke/gul sennep ","Olierædikke/gul sennep "]
["Blanding med bælsæd overvintrene","Blanding med bælsæd overvintrene"]
["Blanding uden bælgsæd udvintrene","Blanding uden bælgsæd udvintrene"]
["Cikorie","Cikorie"]
["Honningurt","Honningurt"]
["Fodervikke ","Fodervikke "]
["Vintervikke","Vintervikke"]
["Alexandrinekløver","Alexandrinekløver"]
["Hvidkløver","Hvidkløver"]
["Olieræddike og vintervikke","Olieræddike og vintervikke"]
["Hvidkløver/alm. rajgræs","Hvidkløver/alm. Rajgræs Udlæg"]
["Rødkløver/strandsvingel","Rødkløver/strandsvingel"]
["Vintervikke/vinterrug","Vintervikke/vinterrug"]
["Kløvergræs (blanding)","Kløvergræs (blanding) Udlæg"]

{"sheet":"Beslutningstræ","index":3,"n_rows":128,"n_cols":243,"rows_kept":128,"cut":false,"hidden":true,"merged":[[36,27,36,45]]}
[]
[null,null,null,null,null,null,null,null,null,null,null,null,null,null,null,null,null,null,null,null,null,null,null,null,null,null,null,null,null,null,null,null,null,null,null,null,null,null,null,null,null,null,null,null,null,null,null,null,null,null,null,null,null,null,null,null,null,null,null,null,null,null,null,null,null,null,null,null,null,null,null,null,null,null,null,null,null,null,null,null,null,null,null,null,null,null,null,null,null,null,null,null,null,null,null,null,null,null,null,null,null,null,null,null,null,null,null,null,null,null,null,null,null,null,null,null,null,null,null,null,null,null,null,null,null,null,null,null,null,null,null,null,null,null,null,null,null,null,null,null,null,null,null,null,null,null,null,null,null,null,null,null,null,null,null,null,null,null,null,null,null,null,null,null,null,null,null,null,null,null,null,null,null,null,null,null,null,null,null,null,null,null,null,null,null,null,null,null,null,null,null,null,null,null,null,null,null,null,null,null,null,null,null,null,"Afgrøde",null,"Rækkefølgevægtning",10]
[null,null,null,null,null,null,null,null,null,null,null,null,null,null,null,null,null,null,null,null,null,null,null,null,null,null,null,null,null,null,null,null,null,null,null,null,null,null,null,null,null,null,null,null,null,null,null,null,null,null,null,null,null,null,null,null,null,null,null,null,null,null,null,null,null,null,null,null,null,null,null,null,null,null,null,null,null,null,null,null,null,null,null,null,null,null,null,null,null,null,null,null,null,null,null,null,null,null,null,null,null,null,null,null,null,null,null,null,null,null,null,null,null,null,null,null,null,null,null,null,null,null,null,null,null,null,null,null,null,null,null,null,null,null,null,null,null,null,null,null,null,null,null,null,null,null,null,null,null,null,null,null,null,null,null,null,null,null,null,null,null,null,null,null,null,null,null,null,null,null,null,null,null,null,null,null,null,null,null,null,null,null,null,null,null,null,null,null,null,null,null,null,null,null,null,null,null,null,"1= no ties",null,null,5,null,null,"Tidspunkt",null,"Vægt af udsåningstidspunkt",3]
[null,null,"1. Vintersæd","1. Tidligt udlæg",null,null,null,null,null,null,null,null,null,null,null,null,null,null,null,null,null,null,null,null,null,null,null,null,null,null,null,null,null,null,null,null,null,null,null,null,null,null,null,null,null,null,null,null,null,null,null,null,null,null,null,null,null,null,null,null,null,null,null,null,null,null,null,null,null,null,null,null,null,null,null,null,null,null,null,null,null,null,null,null,null,null,null,null,null,null,null,null,null,null,null,null,null,null,null,null,null,null,null,null,null,null,null,null,null,null,null,null,null,null,null,null,null,null,null,null,null,null,null,null,null,null,null,null,null,null,null,null,null,null,null,null,null,null,null,null,null,null,null,null,null,null,null,null,null,null,null,null,null,null,null,null,null,null,null,null,null,null,null,null,null,null,null,null,null,null,null,null,null,null,null,null,null,null,null,null,null,null,null,null,null,null,null,null,null,null,null,null,null,null,null,"nr.","defa","sys","Check for ties","Break ties","plads","vægt"]
[null,null,"2. Vårsæd","2. Før høst",null,null,null,null,null,null,null,null,null,null,null,null,null,null,null,null,null,null,null,null,null,null,null,null,null,null,null,null,null,null,null,null,null,null,null,null,null,null,null,null,null,null,null,null,null,null,null,null,null,null,null,null,null,null,null,null,null,null,null,null,null,null,null,null,null,null,null,null,null,null,null,null,null,null,null,null,null,null,null,null,null,null,null,null,null,null,null,null,null,null,null,null,null,null,null,null,null,null,null,null,null,null,null,null,null,null,null,null,null,null,null,null,null,null,null,null,null,null,null,null,null,null,null,null,null,null,null,null,null,null,null,null,null,null,null,null,null,null,null,null,null,null,null,null,null,null,null,null,null,null,null,null,null,null,null,null,null,null,null,null,null,null,null,null,null,null,null,null,null,null,null,null,null,null,null,null,null,null,null,null,null,null,null,null,null,null,null,null,null,null,"Pris",1,21,{"$f":"GZ5+GO5/10","v":2.1},{"$f":"COUNTIF(GP$5:GP$26,GP5)","v":1},{"$f":"IF(GQ5>1,GP5+GO5/1000,GP5)","v":2.1},{"$f":"_xlfn.RANK.EQ(GR5,$GR$5:$GR$37,0)","v":5},{"$f":"GP5^$GT$3","v":40.841010000000004},null,null,"Pris",{"$f":"'Efterafgrøde beslutningsstøtte'!B24","v":"Ikke vigtigt"},{"$f":"VLOOKUP(GX5,Standard_karakterer,2,FALSE)","v":0},{"$f":"GY5","v":0}]
[null,null,"3. Majs","3. Efter høst",null,null,null,null,null,null,null,null,null,null,null,null,null,null,null,null,null,null,null,null,null,null,null,null,null,null,null,null,null,null,null,null,null,null,null,null,null,null,null,null,null,null,null,null,null,null,"Middelværdier",null,null,null,null,null,null,null,null,null,null,null,null,null,null,null,null,null,null,null,null,null,null,null,null,null,null,null,null,null,null,null,null,null,null,null,null,null,null,null,null,null,null,null,null,null,null,null,null,null,null,null,null,null,null,null,null,null,null,null,null,null,null,null,null,null,null,null,null,null,null,"Midelværdi kvadrat",null,null,null,null,null,null,null,null,null,null,null,null,null,null,null,null,null,null,null,null,null,null,null,null,null,null,null,null,null,null,null,null,null,null,null,null,null,null,null,null,null,null,null,null,null,null,null,null,null,null,null,null,null,null,null,null,null,null,null,null,null,null,null,null,null,null,null,null,null,null,null,null,"Pligtig efterafgrøde",2,12,1.2,{"$f":"COUNTIF(GP$5:GP$26,GP6)","v":1},{"$f":"IF(GQ6>1,GP6+GO6/1000,GP6)","v":1.2},{"$f":"IF(_xlfn.RANK.EQ(GR6,$GR$5:$GR$37,0)>GS$5,(_xlfn.RANK.EQ(GR6,$GR$5:$GR$37,0)+1),(_xlfn.RANK.EQ(GR6,$GR$5:$GR$37,0)))","v":13},{"$f":"GP6^$GT$3","v":2.4883199999999999},null,null,"Pligtig efterafgrøde",{"$f":"IF('Efterafgrøde beslutningsstøtte'!A$7=GW6,\"Ja\",\"Nej\")","v":"Ja"},{"$f":"IF(GX6=\"Ja\",0,0)","v":0},{"$f":"GY6","v":0}]
[null,null,"2. Vårsæd",null,null,null,null,null,null,null,null,null,null,null,null,null,null,null,null,null,null,null,null,null,null,null,null,null,null,null,null,null,null,null,null,null,null,null,null,null,null,null,null,null,null,null,null,null,null,null,{"$f":"AVERAGE(AY41:AY74)","v":-983.61764705882354},{"$f":"AVERAGE(AZ41:AZ74)","v":1},0.11764705882352941,0.58823529411764708,0.29411764705882354,1,1,1,0,0.76470588235294112,1.0588235294117647,2.5882352941176472,0.35294117647058826,1.9411764705882353,1.2941176470588236,2.0588235294117645,2.4705882352941178,0.35294117647058826,{"$f":"AVERAGE(BQ41:BQ74)","v":1.588235294117647},{"$f":"AVERAGE(BQ41:BQ74)","v":1.588235294117647},{"$f":"AVERAGE(BR41:BR74)","v":0.29411764705882354},{"$f":"AVERAGE(BS41:BS74)","v":18.117647058823529},null,null,null,null,null,null,null,null,null,null,null,null,null,null,null,null,null,null,null,null,null,null,null,null,null,null,null,null,null,null,null,null,null,null,null,null,null,null,null,null,null,null,null,null,null,null,null,null,null,{"$f":"AVERAGE(DR41:DR74)","v":1283299.6029411764},{"$f":"AVERAGE(DS41:DS74)","v":1},{"$f":"AVERAGE(DT41:DT74)","v":0.11764705882352941},0.58823529411764708,0.29411764705882354,1,1,1,0,2.1764705882352939,2.4705882352941178,7.1764705882352944,0.35294117647058826,4.4117647058823533,3.2941176470588234,5.7058823529411766,7.0588235294117645,1.0588235294117647,{"$f":"AVERAGE(#REF!)","v":{"$error":"#REF!"}},{"$f":"AVERAGE(EJ41:EJ74)","v":4.4117647058823533},{"$f":"AVERAGE(EK41:EK74)","v":0.82352941176470584},{"$f":"AVERAGE(EL41:EL74)","v":440.23529411764707},null,null,null,null,null,null,null,null,null,null,null,null,null,null,null,null,null,null,null,null,null,null,null,null,null,null,null,null,null,null,null,null,null,null,null,null,null,null,null,null,null,null,null,null,null,null,null,null,null,null,null,"Pligtig mellemafgrøde",3,11,1.1000000000000001,1,1.1000000000000001,{"$f":"IF(_xlfn.RANK.EQ(GR7,$GR$5:$GR$37,0)>GS$5,(_xlfn.RANK.EQ(GR7,$GR$5:$GR$37,0)+1),(_xlfn.RANK.EQ(GR7,$GR$5:$GR$37,0)))","v":14},{"$f":"GP7^$GT$3","v":1.6105100000000006},null,null,"Pligtig mellemafgrøde",{"$f":"IF('Efterafgrøde beslutningsstøtte'!A$7=GW7,\"Ja\",\"Nej\")","v":"Nej"},{"$f":"IF(GX7=\"Ja\",0,0)","v":0},0]
[null,null,null,null,null,null,null,null,null,null,null,null,null,null,null,null,null,null,null,null,null,null,null,null,null,null,null,null,null,null,null,null,null,null,null,null,null,null,null,null,null,null,null,null,null,null,null,null,null,null,null,null,null,null,null,null,null,null,null,null,null,null,null,null,null,null,null,null,null,null,null,null,null,null,null,null,null,null,null,null,null,null,null,null,null,null,null,null,null,null,null,null,null,null,null,null,null,null,null,null,null,null,null,null,null,null,null,null,null,null,null,null,null,null,null,null,null,null,null,null,null,{"$f":"IF(((DR7-AY7^2)^0.5)=0,10^-9,(DR7-AY7^2)^0.5)","v":561.95722909812275},1.0000000000000001E-9,0.32218973970892123,0.4921529567847503,0.45564509955381377,1.0000000000000001E-9,1.0000000000000001E-9,1.0000000000000001E-9,1.0000000000000001E-9,1.2616241523251304,1.1616716269489118,0.69102000732180746,0.47788461203740945,0.80224598217563892,1.2725475089872902,1.2112506048220004,0.97724986622565557,0.96656921912676375,{"$error":"#REF!"},1.3745084053585792,0.85850114819567203,10.582351306281142,null,null,null,null,null,null,null,null,null,null,null,null,null,null,null,null,null,null,null,null,null,null,null,null,null,null,null,null,null,null,null,null,null,null,null,null,null,null,null,null,null,null,null,null,null,null,null,null,null,null,null,"MFO-efterafgrøde i blanding2)",4,10,1,1,1,15,1,null,null,"MFO-efterafgrøde i blanding2)",{"$f":"IF(OR('Efterafgrøde beslutningsstøtte'!A$7=\"Kun MFO afgrøde\",'Efterafgrøde beslutningsstøtte'!A$7=\"Pligtig efterafgrøde og MFO afgrøde\"),\"Ja\",\"Nej\")","v":"Nej"},0,0]
[null,null,null,null,null,null,null,null,null,null,null,null,null,null,null,null,null,null,null,null,null,null,null,null,null,null,null,null,null,null,null,null,null,null,null,null,null,null,null,null,null,null,null,null,null,null,null,null,null,null,null,null,null,null,null,null,null,null,null,null,null,null,null,null,null,null,null,null,null,null,null,null,null,null,null,null,null,null,null,null,null,null,null,null,null,null,null,null,null,null,null,null,null,null,null,null,null,null,null,null,null,null,null,null,null,null,null,null,null,null,null,null,null,null,null,null,null,null,null,null,null,"Standard afvigelse",null,null,null,null,null,null,null,null,null,null,null,null,null,null,null,null,null,null,null,null,null,null,null,null,null,null,null,null,null,null,null,null,null,null,null,null,null,null,null,null,null,null,null,null,null,null,null,null,null,null,null,null,null,null,null,null,null,null,null,null,null,null,null,null,null,null,null,null,null,null,null,null,"MFO-udlæg",5,9,0.9,1,0.9,16,0.59049000000000018,null,null,"MFO-udlæg3)",{"$f":"IF(OR('Efterafgrøde beslutningsstøtte'!A$7=\"Kun MFO afgrøde\",'Efterafgrøde beslutningsstøtte'!A$7=\"Pligtig efterafgrøde og MFO afgrøde\"),\"Ja\",\"Nej\")","v":"Nej"},0,0]
[null,null,null,null,null,null,null,null,null,null,null,null,null,null,null,null,null,null,null,null,null,null,null,null,null,null,null,null,null,null,null,null,null,null,null,null,null,null,null,null,null,null,null,null,null,null,null,null,null,null,null,null,null,null,null,null,null,null,null,null,null,null,null,null,null,null,null,null,null,null,null,null,null,null,null,null,null,null,null,null,null,null,null,null,null,null,null,null,null,null,null,null,null,null,null,null,null,null,null,null,null,null,null,null,null,null,null,null,null,null,null,null,null,null,null,null,null,null,null,null,null,null,null,null,null,null,null,null,null,null,null,null,null,null,null,null,null,null,null,null,null,null,null,null,null,null,null,null,null,null,null,null,null,null,null,null,null,null,null,null,null,null,null,null,null,null,null,null,null,null,null,null,null,null,null,null,null,null,null,null,null,null,null,null,null,null,null,null,null,null,null,null,null,null,"Miljø-efterafgrøder",6,8,0.8,1,0.8,17,0.32768000000000019,null,null,"Miljø-efterafgrøder",{"$f":"IF('Efterafgrøde beslutningsstøtte'!A$7=GW10,\"Ja\",\"Nej\")","v":"Nej"},0,0]
[null,null,null,null,null,null,null,null,null,null,null,null,null,null,null,null,null,null,null,null,null,null,null,null,null,null,null,null,null,null,null,null,null,null,null,null,null,null,null,null,null,null,null,null,null,null,null,null,null,null,null,null,null,null,null,null,null,null,null,null,null,null,null,null,null,null,null,null,null,null,null,null,null,null,null,null,null,null,null,null,null,null,null,null,null,null,null,null,null,null,null,null,null,null,null,null,null,null,null,null,null,null,null,null,null,null,null,null,null,null,null,null,null,null,null,null,null,null,null,null,null,null,null,null,null,null,null,null,null,null,null,null,null,null,null,null,null,null,null,null,null,null,null,null,null,null,null,null,null,null,null,null,null,null,null,null,"vgt",{"$f":"TRANSPOSE(GT5:GT37)","v":40.841010000000004},2.4883199999999999,1.6105100000000006,1,0.59049000000000018,0.32768000000000019,0.16806999999999994,7.7759999999999996E-2,3.125E-2,1.0240000000000006E-2,2.4299999999999999E-3,400746.42431999987,454.35423999999989,391.35392999999988,7.59375,32,24.76099,18.895680000000006,14.198569999999997,10.485760000000006,1.0000000000000006E-5,0,0,391298735.38842988,0,0,0,0,0,0,0,0,0,null,null,null,null,"Frivillig efterafgrøde",7,7,0.7,1,0.7,18,0.16806999999999994,null,null,"Frivillig efterafgrøde",{"$f":"IF('Efterafgrøde beslutningsstøtte'!A$7=GW11,\"Ja\",\"Nej\")","v":"Nej"},0,0,1,2,3,4,5,6,7,8,9,10,11,12,13,14,15,16,17,18,19,20,21,22,23,24,25,26,27,28,29,30,31,32,33]
[null,null,null,null,null,null,null,null,null,null,null,null,null,null,null,null,null,null,null,null,null,null,null,null,null,null,null,null,null,null,null,null,null,null,null,null,null,null,null,null,null,null,null,null,null,null,null,null,null,null,null,null,null,null,null,null,null,null,null,null,null,null,null,null,null,null,null,null,null,null,null,null,null,null,null,null,null," ",null,null,null,null,null,null,null,null,null,null,null,null,null,null,null,null,null,null,null,null,null,null,null,null,null,null,null,null,null,null,null,null,null,null,null,null,null,null,null,null,null,null,null,null,null,null,null,null,null,null,null,null,null,null,null,null,null,null,null,null,null,null,null,null,null,null,null,null,null,null,null,null,null,null,null,null,null,null,null,null,null,null,null,null,null,null,null,null,null,null,null,null,null,null,null,null,null,null,null,null,null,null,null,null,null,null,null,null,null,null,null,null,null,null,null,null,"Grønne marker (2,3 DE-brug)",8,6,0.6,1,0.6,19,7.7759999999999996E-2,null,null,"Grønne marker (2,3 DE-brug)",{"$f":"IF('Efterafgrøde beslutningsstøtte'!A$7=GW12,\"Ja\",\"Nej\")","v":"Nej"},0,0,{"$f":"MATCH(HA$11,$GS$5:$GS$37,0)","v":24},{"$f":"MATCH(HB$11,$GS$5:$GS$37,0)","v":12},{"$f":"MATCH(HC$11,$GS$5:$GS$37,0)","v":13},{"$f":"MATCH(HD$11,$GS$5:$GS$37,0)","v":14},{"$f":"MATCH(HE$11,$GS$5:$GS$37,0)","v":1},{"$f":"MATCH(HF$11,$GS$5:$GS$37,0)","v":33},{"$f":"MATCH(HG$11,$GS$5:$GS$37,0)","v":16},{"$f":"MATCH(HH$11,$GS$5:$GS$37,0)","v":17},18,19,{"$f":"MATCH(HK$11,$GS$5:$GS$37,0)","v":20},{"$f":"MATCH(HL$11,$GS$5:$GS$37,0)","v":15},2,3,4,5,6,7,8,9,10,11,{"$f":"MATCH(HW$11,$GS$5:$GS$37,0)","v":21},{"$error":"#N/A"},{"$error":"#N/A"},{"$error":"#N/A"},{"$error":"#N/A"},{"$error":"#N/A"},{"$error":"#N/A"},{"$error":"#N/A"},{"$error":"#N/A"},{"$error":"#N/A"},{"$error":"#N/A"}]
[null,"Udfyldes af Hans!",null,null,null,null,null,null,null,null,null,null,null,null,null,null,null,null,null,null,null,null,null,null,null,null,null,null,null,null,null,null,null,null,null,null,null,null,null,null,null,null,null,null,null,null,null,null,null,null,null,null,null,null,null,null,null,null,null,null,null,null,null,null,null,null,null,null,null,null,null,null,null,null,null,null,null,null,null,null,null,null,null,null,null,null,null,null,null,null,null,null,null,null,null,null,null,null,null,null,null,null,null,null,null,null,null,null,null,null,null,null,null,null,null,null,null,null,null,null,null,null,null,null,null,null,null,null,null,null,null,null,null,null,null,null,null,null,null,null,null,null,null,null,null,null,null,null,null,null,null,null,null,null,null,null,null,null,null,null,null,null,null,null,null,null,null,null,null,null,null,null,null,null,null,null,null,null,null,null,null,null,null,null,null,null,null,null,null,null,null,null,null,null,"Egnet til udlæg efterår i vinterkorn",9,5,{"$f":"IF(GX13=\"Ja\",GZ$2+GZ13+GO13/10,GZ13+GO13/10)","v":0.5},1,{"$f":"IF(GQ13>1,GP13+GO13/1000,GP13)","v":0.5},20,3.125E-2,null,null,"Egnet til udlæg efterår i vinterkorn",{"$f":"IF(Karaktermatrice!C22=1,\"Ja\",\"Nej\")","v":"Nej"},{"$f":"IF(GX13=\"Ja\",GZ$3,0)","v":0},0]
[null,null,null,null,null,null,null,null,null,null,null,null,null,null,null,null,null,null,null,null,null,null,null,null,null,null,null,null,null,null,null,null,null,null,null,null,null,null,null,null,null,null,null,null,null,null,null,null,null,null,null,null,null,null,null,null,null,null,null,null,null,null,null,null,null,null,null,null,null,null,null,null,null,null,null,null,null,null,null,null,null,null,null,null,null,null,null,null,null,null,null,null,null,null,null,null,null,null,null,null,null,null,null,null,null,null,null,null,null,null,null,null,null,null,null,null,null,null,null,null,null,null,null,null,null,null,null,null,null,null,null,null,null,null,null,null,null,null,null,null,null,null,null,null,null,null,null,null,null,null,null,null,null,null,null,null,null,null,null,null,null,null,null,null,null,null,null,null,null,null,null,null,null,null,null,null,null,null,null,null,null,null,null,null,null,null,null,null,null,null,null,null,null,null,"Egnet til udlæg forår",10,4,{"$f":"IF(GX14=\"Ja\",GZ$2+GZ14+GO14/10,GZ14+GO14/10)","v":0.4},1,0.4,21,1.0240000000000006E-2,null,null,"Egnet til udlæg forår",{"$f":"IF(Karaktermatrice!C23=1,\"Ja\",\"Nej\")","v":"Nej"},{"$f":"IF(GX14=\"Ja\",GZ$3,0)","v":0},{"$f":"GY14","v":0}]
[null,null,null,null,null,null,null,null,null,null,null,null,null,null,null,null,null,null,null,null,null,null,null,null,null,null,null,null,null,null,null,null,null,null,null,null,null,null,null,null,null,null,null,null,null,null,null,null,null,null,null,null,null,null,null,null,null,null,null,null,null,null,null,null,null,null,null,null,null,null,null,null,null,null,null,null,null,null,null,null,null,null,null,null,null,null,null,null,null,null,null,null,null,null,null,null,null,null,null,null,null,null,null,null,null,null,null,null,null,null,null,null,null,null,null,null,null,null,null,null,null,null,null,null,null,null,null,null,null,null,null,null,null,null,null,null,null,null,null,null,null,null,null,null,null,null,null,null,null,null,null,null,null,null,null,null,null,null,null,null,null,null,null,null,null,null,null,null,null,null,null,null,null,null,null,null,null,null,null,null,null,null,null,null,null,null,null,null,null,null,null,null,null,null,"Egnet til udsåning ved sidste radrensning",11,3,{"$f":"IF(GX15=\"Ja\",GZ$2+GZ15+GO15/10,GZ15+GO15/10)","v":0.3},1,0.3,22,2.4299999999999999E-3,null,null,"Egnet til udsåning ved sidste radrensning",{"$f":"IF(Karaktermatrice!C24=1,\"Ja\",\"Nej\")","v":"Nej"},{"$f":"IF(GX15=\"Ja\",GZ$3,0)","v":0},0]
[null,null,null,null,null,null,null,null,null,null,null,null,null,null,null,null,null,null,null,null,null,null,null,null,null,null,null,null,null,null,null,null,null,null,null,null,null,null,null,null,null,null,null,null,null,null,null,null,null,null,null,null,null,null,null,null,null,null,null,null,null,null,null,null,null,null,null,null,null,null,null,null,null,null,null,null,null,null,null,null,null,null,null,null,null,null,null,null,null,null,null,null,null,null,null,null,null,null,null,null,null,null,null,null,null,null,null,null,null,null,null,null,null,null,null,null,null,null,null,null,null,null,null,null,null,null,null,null,null,null,null,null,null,null,null,null,null,null,null,null,null,null,null,null,null,null,null,null,null,null,null,null,null,null,null,null,null,null,null,null,null,null,null,null,null,null,null,null,null,null,null,null,null,null,null,null,null,null,null,null,null,null,null,null,null,null,null,null,null,null,null,null,null,null,"Egnet til udsåning efter tidlig høst (10. august)",12,2,{"$f":"IF(GX16=\"Ja\",GZ$2+GZ16+GO16/10,GZ16+GO16/10)","v":13.2},1,13.2,2,400746.42431999987,null,null,"Egnet til udsåning efter tidlig høst (10. august)",{"$f":"IF(Karaktermatrice!C25=1,\"Ja\",\"Nej\")","v":"Ja"},{"$f":"IF(GX16=\"Ja\",GZ$3,0)","v":3},3]
[null,null,null,null,null,null,null,null,null,null,null,null,null,null,null,null,null,null,null,null,null,null,null,null,null,null,null,null,null,null,null,null,null,null,null,null,null,null,null,null,null,null,null,null,null,null,null,null,null,null,null,null,null,null,null,null,null,null,null,null,null,null,null,null,null,null,null,null,null,null,null,null,null,null,null,null,null,null,null,null,null,null,null,null,null,null,null,null,null,null,null,null,null,null,null,null,null,null,null,null,null,null,null,null,null,null,null,null,null,null,null,null,null,null,null,null,null,null,null,null,null,null,null,null,null,null,null,null,null,null,null,null,null,null,null,null,null,null,null,null,null,null,null,null,null,null,null,null,null,null,null,null,null,null,null,null,null,null,null,null,null,null,null,null,null,null,null,null,null,null,null,null,null,null,null,null,null,null,null,null,null,null,null,null,null,null,null,null,null,null,null,null,null,null,"Kvælstoffikserende",13,14,{"$f":"GZ17+GO17/10","v":3.4},1,3.4,3,454.35423999999989,null,null,"Kvælstoffikserende",{"$f":"'Efterafgrøde beslutningsstøtte'!B37","v":"Vigtigt"},{"$f":"VLOOKUP(GX17,Standard_karakterer,2,FALSE)","v":2},2]
[null,null,null,null,null,null,null,null,null,null,null,null,null,null,null,null,null,null,null,null,null,null,null,null,null,null,null,null,null,null,null,null,null,null,null,null,null,null,null,null,null,null,null,null,null,null,null,null,null,null,null,null,null,null,null,null,null,null,null,null,null,null,null,null,null,null,null,null,null,null,null,null,null,null,null,null,null,null,null,null,null,null,null,null,null,null,null,null,null,null,null,null,null,null,null,null,null,null,null,null,null,null,null,null,null,null,null,null,null,null,null,null,null,null,null,null,null,null,null,null,null,null,null,null,null,null,null,null,null,null,null,null,null,null,null,null,null,null,null,null,null,null,null,null,null,null,null,null,null,null,null,null,null,null,null,null,null,null,null,null,null,null,null,null,null,null,null,null,null,null,null,null,null,null,null,null,null,null,null,null,null,null,null,null,null,null,null,null,null,null,null,null,null,null,"Stor kvælstof-eftervirkning",14,13,3.3,1,3.3,4,391.35392999999988,null,null,"Stor kvælstof-eftervirkning",{"$f":"'Efterafgrøde beslutningsstøtte'!B38","v":"Vigtigt"},2,2]
[null,null,null,null,null,null,null,null,null,null,null,null,null,null,null,null,null,null,null,null,null,null,null,null,null,null,null,null,null,null,null,null,null,null,null,null,null,null,null,null,null,null,null,null,null,null,null,null,null,null,null,null,null,null,null,null,null,null,null,null,null,null,null,null,null,null,null,null,null,null,null,null,null,null,null,null,null,null,null,null,null,null,null,null,null,null,null,null,null,null,null,null,null,null,null,null,null,null,null,null,null,null,null,null,null,null,null,null,null,null,null,null,null,null,null,null,null,null,null,null,null,null,null,null,null,null,null,null,null,null,null,null,null,null,null,null,null,null,null,null,null,null,null,null,null,null,null,null,null,null,null,null,null,null,null,null,null,null,null,null,null,null,null,null,null,null,null,null,null,null,null,null,null,null,null,null,null,null,null,null,null,null,null,null,null,null,null,null,null,null,null,null,null,null,"Hurtig og dyb rodvækst på lerjord",15,15,1.5,1,1.5,12,7.59375,null,null,"Hurtig og dyb rodvækst på lerjord",{"$f":"'Efterafgrøde beslutningsstøtte'!B34","v":"Ikke vigtigt"},0,0]
[null,null,null,null,null,null,null,null,null,null,null,null,null,null,null,null,null,null,null,null,null,null,null,null,null,null,null,null,null,null,null,null,null,null,null,null,null,null,null,null,null,null,null,null,null,null,null,null,null,null,null,null,null,null,null,null,null,null,null,null,null,null,null,null,null,null,null,null,null,null,null,null,null,null,null,null,null,null,null,null,null,null,null,null,null,null,null,null,null,null,null,null,null,null,null,null,null,null,null,null,null,null,null,null,null,null,null,null,null,null,null,null,null,null,null,null,null,null,null,null,null,null,null,null,null,null,null,null,null,null,null,null,null,null,null,null,null,null,null,null,null,null,null,null,null,null,null,null,null,null,null,null,null,null,null,null,null,null,null,null,null,null,null,null,null,null,null,null,null,null,null,null,null,null,null,null,null,null,null,null,null,null,null,null,null,null,null,null,null,null,null,null,null,null,"Er afgrøden robust mod ukrudtsmidler?",16,20,2,1,2,7,32,null,null,"Er afgrøden robust mod ukrudtsmidler?",{"$f":"'Efterafgrøde beslutningsstøtte'!B27","v":"Ikke vigtigt"},{"$f":"VLOOKUP(GX20,Standard_karakterer,2,FALSE)","v":0},0]
[null,null,null,null,null,null,null,null,null,null,null,null,null,null,null,null,null,null,null,null,null,null,null,null,null,null,null,null,null,null,null,null,null,null,null,null,null,null,null,null,null,null,null,null,null,null,null,null,null,null,null,null,null,null,null,null,null,null,null,null,null,null,null,null,null,null,null,null,null,null,null,null,null,null,null,null,null,null,null,null,null,null,null,null,null,null,null,null,null,null,null,null,null,null,null,null,null,null,null,null,null,null,null,null,null,null,null,null,null,null,null,null,null,null,null,null,null,null,null,null,null,null,null,null,null,null,null,null,null,null,null,null,null,null,null,null,null,null,null,null,null,null,null,null,null,null,null,null,null,null,null,null,null,null,null,null,null,null,null,null,null,null,null,null,null,null,null,null,null,null,null,null,null,null,null,null,null,null,null,null,null,null,null,null,null,null,null,null,null,null,null,null,null,null,"Der findes sorter, der ikke opformerer kålbrok",17,19,1.9,1,1.9,8,24.76099,null,null,"Der findes sorter, der ikke opformerer kålbrok",{"$f":"'Efterafgrøde beslutningsstøtte'!B28","v":"Ikke vigtigt"},{"$f":"VLOOKUP(GX21,Kålbrok_karaktere,2,FALSE)","v":0},0]
[null,null,null,null,null,null,null,null,null,null,null,null,null,null,null,null,null,null,null,null,null,null,null,null,null,null,null,null,null,null,null,null,null,null,null,null,null,null,null,null,null,null,null,null,null,null,null,null,null,null,null,null,null,null,null,null,null,null,null,null,null,null,null,null,null,null,null,null,null,null,null,null,null,null,null,null,null,null,null,null,null,null,null,null,null,null,null,null,null,null,null,null,null,null,null,null,null,null,null,null,null,null,null,null,null,null,null,null,null,null,null,null,null,null,null,null,null,null,null,null,null,null,null,null,null,null,null,null,null,null,null,null,null,null,null,null,null,null,null,null,null,null,null,null,null,null,null,null,null,null,null,null,null,null,null,null,null,null,null,null,null,null,null,null,null,null,null,null,null,null,null,null,null,null,null,null,null,null,null,null,null,null,null,null,null,null,null,null,null,null,null,null,null,null,"Der findes sorter, der er sanerende for roecystenematoder",18,18,1.8,{"$f":"COUNTIF(GP$5:GP$26,GP22)","v":1},{"$f":"IF(GQ22>1,GP22+GO22/1000,GP22)","v":1.8},9,18.895680000000006,null,null,"Der findes sorter, der er sanerende for roecystenematoder",{"$f":"'Efterafgrøde beslutningsstøtte'!B29","v":"Ikke vigtigt"},0,0]
[null,null,null,null,null,null,null,null,null,null,null,null,null,null,null,null,null,null,null,null,null,null,null,null,null,null,null,null,null,null,null,null,null,null,null,null,null,null,null,null,null,null,null,null,null,null,null,null,null,null,null,null,null,null,null,null,null,null,null,null,null,null,null,null,null,null,null,null,null,null,null,null,null,null,null,null,null,null,null,null,null,null,null,null,null,null,null,null,null,null,null,null,null,null,null,null,null,null,null,null,null,null,null,null,null,null," ",null,null,null,null,null,null,null,null,null,null,null,null,null,null,null,null,null,null,null,null,null,null,null,null,null,null,null,null,null,null,null,null,null,null,null,null,null,null,null,null,null,null,null,null,null,null,null,null,null,null,null,null,null,null,null,null,null,null,null,null,null,null,null,null,null,null,null,null,null,null,null,null,null,null,null,null,null,null,null,null,null,null,null,null,null,null,null,"Vinterfast",19,17,1.7,1,{"$f":"IF(GQ23>1,GP23+GO23/1000,GP23)","v":1.7},10,14.198569999999997,null,null,"Tom plads",{"$f":"'Efterafgrøde beslutningsstøtte'!B32","v":"Ikke vigtigt"},{"$f":"VLOOKUP(GX23,Standard_karakterer,2,FALSE)","v":0},{"$f":"GY23","v":0}]
[null,null,null,null,null,null,null,null,null,null,null,null,null,null,null,null,null,null,null,null,null,null,null,null,null,null,null,null,null,null,null,null,null,null,null,null,null,null,null,null,null,null,null,null,null,null,null,null,null,null,null,null,null,null,null,null,null,null,null,null,null,null,null,null,null,null,null,null,null,null,null,null,null,null,null,null,null,null,null,null,null,null,null,null,null,null,null,null,null,null,null,null,null,null,null,null,null,null,null,null,null,null,null,null,null,null,null,null,null,null,null,null,null,null,null,null,null,null,null,null,null,null,null,null,null,null,null,null,null,null,null,null,null,null,null,null,null,null,null,null,null,null,null,null,null,null,null,null,null,null,null,null,null,null,null,null,null,null,null,null,null,null,null,null,null,null,null,null,null,null,null,null,null,null,null,null,null,null,null,null,null,null,null,null,null,null,null,null,null,null,null,null,null,null,"Egen udsæd kan anvendes",20,16,1.6,1,{"$f":"IF(GQ24>1,GP24+GO24/1000,GP24)","v":1.6},11,{"$f":"GP24^$GT$3","v":10.485760000000006},null,null,"Vinterfast",{"$f":"'Efterafgrøde beslutningsstøtte'!B33","v":"Ikke vigtigt"},{"$f":"VLOOKUP(GX24,Udsædskarakterer,2,FALSE)","v":0},{"$f":"GY24","v":0}]
[null,null,null,null,null,null,null,null,null,null,null,null,null,null,null,null,null,null,null,null,null,null,null,null,null,null,null,null,null,null,null,null,null,null,null,null,null,null,null,null,null,null,null,null,null,null,null,null,null,null,null,null,null,null,null,null,null,null,null,null,null,null,null,null,null,null,null,null,null,null,null,null,null,null,null,null,null,null,null,null,null,null,null,null,null,null,null,null,null,null,null,null,null,null,null,null,null,null,null,null,null,null,null,null,null,null,null,null,null,null,null,null,null,null,null,null,null,null,null,null,null,null,null,null,null,null,null,null,null,null,null,null,null,null,null,null,null,null,null,null,null,null,null,null,null,null,null,null,null,null,null,null,null,null,null,null,null,null,null,null,null,null,null,null,null,null,null,null,null,null,null,null,null,null,null,null,null,null,null,null,null,null,null,null,null,null,null,null,null,null,null,null,null,null,"Tiebreak",21,1,0.1,1,{"$f":"IF(GQ25>1,GP25+GO25/1000,GP25)","v":0.1},23,1.0000000000000006E-5,null,null,"Egen udsæd kan anvendes4)","Hovdespørgsmål",0,{"$f":"GY25","v":0}]
[null,null,null,null,null,null,null,null,null,null,null,null,null,null,null,null,null,null,null,null,null,null,null,null,null,null,null,null,null,null,null,null,null,null,null,null,null,null,null,null,null,null,null,null,null,null,null,null,null,null,null,null,null,null,null,null,null,null,null,null,null,null,null,null,null,null,null,null,null,null,null,null,null,null,null,null,null,null,null,null,null,null,null,null,null,null,null,null,null,null,null,null,null,null,null,null,null,null,null,null,null,null,null,null,null,null,null,null,null,null,null,null,null,null,null,null,null,null,null,null,null,null,null,null,null,null,null,null,null,null,null,null,null,null,null,null,null,null,null,null,null,null,null,null,null,null,null,null,null,null,null,null,null,null,null,null,null,null,null,null,null,null,null,null,null,null,null,null,null,null,null,null,null,null,null,null,null,null,null,null,null,null,null,null,null,null,null,null,null,null,null,null,null,null,"Kommentare ang. Ukrudt",22,null,null,null,null,null,null,null,null,"Tiebreak","Hovdespørgsmål",0,{"$f":"GY26","v":0}]
[null,null,null,null,null,null,null,null,null,null,null,null,null,null,null,null,null,null,null,null,null,null,null,null,null,null,null,null,null,null,null,null,null,null,null,null,null,null,null,null,null,null,null,null,null,null,null,null,null,null,null,null,null,null,null,null,null,null,null,null,null,null,null,null,null,null,null,null,null,null,null,null,null,null,null,null,null,null,null,null,null,null,null,null,null,null,null,null,null,null,null,null,null,null,null,null,null,null,null,null,null,null,null,null,null,null,null,null,null,null,null,null,null,null,null,null,null,null,null,null,null,null,null,null,null,null,null,null,null,null,null,null,null,null,null,null,null,null,null,null,null,null,null,null,null,null,null,null,null,null,null,null,null,null,null,null,null,null,null,null,null,null,null,null,null,null,null,null,null,null,null,null,null,null,null,null,null,null,null,null,null,null,null,null,null,null,null,null,null,null,null,null,null,null,null,23,null,null,null,null,null,null,null,null,null,"Hovdespørgsmål",0,0]
[null,null,null,null,null,null,null,null,null,null,null,null,null,null,null,null,null,null,null,null,null,null,null,null,null,null,null,null,null,null,null,null,null,null,null,null,null,null,null,null,null,null,null,null,null,null,null,null,null,null,null,null,null,null,null,null,null,null,null,null,null,null,null,null,null,null,null,null,null,null,null,null,null,null,null,null,null,null,null,null,null,null,null,null,null,null,null,null,null,null,null,null,null,null,null,null,null,null,null,null,null,null,null,null,null,null,null,null,null,null,null,null,null,null,null,null,null,null,null,null,null,null,null,null,null,null,null,null,null,null,null,null,null,null,null,null,null,null,null,null,null,null,null,null,null,null,null,null,null,null,null,null,null,null,null,null,null,null,null,null,null,null,null,null,null,null,null,null,null,null,null,null,null,null,null,null,null,null,null,null,null,null,null,null,null,null,null,null,null,null,null,null,null,null,"Seneste såtidspunkt",24,23,{"$f":"GZ28+GO28/10","v":52.3},{"$f":"COUNTIF(GP$5:GP$26,GP28)","v":0},{"$f":"IF(GQ28>1,GP28+GO28/1000,GP28)","v":52.3},{"$f":"IF(_xlfn.RANK.EQ(GR28,$GR$5:$GR$37,0)>GS$5,(_xlfn.RANK.EQ(GR28,$GR$5:$GR$37,0)+1),(_xlfn.RANK.EQ(GR28,$GR$5:$GR$37,0)))","v":1},{"$f":"GP28^$GT$3","v":391298735.38842988},null,null,"Seneste såtidspunkt","Oplysning",50,50]
[null,null,null,null,null,null,null,null,null,null,null,null,null,null,null,null,null,null,null,null,null,null,null,null,null,null,null,null,null,null,null,null,null,null,null,null,null,null,null,null,null,null,null,null,null,null,null,null,null,null,null,null,null,null,null,null,null,null,null,null,null,null,null,null,null,null,null,null,null,null,null,null,null,null,null,null,null,null,null,null,null,null,null,null,null,null,null,null,null,null,null,null,null,null,null,null,null,null,null,null,null,null,null,null,null,null,null,null,null,null,null,null,null,null,null,null,null,null,null,null,null,null,null,null,null,null,null,null,null,null,null,null,null,null,null,null,null,null,null,null,null,null,null,null,null,null,null,null,null,null,null,null,null,null,null,null,null,null,null,null,null,null,null,null,null,null,null,null,null,null,null,null,null,null,null,null,null,null,null,null,null,null,null,null,null,null,null,null,null,null,null,null,null,null,null,25,null,null,null,null,null,null,null,null,null,"Hovdespørgsmål",0,0]
[null,null,null,null,null,null,null,null,null,null,null,null,null,null,null,null,null,null,null,null,null,null,null,null,null,null,null,null,null,null,null,null,null,null,null,null,null,null,null,null,null,null,null,null,null,null,null,null,null,null,null,null,null,null,null,null,null,null,null,null,null,null,null,null,null,null,null,null,null,null,null,null,null,null,null,null,null,null,null,null,null,null,null,null,null,null,null,null,null,null,null,null,null,null,null,null,null,null,null,null,null,null,null,null,null,null,null,null,null,null,null,null,null,null,null,null,null,null,null,null,null,null,null,null,null,null,null,null,null,null,null,null,null,null,null,null,null,null,null,null,null,null,null,null,null,null,null,null,null,null,null,null,null,null,null,null,null,null,null,null,null,null,null,null,null,null,null,null,null,null,null,null,null,null,null,null,null,null,null,null,null,null,null,null,null,null,null,null,null,null,null,null,null,null,null,26,null,null,null,null,null,null,null,null,null,"Hovdespørgsmål",0,0]
[null,null,null,null,null,null,null,null,null,null,null,null,null,null,null,null,null,null,null,null,null,null,null,null,null,null,null,null,null,null,null,null,null,null,null,null,null,null,null,null,null,null,null,null,null,null,null,null,null,null,null,null,null,null,null,null,null,null,null,null,null,null,null,null,null,null,null,null,null,null,null,null,null,null,null,null,null,null,null,null,null,null,null,null,null,null,null,null,null,null,null,null,null,null,null,null,null,null,null,null,null,null,null,null,null,null,null,null,null,null,null,null,null,null,null,null,null,null,null,null,null,null,null,null,null,null,null,null,null,null,null,null,null,null,null,null,null,null,null,null,null,null,null,null,null,null,null,null,null,null,null,null,null,null,null,null,null,null,null,null,null,null,null,null,null,null,null,null,null,null,null,null,null,null,null,null,null,null,null,null,null,null,null,null,null,null,null,null,null,null,null,null,null,null,null,27,null,null,null,null,null,null,null,null,null,"Hovdespørgsmål",0,0]
[null,null,null,null,null,8,9,10,11,12,13,14,15,16,17,18,19,20,21,22,23,24,25,null,27,28,29,30,31,7,null,null,null,null,null,null,35,null,null,null,null,null,null,null,null,null,null,null,null,null,null,null,null,null,null,null,null,null,null,null,null,null,null,null,null,null,null,null,null,null,null,null,null,null,null,null,null,null,null,null,null,null,null,null,null,null,null,null,null,null,null,null,null,null,null,null,null,null,null,null,null,null,null,null,null,null,null,null,null,null,null,null,null,null,null,null,null,null,null,null,null,null,null,null,null,null,null,null,null,null,null,null,null,null,null,null,null,null,null,null,null,null,null,null,null,null,null,null,null,null,null,null,null,null,null,null,null,null,null,null,null,null,null,null,null,null,null,null,null,null,null,null,null,null,null,null,null,null,null,null,null,null,null,null,null,null,null,null,null,null,null,null,null,null,null,28,null,null,null,null,null,null,null,null,null,"Hovdespørgsmål",0,0]
[null,null,null,null,null,"Pris","Pligtig efterafgrøde","Pligtig mellemafgrøde","MFO-efterafgrøde i blanding2)","MFO-udlæg3)","Miljø-efterafgrøder","Frivillig efterafgrøde","Grønne marker (2,3 DE-brug)","Egnet til udlæg efterår i vinterkorn","Egnet til udlæg forår","Egnet til udsåning 2-3 uger før høst","Egnet til udsåning efter tidlig høst (10. august)","Kvælstoffikserende","Stor kvælstof-eftervirkning","Hurtig og dyb rodvækst på lerjord","Er afgrøden robust mod ukrudtsmidler?","Der findes sorter, der ikke opformerer kålbrok","Der findes sorter, der er sanerende for roecystenematoder",null,"Vinterfast","Egen udsæd kan anvendes4)","Tiebreak","Kommentare ang. ukrudt","Nettoomkostninger","Seneste såtidspunkt Pligtige efterafgrøder og MFO ",null,null,null,null,null,null,"Nettoomkostninger",null,null,null,null,null,null,null,null,null,null,null,null,null,null,null,null,null,null,null,null,null,null,null,null,null,null,null,null,null,null,null,null,null,null,null,null,null,null,null,null,null,null,null,null,null,null,null,null,null,null,null,null,null,null,null,null,null,null,null,null,null,null,null,null,null,null,null,null,null,null,null,null,null,null,null,null,null,null,null,null,null,null,null,null,null,null,null,null,null,null,null,null,null,null,null,null,null,null,null,null,null,null,null,null,null,null,null,null,null,null,null,null,null,null,null,null,null,null,null,null,null,null,null,null,null,null,null,null,null,null,null,null,null,null,null,null,null,null,null,null,null,null,null,null,null,null,null,null,null,null,null,null,null,null,null,null,null,null,29,null,null,null,null,null,null,null,null,null,"Hovdespørgsmål",0,0]
[null,null,null,null,null,{"$f":"F33=F40","v":false},true,true,true,{"$f":"J33=J40","v":false},true,true,true,true,true,false,true,true,true,true,true,false,true,null,{"$f":"Y33=Y40","v":true},false,{"$f":"AA33=AA40","v":true},{"$f":"AB33=AB40","v":false},{"$f":"AC33=AC40","v":false},false,null,null,null,null,null,null,{"$f":"AK33=AK40","v":false},null,null,null,null,null,null,null,null,null,null,null,null,null,null,null,null,null,null,null,null,null,null,null,null,null,null,null,null,null,null,null,null,null,null,null,null,null,null,null,null,null,null,null,null,null,null,null,null,null,null,null,null,null,null,null,null,null,null,null,null,null,null,null,null,null,null,null,null,null,null,null,null,null,null,null,null,null,null,null,null,null,null,null,null,null,null,null,null,null,null,null,null,null,null,null,null,null,null,null,null,null,null,null,null,null,null,null,null,null,null,null,null,null,null,null,null,null,null,null,null,null,null,null,null,null,null,null,null,null,null,null,null,null,null,null,null,null,null,null,null,null,null,null,null,null,null,null,null,null,null,null,null,null,null,null,null,null,null,30,null,null,null,null,null,null,null,null,null,"Hovdespørgsmål",0,0]
[null,null,null,null,null,null,null,null,null,null,null,null,null,null,null,null,null,null,null,null,null,null,null,null,null,null,null,null,null,null,null,null,null,null,null,null,null,null,null,null,null,null,null,null,null,null,null,null,null,null,null,null,null,null,null,null,null,null,null,null,null,null,null,null,null,null,null,null,null,null,null,null,null,null,null,null,null,null,null,null,null,null,null,null,null,null,null,null,null,null,null,null,null,null,null,null,null,null,null,null,null,null,null,null,null,null,null,null,null,null,null,null,null,null,null,null,null,null,null,null,null,null,null,null,null,null,null,null,null,null,null,null,null,null,null,null,null,null,null,null,null,null,null,null,null,null,null,null,null,null,null,null,null,null,null,null,null,null,null,null,null,null,null,null,null,null,null,null,null,null,null,null,null,null,null,null,null,null,null,null,null,null,null,null,null,null,null,null,null,null,null,null,null,null,null,31,null,null,null,null,null,null,null,null,null,"Hovdespørgsmål",0,0]
[null,null,null,null,null,null,null,null,null,null,null,null,null,null,null,null,null,null,null,null,null,null,null,null,null,null,null,null,null,null,null,null,null,null,null,null,null,null,null,null,null,null,null,null,null,null,null,null,null,null,null,null,null,null,null,null,null,null,null,null,null,null,null,null,null,null,null,null,null,null,null,null,null,null,null,null,null,null,null,null,null,null,null,null,null,null,null,null,null,null,null,null,null,null,null,null,null,null,null,null,null,null,null,null,null,null,null,null,null,null,null,null,null,null,null,null,null,null,null,null,null,null,null,null,null,null,null,null,null,null,null,null,null,null,null,null,null,null,null,null,null,null,null,null,null,null,null,null,null,null,null,null,null,null,null,null,null,null,"Pil kriterie afgrøder ud",null,null,null,null,null,null,null,null,null,null,null,null,null,null,null,null,null,null,null,null,null,null,null,null,null,null,null,null,null,null,null,null,null,null,null,null,32,null,null,null,null,null,null,null,null,null,"Hovdespørgsmål",0,0]
[null,null,null,null,null,null,null,null,null,null,null,null,null,null,null,null,null,null,null,null,null,null,null,null,null,null,null,"Plads til fremtidige karaktere",null,null,null,null,null,null,null,null,null,null,null,null,null,null,null,null,null,null,null,null,null,null,null,null,null,null,null,null,null,null,null,null,null,null,null,null,null,null,null,null,null,null,null,null,null,null,null,null,null,null,null,null,null,null,null,null,null,null,null,null,null,null,null,null,null,null,null,null,null,null,null,null,null,null,null,null,null,null,null,null,null,null,null,null,null,null,null,null,null,null,null,null,null,null,null,null,null,null,null,null,null,null,null,null,null,null,null,null,null,null,null,null,null,null,null,null,null,null,null,null,null,null,null,null,null,null,null,null,null,null,"Lav en måde at breake ties",null,null,null,null,null,null,null,null,null,null,null,null,null,null,null,null,null,null,null,null,null,null,null,null,null,null,null,null,null,null,null,null,null,null,null,null,33,"Etableringsomkostninger (ikke prioriteret efter)",null,null,null,{"$f":"GS5+1","v":6},null,null,null,null,"Hovdespørgsmål",0,0]
[null,null,null,null,null,8,9,10,11,12,13,14,15,16,17,18,19,20,21,22,23,24,25,26,27,28,29,30,31,7,null,null,null,null,null,null,null,31,null,null,null,null,null,null,null,null,null,null,null,null,null,null,null,null,null,null,null,null,null,null,null,null,null,null,null,null,null,null,null,null,null,null,null,null,null,null,null,null,null,null,null,null,null,null,null,null,null,null,null,null,null,null,null,null,null,null,null,null,null,null,null,null,null,null,null,null,null,null,null,null,null,null,null,null,null,null,null,null,null,null,null,"Kvadrat"]
[null,null,null,null,null,1,2,3,4,5,6,7,8,9,10,11,12,13,14,15,16,17,18,19,20,21,22,23,24,25,26,27,28,29,30,31,32,33,34,35,36,37,38,39,40,null,null,null,null,null,1,2,3,4,5,6,7,8,9,10,11,12,13,14,15,16,17,18,19,20,21,22,23,24,25,26,27,28,29,30,31,32,33,null,null,{"$f":"AY39","v":1},{"$f":"AZ39","v":2},3,4,5,6,7,8,9,10,11,12,13,14,15,16,17,18,19,20,21,22,23,24,25,26,27,28,29,{"$f":"CB39","v":30},{"$f":"CC39","v":31},{"$f":"CD39","v":32},{"$f":"CE39","v":33},null,null,null,1,2,3,4,5,6,7,8,9,10,11,12,13,14,15,16,17,18,19,20,21,22,23,24,25,26,27,28,29,30,31,32,33,null,null,null,1,2,3,4,5,6,7,8,9,10,11,12,13,14,15,16,17,18,19,20,21,22,23,24,25,26,27,28,29,30,31,32,33,"Scoreberegning",null,null,null,null,null,null,null,null,null,null,null,null,null,null,null,null,null,{"$f":"INDEX($AY39:$DP39,HA$12)","v":24},null,null,null,null,null,null,null,null,null,null,null,null,null,null,null,null,null,null,null,null,null,null,null,null,null,null,null,null,null,null,null,{"$f":"INDEX($AY39:$DP39,HB$12)","v":12}]
["Index","Efterafgrøde","Afgrøde","Tidspunkt","Link","Bruttoomkostninger","Pligtig efterafgrøde","Pligtig mellemafgrøde","MFO-efterafgrøde i blanding2)","MFO-udlæg","Miljø-efterafgrøder","Frivillig efterafgrøde","Grønne marker (2,3 DE-brug)","Egnet til udlæg efterår i vinterkorn","Egnet til udlæg forår","Egnet til udsåning ved sidste radrensning","Egnet til udsåning efter tidlig høst (10. august)","Kvælstoffikserende","Stor kvælstof-eftervirkning","Hurtig og dyb rodvækst på lerjord","Er afgrøden robust mod ukrudtsmidler?","Afgrøden opformere kålbrok","Der findes sorter, der er sanerende for roecystenematoder","Tom plads","Vinterfast","Egen udsæd kan anvendes","Tiebreak","Kommentare til ukrudt",null,"Seneste lovlige såtidspunkt",null,null,null,null,null,null,null,"Nettoomkostninger",null,null,null,null,null,null,null,null,null,null,null,null,{"$f":"F40","v":"Bruttoomkostninger"},"Pligtig efterafgrøde","Pligtig mellemafgrøde","MFO-efterafgrøde i blanding2)","MFO-udlæg","Miljø-efterafgrøder","Frivillig efterafgrøde","Grønne marker (2,3 DE-brug)","Egnet til udlæg efterår i vinterkorn","Egnet til udlæg forår","Egnet til udsåning ved sidste radrensning","Egnet til udsåning efter tidlig høst (10. august)","Kvælstoffikserende","Stor kvælstof-eftervirkning","Hurtig og dyb rodvækst på lerjord","Er afgrøden robust mod ukrudtsmidler?","Afgrøden opformere kålbrok",{"$f":"W40","v":"Der findes sorter, der er sanerende for roecystenematoder"},{"$f":"Y40","v":"Vinterfast"},{"$f":"Z40","v":"Egen udsæd kan anvendes"},"Tiebreak","Kommentare ang. Ukrudt",null,{"$f":"AD40","v":"Seneste lovlige såtidspunkt"},null,null,null,null,null,null,null,null,"Nettoomkostninger",null,null,{"$f":"AY40","v":"Bruttoomkostninger"},"Pligtig efterafgrøde","Pligtig mellemafgrøde","MFO-efterafgrøde i blanding2)","MFO-udlæg","Miljø-efterafgrøder","Frivillig efterafgrøde","Grønne marker (2,3 DE-brug)","Egnet til udlæg efterår i vinterkorn","Egnet til udlæg forår","Egnet til udsåning ved sidste radrensning","Egnet til udsåning efter tidlig høst (10. august)","Kvælstoffikserende","Stor kvælstof-eftervirkning","Hurtig og dyb rodvækst på lerjord","Er afgrøden robust mod ukrudtsmidler?","Afgrøden opformere kålbrok","Der findes sorter, der er sanerende for roecystenematoder","Vinterfast","Egen udsæd kan anvendes","Tiebreak","Kommentare ang. Ukrudt",0,{"$f":"AD40","v":"Seneste lovlige såtidspunkt"},null,null,null,null,null,null,null,null,"Nettoomkostninger",null,null,null,{"$f":"AY40","v":"Bruttoomkostninger"},{"$f":"AZ40","v":"Pligtig efterafgrøde"},"Pligtig mellemafgrøde","MFO-efterafgrøde i blanding2)","MFO-udlæg","Miljø-efterafgrøder","Frivillig efterafgrøde","Grønne marker (2,3 DE-brug)","Egnet til udlæg efterår i vinterkorn","Egnet til udlæg forår","Egnet til udsåning ved sidste radrensning","Egnet til udsåning efter tidlig høst (10. august)","Kvælstoffikserende","Stor kvælstof-eftervirkning","Hurtig og dyb rodvækst på lerjord","Er afgrøden robust mod ukrudtsmidler?","Afgrøden opformere kålbrok","Der findes sorter, der er sanerende for roecystenematoder","Vinterfast","Egen udsæd kan anvendes",{"$f":"BS40","v":"Tiebreak"},null,null,null,null,null,null,null,null,null,null,null,null,null,null,null,{"$f":"DR40","v":"Bruttoomkostninger"},{"$f":"DS40","v":"Pligtig efterafgrøde"},"Pligtig mellemafgrøde","MFO-efterafgrøde i blanding2)","MFO-udlæg","Miljø-efterafgrøder","Frivillig efterafgrøde","Grønne marker (2,3 DE-brug)","Egnet til udlæg efterår i vinterkorn","Egnet til udlæg forår","Egnet til udsåning ved sidste radrensning","Egnet til udsåning efter tidlig høst (10. august)","Kvælstoffikserende","Stor kvælstof-eftervirkning","Hurtig og dyb rodvækst på lerjord","Er afgrøden robust mod ukrudtsmidler?","Afgrøden opformere kålbrok","Der findes sorter, der er sanerende for roecystenematoder",{"$f":"EJ40","v":"Vinterfast"},{"$f":"EK40","v":"Egen udsæd kan anvendes"},{"$f":"EL40","v":"Tiebreak"},0,{"$f":"EN40","v":0},0,0,0,0,0,0,0,0,0,0,"Sumprodukt vægt og Zscore","Score","Tiebreak","Score corected for ties","Placering",null,null,null,null,null,"Check for ties and all places","Place",null,"Plads",null,null,null,"Efterafgrøde",{"$f":"INDEX($AY40:$CE40,HA$12)","v":"Seneste lovlige såtidspunkt"},"Egnet til udsåning efter tidlig høst (10. august)","Kvælstoffikserende","Stor kvælstof-eftervirkning","Bruttoomkostninger","Nettoomkostninger","Er afgrøden robust mod ukrudtsmidler?",{"$f":"INDEX($AY40:$CE40,HH$12)","v":"Afgrøden opformere kålbrok"},"Der findes sorter, der er sanerende for roecystenematoder","Vinterfast","Egen udsæd kan anvendes","Hurtig og dyb rodvækst på lerjord","Pligtig efterafgrøde","Pligtig mellemafgrøde","MFO-efterafgrøde i blanding2)","MFO-udlæg","Miljø-efterafgrøder","Frivillig efterafgrøde","Grønne marker (2,3 DE-brug)","Egnet til udlæg efterår i vinterkorn","Egnet til udlæg forår",null,"Seneste såtidspunkt",null,null,null,null,null,null,null,null,null,null,"Vejledning","Kommentare ang ukrudt"]
[1,"Alm. rajgræs, dipl.",null,null,{"$f":"IF('Efterafgrøde beslutningsstøtte'!A$7<>\"Pligtig mellemafgrøde\",HYPERLINK(\"https://dyrk-plant.dlbr.dk/Web/(S(ikevr3oqnx5oe2t5cyfyknyq))/forms/Main.aspx?page=Vejledning&cropID=226\",\"Efterafgrøder\"),HYPERLINK(\"https://dyrk-plant.dlbr.dk/Web/(S(0x3ftyiaahcpttq0ljebuany))/forms/Main.aspx?page=Vejledning&cropID=238\",\"Mellemafgrøder\"))","v":"Efterafgrøder"},{"$f":"VLOOKUP($A41,Karaktermatrice,F$38,FALSE)","v":-185},{"$f":"VLOOKUP($A41,Karaktermatrice,G$38,FALSE)","v":1},{"$f":"VLOOKUP($A41,Karaktermatrice,H$38,FALSE)","v":0},1,1,{"$f":"VLOOKUP($A41,Karaktermatrice,K$38,FALSE)","v":1},{"$f":"VLOOKUP($A41,Karaktermatrice,L$38,FALSE)","v":1},1,{"$f":"VLOOKUP($A41,Karaktermatrice,N$38,FALSE)","v":0},3,{"$f":"VLOOKUP($A41,Karaktermatrice,P$38,FALSE)","v":3},2,0,1,0,2,3,{"$f":"VLOOKUP($A41,Karaktermatrice,W$38,FALSE)","v":0},0,3,0,1,0,null,{"$f":"VLOOKUP($A41,Karaktermatrice,AD$38,FALSE)","v":"1.august"},null,null,null,null,null,null,null,{"$f":"VLOOKUP($A41,Karaktermatrice,AL$38,FALSE)","v":"-"},null,null,null,null,null,null,null,null,null,null,null,null,{"$f":"F41","v":-185},{"$f":"G41","v":1},0,1,1,1,1,1,0,3,3,2,0,1,0,2,3,0,{"$f":"Y41","v":3},{"$f":"Z41","v":0},1,{"$f":"AB41","v":0},null,{"$f":"AD41","v":"1.august"},null,null,null,null,null,null,null,null,{"$f":"AL41","v":"-"},null,null,{"$f":"IF(AY41=\"xx\",\"xx\",ROUND(AY41,0))","v":-185},{"$f":"IF(AZ41=0,\"Nej\",IF(AZ41=1,\"Ja\",\"xx\"))","v":"Ja"},"Nej","Ja","Ja","Ja","Ja","Ja",{"$f":"IF(BG41=0,\"Nej\",IF(BG41=1,\"Brugbar\",IF(BG41=2,\"God\",IF(BG41=3,\"Meget god\",\"xx\"))))","v":"Nej"},{"$f":"IF(BH41=0,\"Nej\",IF(BH41=1,\"Brugbar\",IF(BH41=2,\"God\",IF(BH41=3,\"Meget god\",\"xx\"))))","v":"Meget god"},{"$f":"IF(BI41=0,\"Nej\",IF(BI41=1,\"Brugbar\",IF(BI41=2,\"God\",IF(BI41=3,\"Meget god\",\"xx\"))))","v":"Meget god"},{"$f":"IF(BJ41=0,\"Nej\",IF(BJ41=1,\"Brugbar\",IF(BJ41=2,\"God\",IF(BJ41=3,\"Meget god\",\"xx\"))))","v":"God"},{"$f":"IF(BK41=0,\"Nej\",IF(BK41=1,\"Ja\",\"xx\"))","v":"Nej"},{"$f":"IF(BL41=0,\"Lille\",IF(BL41=1,\"Middel\",IF(BL41=2,\"Over middel\",IF(BL41=3,\"Stor\",\"xx\"))))","v":"Middel"},{"$f":"IF(BM41=0,\"Nej\",IF(BM41=1,\"Rimelig\",IF(BM41=2,\"God\",IF(BM41=3,\"Meget god\",\"xx\"))))","v":"Nej"},{"$f":"IF(BN41=0,\"Nej\",IF(BN41=1,\"Mod visse\",IF(BN41=2,\"Mod mange\",IF(BN41=3,\"Mod de fleste\",\"xx\"))))","v":"Mod mange"},{"$f":"IF(BO41=0,\"Altid\",IF(BO41=1,\"I nogen grad\",IF(BO41=2,\"I mindre grad\",IF(BO41=3,\"Aldrig\",\"xx\"))))","v":"Aldrig"},{"$f":"IF(BP41=0,\"Nej\",IF(BP41=1,\"Få\",IF(BP41=2,\"Nogle\",IF(BP41=3,\"Mange\",\"xx\"))))","v":"Nej"},{"$f":"IF(BQ41=0,\"Udvintrer\",IF(BQ41=1,\"Dårlig\",IF(BQ41=2,\"God\",IF(BQ41=3,\"Meget god\",\"xx\"))))","v":"Meget god"},{"$f":"IF(BR41=0,\"Nej\",IF(BR41=1,\"Ja\",\"xx\"))","v":"Nej"},null,{"$f":"BT41","v":0},null,{"$f":"BV41","v":"1.august"},null,null,null,null,null,null,null,null,{"$f":"CE41","v":"-"},null,null,null,{"$f":"IF(AY41<>\"xx\",AY41^2,\"xx\")","v":34225},{"$f":"IF(AZ41<>\"xx\",AZ41^2,\"xx\")","v":1},{"$f":"IF(BA41<>\"xx\",BA41^2,\"xx\")","v":0},{"$f":"IF(BB41<>\"xx\",BB41^2,\"xx\")","v":1},{"$f":"IF(BC41<>\"xx\",BC41^2,\"xx\")","v":1},{"$f":"IF(BD41<>\"xx\",BD41^2,\"xx\")","v":1},{"$f":"IF(BE41<>\"xx\",BE41^2,\"xx\")","v":1},{"$f":"IF(BF41<>\"xx\",BF41^2,\"xx\")","v":1},{"$f":"IF(BG41<>\"xx\",BG41^2,\"xx\")","v":0},{"$f":"IF(BH41<>\"xx\",BH41^2,\"xx\")","v":9},{"$f":"IF(BI41<>\"xx\",BI41^2,\"xx\")","v":9},{"$f":"IF(BJ41<>\"xx\",BJ41^2,\"xx\")","v":4},{"$f":"IF(BK41<>\"xx\",BK41^2,\"xx\")","v":0},{"$f":"IF(BL41<>\"xx\",BL41^2,\"xx\")","v":1},{"$f":"IF(BM41<>\"xx\",BM41^2,\"xx\")","v":0},{"$f":"IF(BN41<>\"xx\",BN41^2,\"xx\")","v":4},{"$f":"IF(BO41<>\"xx\",BO41^2,\"xx\")","v":9},{"$f":"IF(BP41<>\"xx\",BP41^2,\"xx\")","v":0},{"$f":"IF(BQ41<>\"xx\",BQ41^2,\"xx\")","v":9},{"$f":"IF(BQ41<>\"xx\",BQ41^2,\"xx\")","v":9},{"$f":"IF(BS41<>\"xx\",BS41^2,\"xx\")","v":1},null,null,null,null,null,null,null,null,null,null,null,null,null,null,null,{"$f":"IF(DR41=\"xx\",\"xx\",(AY41-AY$7)/DR$8)","v":1.4211359970233211},{"$f":"IF(DS41=\"xx\",\"xx\",(AZ41-AZ$7)/DS$8)","v":0},{"$f":"IF(DT41=\"xx\",\"xx\",(BA41-BA$7)/DT$8)","v":-0.36514837167011077},{"$f":"IF(DU41=\"xx\",\"xx\",(BB41-BB$7)/DU$8)","v":0.83666002653407556},{"$f":"IF(DV41=\"xx\",\"xx\",(BC41-BC$7)/DV$8)","v":1.5491933384829666},{"$f":"IF(DW41=\"xx\",\"xx\",(BD41-BD$7)/DW$8)","v":0},{"$f":"IF(DX41=\"xx\",\"xx\",(BE41-BE$7)/DX$8)","v":0},{"$f":"IF(DY41=\"xx\",\"xx\",(BF41-BF$7)/DY$8)","v":0},{"$f":"IF(DZ41=\"xx\",\"xx\",(BG41-BG$7)/DZ$8)","v":0},{"$f":"IF(EA41=\"xx\",\"xx\",(BH41-BH$7)/EA$8)","v":1.7717591356565963},{"$f":"IF(EB41=\"xx\",\"xx\",(BI41-BI$7)/EB$8)","v":1.6710199556880498},{"$f":"IF(EC41=\"xx\",\"xx\",(BJ41-BJ$7)/EC$8)","v":-0.85125653075874907},{"$f":"IF(ED41=\"xx\",\"xx\",(BK41-BK$7)/ED$8)","v":-0.7385489458759964},{"$f":"IF(EE41=\"xx\",\"xx\",(BL41-BL$7)/EE$8)","v":-1.1731769201708258},{"$f":"IF(EF41=\"xx\",\"xx\",(BM41-BM$7)/EF$8)","v":-1.0169503597462535},{"$f":"IF(EG41=\"xx\",\"xx\",(BN41-BN$7)/EG$8)","v":-4.8564293117863019E-2},{"$f":"IF(EH41=\"xx\",\"xx\",(BO41-BO$7)/EH$8)","v":0.54173633888596151},{"$f":"IF(EI41=\"xx\",\"xx\",(BP41-BP$7)/EI$8)","v":-0.36514837167011077},{"$f":"IF(EJ41=\"xx\",\"xx\",(BQ41-BR$7)/EK$8)","v":1.0271051820261909},{"$f":"IF(EK41=\"xx\",\"xx\",(BQ41-BS$7)/EL$8)","v":3.1518680652066458},{"$f":"IF(EL41=\"xx\",\"xx\",(BS41-BT$7)/EM$8)","v":-1.6175655639652948},null,null,null,null,null,null,null,null,null,null,null,null,{"$f":"SUMPRODUCT($FB$11:$FV$11,FB41:FV41)","v":-341828.6041051182},{"$f":"IF(FB41=\"xx\",\"xx\",GI41)","v":-341828.6041051182},{"$f":"IF(GJ41=\"xx\",\"xx\",IF(COUNTIF($GJ$41:$GJ$74,GJ41)>1,RANK(AL41,AL$41:AL$70,1)/1000,0))","v":0},{"$f":"IF(OR(GJ41=\"xx\",GK41=\"xx\"),\"xx\",GK41+GJ41)","v":-341828.6041051182},{"$f":"IF(GL41=\"xx\",99,RANK(GL41,$GL$41:$GL$112))","v":15},null,null,null,null,null,{"$f":"COUNTIF($GM$41:$GM$112,GV41)","v":1},{"$f":"IF(GS41>0,MATCH(GV41,$GM$41:$GM$112,0),\"xx\")","v":33},null,1,null,null,null,{"$f":"IF($GS41=0,\"xx\",INDEX($B$41:$B$112,$GT41))","v":"Vintervikke/vinterrug"},{"$f":"IF($GS41=0,\"xx\",INDEX($CH$41:$DN$112,$GT41,HA$12))","v":"20. august"},{"$f":"IF($GS41=0,\"xx\",INDEX($CH$41:$DN$112,$GT41,HB$12))","v":"Meget god"},{"$f":"IF($GS41=0,\"xx\",INDEX($CH$41:$DN$112,$GT41,HC$12))","v":"Ja"},{"$f":"IF($GS41=0,\"xx\",INDEX($CH$41:$DN$112,$GT41,HD$12))","v":"Stor"},-969,-529,"Mod de fleste","Aldrig","Nej","Meget god","Nej","Nej","Ja","Nej","Nej","Ja","Ja","Ja","Ja","Nej",{"$f":"IF($GS41=0,\"xx\",INDEX($CH$41:$DN$112,$GT41,HU$12))","v":"Nej"},null,{"$f":"IF($GS41=0,\"xx\",INDEX($CH$41:$DN$112,$GT41,HW$12))","v":0},null,null,null,null,null,null,null,null,null,null,{"$f":"IF($GS41=0,\"xx\",INDEX($E$41:$E$127,$GT41))","v":"Efterafgrøder"}]
[2,"Blanding uden bælgsæd overvintrene",null,null,{"$f":"IF('Efterafgrøde beslutningsstøtte'!A$7<>\"Pligtig mellemafgrøde\",HYPERLINK(\"https://dyrk-plant.dlbr.dk/Web/(S(ikevr3oqnx5oe2t5cyfyknyq))/forms/Main.aspx?page=Vejledning&cropID=226\",\"Efterafgrøder\"),HYPERLINK(\"https://dyrk-plant.dlbr.dk/Web/(S(0x3ftyiaahcpttq0ljebuany))/forms/Main.aspx?page=Vejledning&cropID=238\",\"Mellemafgrøder\"))","v":"Efterafgrøder"},"xx","xx","xx","xx","xx","xx","xx","xx","xx","xx","xx","xx","xx","xx","xx","xx","xx","xx","xx","xx","xx","xx","xx",null,"xx",null,null,null,null,null,null,null,"xx",null,null,null,null,null,null,null,null,null,null,null,null,"xx","xx","xx","xx","xx","xx","xx","xx","xx","xx","xx","xx","xx","xx","xx","xx","xx","xx",{"$f":"Y42","v":"xx"},"xx","xx","xx",null,"xx",null,null,null,null,null,null,null,null,{"$f":"AL42","v":"xx"},null,null,{"$f":"IF(AY42=\"xx\",\"xx\",ROUND(AY42,0))","v":"xx"},{"$f":"IF(AZ42=0,\"Nej\",IF(AZ42=1,\"Ja\",\"xx\"))","v":"xx"},{"$f":"IF(BA42=0,\"Nej\",IF(BA42=1,\"Ja\",\"xx\"))","v":"xx"},{"$f":"IF(BB42=0,\"Nej\",IF(BB42=1,\"Ja\",\"xx\"))","v":"xx"},{"$f":"IF(BC42=0,\"Nej\",IF(BC42=1,\"Ja\",\"xx\"))","v":"xx"},{"$f":"IF(BD42=0,\"Nej\",IF(BD42=1,\"Ja\",\"xx\"))","v":"xx"},{"$f":"IF(BE42=0,\"Nej\",IF(BE42=1,\"Ja\",\"xx\"))","v":"xx"},{"$f":"IF(BF42=0,\"Nej\",IF(BF42=1,\"Ja\",\"xx\"))","v":"xx"},{"$f":"IF(BG42=0,\"Nej\",IF(BG42=1,\"Brugbar\",IF(BG42=2,\"God\",IF(BG42=3,\"Meget god\",\"xx\"))))","v":"xx"},{"$f":"IF(BH42=0,\"Nej\",IF(BH42=1,\"Brugbar\",IF(BH42=2,\"God\",IF(BH42=3,\"Meget god\",\"xx\"))))","v":"xx"},{"$f":"IF(BI42=0,\"Nej\",IF(BI42=1,\"Brugbar\",IF(BI42=2,\"God\",IF(BI42=3,\"Meget god\",\"xx\"))))","v":"xx"},{"$f":"IF(BJ42=0,\"Nej\",IF(BJ42=1,\"Brugbar\",IF(BJ42=2,\"God\",IF(BJ42=3,\"Meget god\",\"xx\"))))","v":"xx"},{"$f":"IF(BK42=0,\"Nej\",IF(BK42=1,\"Ja\",\"xx\"))","v":"xx"},{"$f":"IF(BL42=0,\"Lille\",IF(BL42=1,\"Middel\",IF(BL42=2,\"Over middel\",IF(BL42=3,\"Stor\",\"xx\"))))","v":"xx"},{"$f":"IF(BM42=0,\"Nej\",IF(BM42=1,\"Rimelig\",IF(BM42=2,\"God\",IF(BM42=3,\"Meget god\",\"xx\"))))","v":"xx"},{"$f":"IF(BN42=0,\"Nej\",IF(BN42=1,\"Mod visse\",IF(BN42=2,\"Mod mange\",IF(BN42=3,\"Mod de fleste\",\"xx\"))))","v":"xx"},{"$f":"IF(BO42=0,\"Altid\",IF(BO42=1,\"I nogen grad\",IF(BO42=2,\"I mindre grad\",IF(BO42=3,\"Aldrig\",\"xx\"))))","v":"xx"},{"$f":"IF(BP42=0,\"Nej\",IF(BP42=1,\"Få\",IF(BP42=2,\"Nogle\",IF(BP42=3,\"Mange\",\"xx\"))))","v":"xx"},{"$f":"IF(BQ42=0,\"Udvintrer\",IF(BQ42=1,\"Dårlig\",IF(BQ42=2,\"God\",IF(BQ42=3,\"Meget god\",\"xx\"))))","v":"xx"},{"$f":"IF(BR42=0,\"Nej\",IF(BR42=1,\"Ja\",\"xx\"))","v":"xx"},null,{"$f":"BT42","v":"xx"},null,"xx",null,null,null,null,null,null,null,null,{"$f":"CE42","v":"xx"},null,null,null,"xx","xx","xx","xx","xx","xx","xx","xx","xx","xx","xx","xx","xx","xx","xx","xx","xx","xx",{"$f":"IF(BQ42<>\"xx\",BQ42^2,\"xx\")","v":"xx"},{"$f":"IF(BR42<>\"xx\",BR42^2,\"xx\")","v":"xx"},{"$f":"IF(BS42<>\"xx\",BS42^2,\"xx\")","v":"xx"},null,null,null,null,null,null,null,null,null,null,null,null,null,null,null,"xx","xx","xx","xx","xx","xx","xx","xx","xx","xx","xx","xx","xx","xx","xx","xx","xx",{"$f":"IF(EI42=\"xx\",\"xx\",(BP42-BP$7)/EI$8)","v":"xx"},{"$f":"IF(EJ42=\"xx\",\"xx\",(BQ42-BR$7)/EK$8)","v":"xx"},{"$f":"IF(EK42=\"xx\",\"xx\",(BR42-BS$7)/EL$8)","v":"xx"},"xx",null,null,null,null,null,null,null,null,null,null,null,null,{"$f":"SUMPRODUCT($FB$11:$FV$11,FB42:FV42)","v":0},{"$f":"IF(FB42=\"xx\",\"xx\",GI42)","v":"xx"},"xx",{"$f":"IF(OR(GJ42=\"xx\",GK42=\"xx\"),\"xx\",GK42+GJ42)","v":"xx"},{"$f":"IF(GL42=\"xx\",99,RANK(GL42,$GL$41:$GL$112))","v":99},null,null,null,null,null,{"$f":"COUNTIF($GM$41:$GM$112,GV42)","v":1},{"$f":"IF(GS42>0,MATCH(GV42,$GM$41:$GM$112,0),\"xx\")","v":30},null,2,null,null,null,"Olieræddike og vintervikke",{"$f":"IF($GS42=0,\"xx\",INDEX($CH$41:$DN$112,$GT42,HA$12))","v":"20. august"},"Meget god","Ja","Stor",-828,52,"Mod de fleste","I mindre grad","Nej","Udvintrer","Nej","Meget god","Ja","Nej","Nej","Nej","Ja","Ja","Ja","Nej","Nej",null,{"$f":"IF($GS42=0,\"xx\",INDEX($CH$41:$DN$112,$GT42,HW$12))","v":0},null,null,null,null,null,null,null,null,null,null,"Efterafgrøder"]
[3,"Vårbyg /Vikke /Gul Sennep",null,null,{"$f":"IF('Efterafgrøde beslutningsstøtte'!A$7<>\"Pligtig mellemafgrøde\",HYPERLINK(\"https://dyrk-plant.dlbr.dk/Web/(S(ikevr3oqnx5oe2t5cyfyknyq))/forms/Main.aspx?page=Vejledning&cropID=226\",\"Efterafgrøder\"),HYPERLINK(\"https://dyrk-plant.dlbr.dk/Web/(S(0x3ftyiaahcpttq0ljebuany))/forms/Main.aspx?page=Vejledning&cropID=238\",\"Mellemafgrøder\"))","v":"Efterafgrøder"},{"$f":"VLOOKUP($A43,Karaktermatrice,F$38,FALSE)","v":-788.5},1,0,0,0,1,1,1,0,0,0,3,1,2,1,0,3,0,0,1,0,3,0,null,"20. august",null,null,null,null,null,null,null,-348.5,null,null,null,null,null,null,null,null,null,null,null,null,-788.5,1,0,0,0,1,1,1,0,0,0,3,1,2,1,0,3,0,1,0,3,0,null,"20. august",null,null,null,null,null,null,null,null,-348.5,null,null,-789,"Ja","Nej","Nej","Nej","Ja","Ja","Ja","Nej","Nej","Nej","Meget god","Ja","Over middel","Rimelig","Nej","Aldrig","Nej","Dårlig","Nej",null,0,null,"20. august",null,null,null,null,null,null,null,null,-348.5,null,null,null,621732.25,1,0,0,0,1,1,1,0,0,0,9,1,4,1,0,9,0,1,0,9,null,null,null,null,null,null,null,null,null,null,null,null,null,null,null,0.34721084978649552,0,-0.36514837167011077,-1.1952286093343938,-0.6454972243679028,0,0,0,0,-0.60612812535620397,-0.91146543037529992,0.59587957153112403,1.3540064007726598,7.3323557510676624E-2,-0.23112508176051222,-1.6997502591252116,0.54173633888596151,-0.36514837167011077,-0.42796049251091284,-0.34259435491376583,-1.4285716492751916,null,null,null,null,null,null,null,null,null,null,null,null,239393.2074682347,239393.2074682347,0,239393.2074682347,4,null,null,null,null,null,{"$f":"COUNTIF($GM$41:$GM$112,GV43)","v":1},{"$f":"IF(GS43>0,MATCH(GV43,$GM$41:$GM$112,0),\"xx\")","v":34},null,3,null,null,null,"Kløvergræs (blanding)","1. august","Meget god","Ja","Stor",-2145,"-","Mod visse","Aldrig","Nej","Meget god","Nej","Nej","Ja","Nej","Nej","Ja","Ja","Ja","Ja","Nej","Meget god",null,0,null,null,null,null,null,null,null,null,null,null,"Efterafgrøder"]
[4,"Rajgræs /cikorie /hvidkløver",null,null,{"$f":"IF('Efterafgrøde beslutningsstøtte'!A$7<>\"Pligtig mellemafgrøde\",HYPERLINK(\"https://dyrk-plant.dlbr.dk/Web/(S(ikevr3oqnx5oe2t5cyfyknyq))/forms/Main.aspx?page=Vejledning&cropID=226\",\"Efterafgrøder\"),HYPERLINK(\"https://dyrk-plant.dlbr.dk/Web/(S(0x3ftyiaahcpttq0ljebuany))/forms/Main.aspx?page=Vejledning&cropID=238\",\"Mellemafgrøder\"))","v":"Efterafgrøder"},{"$f":"VLOOKUP($A44,Karaktermatrice,F$38,FALSE)","v":"xx"},"xx","xx","xx","xx","xx","xx","xx","xx","xx","xx","xx","xx","xx","xx","xx","xx","xx","xx","xx","xx","xx","xx",null,"xx",null,null,null,null,null,null,null,"xx",null,null,null,null,null,null,null,null,null,null,null,null,"xx","xx","xx","xx","xx","xx","xx","xx","xx","xx","xx","xx","xx","xx","xx","xx","xx","xx","xx","xx","xx","xx",null,"xx",null,null,null,null,null,null,null,null,"xx",null,null,"xx","xx","xx","xx","xx","xx","xx","xx","xx","xx","xx","xx","xx","xx","xx","xx","xx","xx","xx","xx",null,"xx",null,"xx",null,null,null,null,null,null,null,null,"xx",null,null,null,"xx","xx","xx","xx","xx","xx","xx","xx","xx","xx","xx","xx","xx","xx","xx","xx","xx","xx","xx","xx","xx",null,null,null,null,null,null,null,null,null,null,null,null,null,null,null,"xx","xx","xx","xx","xx","xx","xx","xx","xx","xx","xx","xx","xx","xx","xx","xx","xx","xx","xx","xx","xx",null,null,null,null,null,null,null,null,null,null,null,null,0,"xx","xx","xx",99,null,null,null,null,null,{"$f":"COUNTIF($GM$41:$GM$112,GV44)","v":1},{"$f":"IF(GS44>0,MATCH(GV44,$GM$41:$GM$112,0),\"xx\")","v":3},null,4,null,null,null,"Vårbyg /Vikke /Gul Sennep","20. august","Meget god","Ja","Over middel",-789,-348.5,"Nej","Aldrig","Nej","Dårlig","Nej","Rimelig","Ja","Nej","Nej","Nej","Ja","Ja","Ja","Nej","Nej",null,0,null,null,null,null,null,null,null,null,null,null,"Efterafgrøder"]
[5,"Rødkløver",null,null,{"$f":"IF('Efterafgrøde beslutningsstøtte'!A$7<>\"Pligtig mellemafgrøde\",HYPERLINK(\"https://dyrk-plant.dlbr.dk/Web/(S(ikevr3oqnx5oe2t5cyfyknyq))/forms/Main.aspx?page=Vejledning&cropID=226\",\"Efterafgrøder\"),HYPERLINK(\"https://dyrk-plant.dlbr.dk/Web/(S(0x3ftyiaahcpttq0ljebuany))/forms/Main.aspx?page=Vejledning&cropID=238\",\"Mellemafgrøder\"))","v":"Efterafgrøder"},{"$f":"VLOOKUP($A45,Karaktermatrice,F$38,FALSE)","v":"xx"},"xx","xx","xx","xx","xx","xx","xx","xx","xx","xx","xx","xx","xx","xx","xx","xx","xx","xx","xx","xx","xx","xx",null,"xx",null,null,null,null,null,null,null,"xx",null,null,null,null,null,null,null,null,null,null,null,null,"xx","xx","xx","xx","xx","xx","xx","xx","xx","xx","xx","xx","xx","xx","xx","xx","xx","xx","xx","xx","xx","xx",null,"xx",null,null,null,null,null,null,null,null,"xx",null,null,"xx","xx","xx","xx","xx","xx","xx","xx","xx","xx","xx","xx","xx","xx","xx","xx","xx","xx","xx","xx",null,"xx",null,"xx",null,null,null,null,null,null,null,null,"xx",null,null,null,"xx","xx","xx","xx","xx","xx","xx","xx","xx","xx","xx","xx","xx","xx","xx","xx","xx","xx","xx","xx","xx",null,null,null,null,null,null,null,null,null,null,null,null,null,null,null,"xx","xx","xx","xx","xx","xx","xx","xx","xx","xx","xx","xx","xx","xx","xx","xx","xx","xx","xx","xx","xx",null,null,null,null,null,null,null,null,null,null,null,null,0,"xx","xx","xx",99,null,null,null,null,null,1,10,null,5,null,null,null,"Olieræddike","20. august","Meget god","Nej","Over middel",-649,231,"Mod de fleste","I mindre grad","Mange","Udvintrer","Nej","Meget god","Ja","Ja","Ja","Nej","Ja","Ja","Ja","Nej","Nej",null,0,null,null,null,null,null,null,null,null,null,null,"Efterafgrøder"]
[6,"Vinterrug/fodervikke/olieræddike",null,null,{"$f":"IF('Efterafgrøde beslutningsstøtte'!A$7<>\"Pligtig mellemafgrøde\",HYPERLINK(\"https://dyrk-plant.dlbr.dk/Web/(S(ikevr3oqnx5oe2t5cyfyknyq))/forms/Main.aspx?page=Vejledning&cropID=226\",\"Efterafgrøder\"),HYPERLINK(\"https://dyrk-plant.dlbr.dk/Web/(S(0x3ftyiaahcpttq0ljebuany))/forms/Main.aspx?page=Vejledning&cropID=238\",\"Mellemafgrøder\"))","v":"Efterafgrøder"},"xx","xx","xx","xx","xx","xx","xx","xx","xx","xx","xx","xx","xx","xx","xx","xx","xx","xx","xx","xx","xx","xx","xx",null,"xx",null,null,null,null,null,null,null,"xx",null,null,null,null,null,null,null,null,null,null,null,null,"xx","xx","xx","xx","xx","xx","xx","xx","xx","xx","xx","xx","xx","xx","xx","xx","xx","xx","xx","xx","xx","xx",null,"xx",null,null,null,null,null,null,null,null,"xx",null,null,"xx","xx","xx","xx","xx","xx","xx","xx","xx","xx","xx","xx","xx","xx","xx","xx","xx","xx","xx","xx",null,"xx",null,"xx",null,null,null,null,null,null,null,null,"xx",null,null,null,"xx","xx","xx","xx","xx","xx","xx","xx","xx","xx","xx","xx","xx","xx","xx","xx","xx","xx","xx","xx","xx",null,null,null,null,null,null,null,null,null,null,null,null,null,null,null,"xx","xx","xx","xx","xx","xx","xx","xx","xx","xx","xx","xx","xx","xx","xx","xx","xx","xx","xx","xx","xx",null,null,null,null,null,null,null,null,null,null,null,null,0,"xx","xx","xx",99,null,null,null,null,null,1,9,null,6,null,null,null,"Gul sennep","20. august","Meget god","Nej","Over middel",-503,377,"Mod de fleste","Altid","Mange","Udvintrer",{"$f":"IF($GS46=0,\"xx\",INDEX($CH$41:$DN$112,$GT46,HK$12))","v":"Nej"},"God","Ja","Ja","Ja","Nej","Ja","Ja","Ja","Nej","Nej",null,0,null,null,null,null,null,null,null,null,null,null,"Efterafgrøder"]
[7,"Triticale/Gul Sennep",null,null,{"$f":"IF('Efterafgrøde beslutningsstøtte'!A$7<>\"Pligtig mellemafgrøde\",HYPERLINK(\"https://dyrk-plant.dlbr.dk/Web/(S(ikevr3oqnx5oe2t5cyfyknyq))/forms/Main.aspx?page=Vejledning&cropID=226\",\"Efterafgrøder\"),HYPERLINK(\"https://dyrk-plant.dlbr.dk/Web/(S(0x3ftyiaahcpttq0ljebuany))/forms/Main.aspx?page=Vejledning&cropID=238\",\"Mellemafgrøder\"))","v":"Efterafgrøder"},-647,1,0,0,0,1,1,1,0,3,1,1,0,1,0,0,3,0,0,0,0,7,0,null,"1. august",null,null,null,null,null,null,null,"-",null,null,null,null,null,null,null,null,null,null,null,null,-647,1,0,0,0,1,1,1,0,3,1,1,0,1,0,0,3,0,0,0,7,0,null,"1. august",null,null,null,null,null,null,null,null,"-",null,null,-647,"Ja","Nej","Nej","Nej","Ja","Ja","Ja","Nej","Meget god","Brugbar","Brugbar","Nej","Middel","Nej","Nej","Aldrig","Nej","Udvintrer","Nej",null,0,null,"1. august",null,null,null,null,null,null,null,null,"-",null,null,null,418609,1,0,0,0,1,1,1,0,9,1,1,0,1,0,0,9,0,0,0,49,null,null,null,null,null,null,null,null,null,null,null,null,null,null,null,0.59900937229521267,0,-0.36514837167011077,-1.1952286093343938,-0.6454972243679028,0,0,0,0,1.7717591356565963,-5.063696835418334E-2,-2.2983926330486222,-0.7385489458759964,-1.1731769201708258,-1.0169503597462535,-1.6997502591252116,0.54173633888596151,-0.36514837167011077,-1.1554933297794647,-0.34259435491376583,-1.0505838198949853,null,null,null,null,null,null,null,null,null,null,null,null,-921920.60091622139,-921920.60091622139,0,-921920.60091622139,17,null,null,null,null,null,1,13,null,7,null,null,null,"Foderradise (Strukturator)","20. august","Meget god","Nej","Over middel",-913,-33,"Mod de fleste","I mindre grad","Nej","Udvintrer",{"$f":"IF($GS47=0,\"xx\",INDEX($CH$41:$DN$112,$GT47,HK$12))","v":"Nej"},"Meget god","Ja","Nej","Ja","Nej","Ja","Ja","Ja","Nej","Nej",null,0,null,null,null,null,null,null,null,null,null,null,"Efterafgrøder"]
[8,"Frøgræs, udtjent",null,null,{"$f":"IF('Efterafgrøde beslutningsstøtte'!A$7<>\"Pligtig mellemafgrøde\",HYPERLINK(\"https://dyrk-plant.dlbr.dk/Web/(S(ikevr3oqnx5oe2t5cyfyknyq))/forms/Main.aspx?page=Vejledning&cropID=226\",\"Efterafgrøder\"),HYPERLINK(\"https://dyrk-plant.dlbr.dk/Web/(S(0x3ftyiaahcpttq0ljebuany))/forms/Main.aspx?page=Vejledning&cropID=238\",\"Mellemafgrøder\"))","v":"Efterafgrøder"},"xx","xx","xx","xx","xx","xx","xx","xx","xx","xx","xx","xx","xx","xx","xx","xx","xx","xx","xx","xx","xx","xx","xx",null,"xx",null,null,null,null,null,null,null,"xx",null,null,null,null,null,null,null,null,null,null,null,null,"xx","xx","xx","xx","xx","xx","xx","xx","xx","xx","xx","xx","xx","xx","xx","xx","xx","xx","xx","xx","xx","xx",null,"xx",null,null,null,null,null,null,null,null,"xx",null,null,"xx","xx","xx","xx","xx","xx","xx","xx","xx","xx","xx","xx","xx","xx","xx","xx","xx","xx","xx","xx",null,"xx",null,"xx",null,null,null,null,null,null,null,null,"xx",null,null,null,"xx","xx","xx","xx","xx","xx","xx","xx","xx","xx","xx","xx","xx","xx","xx","xx","xx","xx","xx","xx","xx",null,null,null,null,null,null,null,null,null,null,null,null,null,null,null,"xx","xx","xx","xx","xx","xx","xx","xx","xx","xx","xx","xx","xx","xx","xx","xx","xx","xx","xx","xx","xx",null,null,null,null,null,null,null,null,null,null,null,null,0,"xx","xx","xx",99,null,null,null,null,null,1,25,null,8,null,null,null,"Honningurt","20. august","Meget god","Nej","Over middel",-2302,-2082,"Mod de fleste","Aldrig","Nej","Udvintrer","Nej","Meget god","Ja","Nej","Ja","Nej","Ja","Ja","Ja","Nej","Nej",null,0,null,null,null,null,null,null,null,null,null,null,"Efterafgrøder"]
[9,"Gul sennep",null,null,{"$f":"IF('Efterafgrøde beslutningsstøtte'!A$7<>\"Pligtig mellemafgrøde\",HYPERLINK(\"https://dyrk-plant.dlbr.dk/Web/(S(ikevr3oqnx5oe2t5cyfyknyq))/forms/Main.aspx?page=Vejledning&cropID=226\",\"Efterafgrøder\"),HYPERLINK(\"https://dyrk-plant.dlbr.dk/Web/(S(0x3ftyiaahcpttq0ljebuany))/forms/Main.aspx?page=Vejledning&cropID=238\",\"Mellemafgrøder\"))","v":"Efterafgrøder"},-503,1,1,1,0,1,1,1,0,0,0,3,0,2,2,3,0,3,0,0,0,9,0,null,"20. august",null,null,null,null,null,null,null,377,null,null,null,null,null,null,null,null,null,null,null,null,-503,1,1,1,0,1,1,1,0,0,0,3,0,2,2,3,0,3,0,0,9,0,null,"20. august",null,null,null,null,null,null,null,null,377,null,null,-503,"Ja","Ja","Ja","Nej","Ja","Ja","Ja","Nej","Nej","Nej","Meget god","Nej","Over middel","God","Mod de fleste","Altid","Mange","Udvintrer","Nej",null,0,null,"20. august",null,null,null,null,null,null,null,null,377,null,null,null,{"$f":"IF(AY49<>\"xx\",AY49^2,\"xx\")","v":253009},1,1,1,0,{"$f":"IF(BD49<>\"xx\",BD49^2,\"xx\")","v":1},1,1,0,0,0,9,0,4,4,9,0,9,0,0,81,null,null,null,null,null,null,null,null,null,null,null,null,null,null,null,{"$f":"IF(DR49=\"xx\",\"xx\",(AY49-AY$7)/DR$8)","v":0.85525663195072699},0,2.7386127875258306,0.83666002653407556,-0.6454972243679028,0,0,0,0,-0.60612812535620397,-0.91146543037529992,0.59587957153112403,-0.7385489458759964,7.3323557510676624E-2,0.55470019622522915,0.77702868988581131,-2.528102914801154,2.7386127875258306,-1.1554933297794647,-0.34259435491376583,-0.8615899052048821,null,null,null,null,null,null,null,null,null,null,null,null,238527.75548936444,238527.75548936444,0,238527.75548936444,6,null,null,null,null,null,1,20,null,9,null,null,null,"Vinterrug ","20. august","Meget god","Nej","Middel",-849,-409,"Mod de fleste","Aldrig","Nej","Meget god","Ja","Rimelig","Ja","Nej","Ja","Nej","Ja","Ja","Ja","Nej","Nej",null,0,null,null,null,null,null,null,null,null,null,null,"Efterafgrøder"]
[10,"Olieræddike",null,null,{"$f":"IF('Efterafgrøde beslutningsstøtte'!A$7<>\"Pligtig mellemafgrøde\",HYPERLINK(\"https://dyrk-plant.dlbr.dk/Web/(S(ikevr3oqnx5oe2t5cyfyknyq))/forms/Main.aspx?page=Vejledning&cropID=226\",\"Efterafgrøder\"),HYPERLINK(\"https://dyrk-plant.dlbr.dk/Web/(S(0x3ftyiaahcpttq0ljebuany))/forms/Main.aspx?page=Vejledning&cropID=238\",\"Mellemafgrøder\"))","v":"Efterafgrøder"},-649,1,1,1,0,1,1,1,0,0,0,3,0,2,3,3,2,3,0,0,0,10,0,null,"20. august",null,null,null,null,null,null,null,231,null,null,null,null,null,null,null,null,null,null,null,null,-649,1,1,1,0,1,1,1,0,0,0,3,0,2,3,3,2,3,0,0,10,0,null,"20. august",null,null,null,null,null,null,null,null,231,null,null,-649,"Ja","Ja","Ja","Nej","Ja","Ja","Ja","Nej","Nej","Nej","Meget god","Nej","Over middel","Meget god","Mod de fleste","I mindre grad","Mange","Udvintrer","Nej",null,0,null,"20. august",null,null,null,null,null,null,null,null,231,null,null,null,421201,1,1,1,0,1,1,1,0,0,0,9,0,4,9,9,4,9,0,0,100,null,null,null,null,null,null,null,null,null,null,null,null,null,null,null,0.59545038257777494,0,2.7386127875258306,0.83666002653407556,-0.6454972243679028,0,0,0,0,-0.60612812535620397,-0.91146543037529992,0.59587957153112403,-0.7385489458759964,7.3323557510676624E-2,1.3405254742109705,0.77702868988581131,-0.48154341234307707,2.7386127875258306,-1.1554933297794647,-0.34259435491376583,-0.76709294785983051,null,null,null,null,null,null,null,null,null,null,null,null,238573.78694076015,238573.78694076015,0,238573.78694076015,5,null,null,null,null,null,1,14,null,10,null,null,null,"Havre","20. august","Meget god","Nej","Middel",-877,-657,"Mod de fleste","Aldrig","Nej","Dårlig","Ja","Rimelig","Ja","Nej","Ja","Nej","Ja","Ja","Ja","Nej","Nej",null,0,null,null,null,null,null,null,null,null,null,null,"Efterafgrøder"]
[11,"Blanding med bælgsæd udvintrene",null,null,{"$f":"IF('Efterafgrøde beslutningsstøtte'!A$7<>\"Pligtig mellemafgrøde\",HYPERLINK(\"https://dyrk-plant.dlbr.dk/Web/(S(ikevr3oqnx5oe2t5cyfyknyq))/forms/Main.aspx?page=Vejledning&cropID=226\",\"Efterafgrøder\"),HYPERLINK(\"https://dyrk-plant.dlbr.dk/Web/(S(0x3ftyiaahcpttq0ljebuany))/forms/Main.aspx?page=Vejledning&cropID=238\",\"Mellemafgrøder\"))","v":"Efterafgrøder"},{"$f":"VLOOKUP($A51,Karaktermatrice,F$38,FALSE)","v":"xx"},"xx","xx","xx","xx","xx","xx","xx","xx","xx",{"$f":"VLOOKUP($A51,Karaktermatrice,P$38,FALSE)","v":"xx"},"xx","xx","xx","xx","xx","xx","xx","xx","xx","xx","xx","xx",null,"xx",null,null,null,null,null,null,null,"xx",null,null,null,null,null,null,null,null,null,null,null,null,"xx","xx","xx","xx","xx","xx","xx","xx","xx","xx","xx","xx","xx","xx","xx","xx","xx","xx","xx","xx","xx","xx",null,"xx",null,null,null,null,null,null,null,null,"xx",null,null,"xx","xx","xx","xx","xx","xx","xx","xx","xx","xx","xx","xx","xx","xx","xx","xx","xx","xx","xx","xx",null,"xx",null,"xx",null,null,null,null,null,null,null,null,"xx",null,null,null,"xx","xx","xx","xx","xx","xx","xx","xx","xx","xx","xx","xx","xx","xx","xx","xx","xx","xx","xx","xx","xx",null,null,null,null,null,null,null,null,null,null,null,null,null,null,null,"xx","xx","xx","xx","xx","xx","xx","xx","xx","xx","xx","xx","xx","xx","xx","xx","xx","xx","xx","xx","xx",null,null,null,null,null,null,null,null,null,null,null,null,0,"xx","xx","xx",99,null,null,null,null,null,1,18,null,11,null,null,null,"Vårbyg","20. august","Meget god","Nej","Middel",-877,-657,"Mod de fleste","Aldrig","Nej","Dårlig","Ja","Nej","Ja","Nej","Ja","Nej","Ja","Ja","Ja","Nej","Nej",null,0,null,null,null,null,null,null,null,null,null,null,"Efterafgrøder"]
[12,"Vinterraps , linie",null,null,{"$f":"IF('Efterafgrøde beslutningsstøtte'!A$7<>\"Pligtig mellemafgrøde\",HYPERLINK(\"https://dyrk-plant.dlbr.dk/Web/(S(ikevr3oqnx5oe2t5cyfyknyq))/forms/Main.aspx?page=Vejledning&cropID=226\",\"Efterafgrøder\"),HYPERLINK(\"https://dyrk-plant.dlbr.dk/Web/(S(0x3ftyiaahcpttq0ljebuany))/forms/Main.aspx?page=Vejledning&cropID=238\",\"Mellemafgrøder\"))","v":"Efterafgrøder"},-1136,1,0,1,0,1,1,1,0,0,1,2,0,2,3,3,0,0,0,3,1,12,0,null,"20. august",null,null,null,null,null,null,null,-476,null,null,null,null,null,null,null,null,null,null,null,null,-1136,1,0,1,0,1,1,1,0,0,1,2,0,2,3,3,0,0,3,1,12,0,null,"20. august",null,null,null,null,null,null,null,null,-476,null,null,-1136,"Ja","Nej","Ja","Nej","Ja","Ja","Ja","Nej","Nej","Brugbar","God","Nej","Over middel","Meget god","Mod de fleste","Altid","Nej","Meget god","Ja",null,0,null,"20. august",null,null,null,null,null,null,null,null,-476,null,null,null,1290496,1,0,1,0,1,1,1,0,0,1,4,0,4,9,9,0,0,9,1,144,null,null,null,null,null,null,null,null,null,null,null,null,null,null,null,-0.27116361361830466,0,-0.36514837167011077,0.83666002653407556,-0.6454972243679028,0,0,0,0,-0.60612812535620397,-5.063696835418334E-2,-0.85125653075874907,-0.7385489458759964,7.3323557510676624E-2,1.3405254742109705,0.77702868988581131,-2.528102914801154,-0.36514837167011077,1.0271051820261909,0.82222645179303788,-0.57809903316972733,null,null,null,null,null,null,null,null,null,null,null,null,-341467.34019971575,-341467.34019971575,0,-341467.34019971575,14,null,null,null,null,null,1,16,null,12,null,null,null,"Vinterrybs","20. august","Meget god","Nej","Middel",-1513,-633,"Nej","Aldrig","Nej","Meget god","Ja","God","Ja","Nej","Ja","Nej","Ja","Ja","Ja","Nej","Nej",null,0,null,null,null,null,null,null,null,null,null,null,"Efterafgrøder"]
[13,"Foderradise (Strukturator)",null,null,{"$f":"IF('Efterafgrøde beslutningsstøtte'!A$7<>\"Pligtig mellemafgrøde\",HYPERLINK(\"https://dyrk-plant.dlbr.dk/Web/(S(ikevr3oqnx5oe2t5cyfyknyq))/forms/Main.aspx?page=Vejledning&cropID=226\",\"Efterafgrøder\"),HYPERLINK(\"https://dyrk-plant.dlbr.dk/Web/(S(0x3ftyiaahcpttq0ljebuany))/forms/Main.aspx?page=Vejledning&cropID=238\",\"Mellemafgrøder\"))","v":"Efterafgrøder"},-913,1,0,1,0,1,1,1,0,0,1,3,0,2,3,3,2,0,0,0,0,13,0,null,"20. august",null,null,null,null,null,null,null,-33,null,null,null,null,null,null,null,null,null,null,null,null,-913,1,0,1,{"$f":"J53","v":0},1,1,1,0,0,1,3,0,2,3,3,2,0,0,0,13,0,null,"20. august",null,null,null,null,null,null,null,null,-33,null,null,-913,"Ja","Nej","Ja","Nej","Ja","Ja","Ja","Nej","Nej","Brugbar","Meget god","Nej","Over middel","Meget god","Mod de fleste","I mindre grad","Nej","Udvintrer","Nej",null,0,null,"20. august",null,null,null,null,null,null,null,null,-33,null,null,null,833569,1,0,1,0,1,1,1,0,0,1,9,0,4,9,9,4,0,0,0,169,null,null,null,null,null,null,null,null,null,null,null,null,null,null,null,0.12566373987599874,0,-0.36514837167011077,0.83666002653407556,-0.6454972243679028,0,0,0,0,-0.60612812535620397,-5.063696835418334E-2,0.59587957153112403,-0.7385489458759964,7.3323557510676624E-2,1.3405254742109705,0.77702868988581131,-0.48154341234307707,-0.36514837167011077,-1.1554933297794647,-0.34259435491376583,-0.48360207582467574,null,null,null,null,null,null,null,null,null,null,null,null,238490.95615839071,238490.95615839071,0,238490.95615839071,7,null,null,null,null,null,1,31,null,13,null,null,null,"Hvidkløver/alm. rajgræs","1. august","God","Ja","Stor",{"$f":"IF($GS53=0,\"xx\",INDEX($CH$41:$DN$112,$GT53,HE$12))","v":-185},"-","Mod visse","Aldrig","Nej","Meget god","Nej","Nej","Ja","Nej","Nej","Ja","Ja","Ja","Ja","Nej",{"$f":"IF($GS53=0,\"xx\",INDEX($CH$41:$DN$112,$GT53,HU$12))","v":"Meget god"},null,0,null,null,null,null,null,null,null,null,null,null,"Efterafgrøder"]
[14,"Havre",null,null,{"$f":"IF('Efterafgrøde beslutningsstøtte'!A$7<>\"Pligtig mellemafgrøde\",HYPERLINK(\"https://dyrk-plant.dlbr.dk/Web/(S(ikevr3oqnx5oe2t5cyfyknyq))/forms/Main.aspx?page=Vejledning&cropID=226\",\"Efterafgrøder\"),HYPERLINK(\"https://dyrk-plant.dlbr.dk/Web/(S(0x3ftyiaahcpttq0ljebuany))/forms/Main.aspx?page=Vejledning&cropID=238\",\"Mellemafgrøder\"))","v":"Efterafgrøder"},-877,1,0,1,0,1,1,1,0,0,1,3,0,1,1,3,3,0,0,1,1,14,0,null,"20. august",null,null,null,null,null,null,null,-657,null,null,null,null,null,null,null,null,null,null,null,null,-877,{"$f":"G54","v":1},0,1,0,1,1,1,0,0,1,3,0,1,1,3,3,0,1,1,14,0,null,"20. august",null,null,null,null,null,null,null,null,-657,null,null,-877,"Ja","Nej","Ja","Nej","Ja","Ja","Ja","Nej","Nej","Brugbar","Meget god","Nej","Middel","Rimelig","Mod de fleste","Aldrig","Nej","Dårlig","Ja",null,0,null,"20. august",null,null,null,null,null,null,null,null,-657,null,null,null,769129,1,0,1,0,1,1,1,0,0,1,9,0,1,1,9,9,0,1,1,196,null,null,null,null,null,null,null,null,null,null,null,null,null,null,null,0.18972555478987732,0,-0.36514837167011077,0.83666002653407556,-0.6454972243679028,0,0,0,0,-0.60612812535620397,-5.063696835418334E-2,0.59587957153112403,-0.7385489458759964,-1.1731769201708258,-0.23112508176051222,0.77702868988581131,0.54173633888596151,-0.36514837167011077,-0.42796049251091284,0.82222645179303788,-0.38910511847962415,null,null,null,null,null,null,null,null,null,null,null,null,238041.69630348904,238041.69630348904,0,238041.69630348904,10,null,null,null,null,null,1,12,null,14,null,null,null,"Vinterraps , linie","20. august","God","Nej","Over middel",-1136,-476,"Mod de fleste","Altid","Nej","Meget god","Ja","Meget god","Ja","Nej","Ja","Nej",{"$f":"IF($GS54=0,\"xx\",INDEX($CH$41:$DN$112,$GT54,HQ$12))","v":"Ja"},"Ja","Ja","Nej","Nej",null,0,null,null,null,null,null,null,null,null,null,null,"Efterafgrøder"]
[15,"Boghvede",null,null,{"$f":"IF('Efterafgrøde beslutningsstøtte'!A$7<>\"Pligtig mellemafgrøde\",HYPERLINK(\"https://dyrk-plant.dlbr.dk/Web/(S(ikevr3oqnx5oe2t5cyfyknyq))/forms/Main.aspx?page=Vejledning&cropID=226\",\"Efterafgrøder\"),HYPERLINK(\"https://dyrk-plant.dlbr.dk/Web/(S(0x3ftyiaahcpttq0ljebuany))/forms/Main.aspx?page=Vejledning&cropID=238\",\"Mellemafgrøder\"))","v":"Efterafgrøder"},"xx","xx","xx","xx","xx","xx","xx","xx","xx","xx","xx","xx","xx","xx","xx","xx","xx","xx","xx","xx","xx","xx","xx",null,"xx",null,null,null,null,null,null,null,"xx",null,null,null,null,null,null,null,null,null,null,null,null,"xx","xx","xx","xx","xx","xx","xx","xx","xx","xx","xx","xx","xx","xx","xx","xx","xx","xx","xx","xx","xx","xx",null,"xx",null,null,null,null,null,null,null,null,"xx",null,null,"xx","xx","xx","xx","xx","xx","xx","xx","xx","xx","xx","xx","xx","xx","xx","xx","xx","xx","xx","xx",null,"xx",null,"xx",null,null,null,null,null,null,null,null,"xx",null,null,null,"xx","xx","xx","xx","xx","xx","xx","xx","xx","xx","xx","xx","xx","xx","xx","xx","xx","xx","xx","xx","xx",null,null,null,null,null,null,null,null,null,null,null,null,null,null,null,"xx","xx","xx","xx","xx","xx","xx","xx","xx","xx","xx","xx","xx","xx","xx","xx","xx","xx","xx","xx","xx",null,null,null,null,null,null,null,null,null,null,null,null,0,"xx","xx",{"$f":"IF(OR(GJ55=\"xx\",GK55=\"xx\"),\"xx\",GK55+GJ55)","v":"xx"},99,null,null,null,null,null,1,1,null,15,null,null,null,"Alm. rajgræs, dipl.","1.august","God","Nej","Middel",-185,"-","Mod mange","Aldrig","Nej","Meget god","Nej","Nej","Ja","Nej","Ja","Ja","Ja","Ja","Ja","Nej","Meget god",null,0,null,null,null,null,null,null,null,null,null,null,"Efterafgrøder"]
[16,"Vinterrybs",null,null,{"$f":"IF('Efterafgrøde beslutningsstøtte'!A$7<>\"Pligtig mellemafgrøde\",HYPERLINK(\"https://dyrk-plant.dlbr.dk/Web/(S(ikevr3oqnx5oe2t5cyfyknyq))/forms/Main.aspx?page=Vejledning&cropID=226\",\"Efterafgrøder\"),HYPERLINK(\"https://dyrk-plant.dlbr.dk/Web/(S(0x3ftyiaahcpttq0ljebuany))/forms/Main.aspx?page=Vejledning&cropID=238\",\"Mellemafgrøder\"))","v":"Efterafgrøder"},-1513,1,0,1,0,1,1,1,0,0,1,3,0,1,2,0,3,0,0,3,1,16,0,null,"20. august",null,null,null,null,null,null,null,-633,null,null,null,null,null,null,null,null,null,null,null,null,-1513,1,0,1,0,1,1,1,0,0,1,3,0,1,2,0,3,0,3,1,16,0,null,"20. august",null,null,null,null,null,null,null,null,-633,null,null,-1513,"Ja","Nej","Ja","Nej","Ja","Ja","Ja","Nej","Nej","Brugbar","Meget god","Nej","Middel","God","Nej","Aldrig","Nej","Meget god","Ja",null,0,null,"20. august",null,null,null,null,null,null,null,null,-633,null,null,null,2289169,1,0,1,0,1,1,1,0,0,1,9,0,1,4,0,9,0,9,1,256,null,null,null,null,null,null,null,null,null,null,null,null,null,null,null,-0.94203317535531084,0,-0.36514837167011077,0.83666002653407556,-0.6454972243679028,0,0,0,0,-0.60612812535620397,-5.063696835418334E-2,0.59587957153112403,-0.7385489458759964,-1.1731769201708258,0.55470019622522915,-1.6997502591252116,0.54173633888596151,-0.36514837167011077,1.0271051820261909,0.82222645179303788,-0.20011120378952096,null,null,null,null,null,null,null,null,null,null,null,null,237942.84442193439,237942.84442193439,0,237942.84442193439,12,null,null,null,null,null,1,32,null,16,null,null,null,"Rødkløver/strandsvingel","1. august","Brugbar","Ja","Stor",-1355,"-","Mod visse","Aldrig","Nej","Meget god","Nej","Nej","Ja","Nej","Nej","Ja","Ja","Ja","Ja","Nej","Brugbar",null,0,null,null,null,null,null,null,null,null,null,null,"Efterafgrøder"]
[17,"Gul Lupin",null,null,{"$f":"IF('Efterafgrøde beslutningsstøtte'!A$7<>\"Pligtig mellemafgrøde\",HYPERLINK(\"https://dyrk-plant.dlbr.dk/Web/(S(ikevr3oqnx5oe2t5cyfyknyq))/forms/Main.aspx?page=Vejledning&cropID=226\",\"Efterafgrøder\"),HYPERLINK(\"https://dyrk-plant.dlbr.dk/Web/(S(0x3ftyiaahcpttq0ljebuany))/forms/Main.aspx?page=Vejledning&cropID=238\",\"Mellemafgrøder\"))","v":"Efterafgrøder"},"xx","xx","xx","xx","xx","xx","xx","xx","xx","xx","xx","xx","xx","xx","xx","xx","xx","xx","xx","xx","xx","xx","xx",null,"xx",null,null,null,null,null,null,null,"xx",null,null,null,null,null,null,null,null,null,null,null,null,"xx","xx","xx","xx","xx","xx","xx","xx","xx","xx","xx","xx","xx","xx","xx","xx","xx","xx","xx",{"$f":"Z57","v":"xx"},{"$f":"AA57","v":"xx"},{"$f":"AB57","v":"xx"},null,"xx",null,null,null,null,null,null,null,null,"xx",null,null,"xx","xx","xx","xx","xx","xx","xx","xx","xx","xx","xx","xx","xx","xx","xx","xx","xx","xx","xx","xx",null,"xx",null,"xx",null,null,null,null,null,null,null,null,"xx",null,null,null,"xx","xx","xx","xx","xx","xx","xx","xx","xx","xx","xx","xx","xx","xx","xx","xx","xx","xx","xx","xx","xx",null,null,null,null,null,null,null,null,null,null,null,null,null,null,null,"xx","xx","xx","xx","xx","xx","xx","xx","xx","xx","xx","xx","xx","xx","xx","xx","xx","xx","xx","xx","xx",null,null,null,null,null,null,null,null,null,null,null,null,0,"xx","xx","xx",99,null,null,null,null,null,{"$f":"COUNTIF($GM$41:$GM$112,GV57)","v":1},7,null,17,null,null,null,"Triticale/Gul Sennep","1. august","Brugbar","Nej","Middel",-647,"-","Nej","Aldrig","Nej","Udvintrer","Nej","Nej","Ja","Nej","Nej","Nej","Ja","Ja","Ja","Nej","Meget god",null,0,null,null,null,null,null,null,null,null,null,null,"Efterafgrøder"]
[18,"Vårbyg",null,null,{"$f":"IF('Efterafgrøde beslutningsstøtte'!A$7<>\"Pligtig mellemafgrøde\",HYPERLINK(\"https://dyrk-plant.dlbr.dk/Web/(S(ikevr3oqnx5oe2t5cyfyknyq))/forms/Main.aspx?page=Vejledning&cropID=226\",\"Efterafgrøder\"),HYPERLINK(\"https://dyrk-plant.dlbr.dk/Web/(S(0x3ftyiaahcpttq0ljebuany))/forms/Main.aspx?page=Vejledning&cropID=238\",\"Mellemafgrøder\"))","v":"Efterafgrøder"},-877,1,0,1,0,1,1,1,0,0,0,3,0,1,0,3,3,0,0,1,1,18,0,null,"20. august",null,null,null,null,null,null,null,-657,null,null,null,null,null,null,null,null,null,null,null,null,-877,1,0,1,0,1,1,1,0,0,0,3,0,1,0,3,3,0,1,1,18,0,null,"20. august",null,null,null,null,null,null,null,null,-657,null,null,-877,"Ja","Nej","Ja","Nej","Ja","Ja","Ja","Nej","Nej","Nej","Meget god","Nej","Middel","Nej","Mod de fleste","Aldrig","Nej","Dårlig","Ja",null,0,null,"20. august",null,null,null,null,null,null,null,null,-657,null,null,null,769129,1,0,1,0,1,1,1,0,0,0,9,0,1,0,9,9,0,1,1,324,null,null,null,null,null,null,null,null,null,null,null,null,null,null,null,0.18972555478987732,0,-0.36514837167011077,0.83666002653407556,-0.6454972243679028,0,0,0,0,-0.60612812535620397,-0.91146543037529992,0.59587957153112403,-0.7385489458759964,-1.1731769201708258,-1.0169503597462535,0.77702868988581131,0.54173633888596151,-0.36514837167011077,-0.42796049251091284,0.82222645179303788,-1.1117289099417794E-2,null,null,null,null,null,null,null,null,null,null,null,null,238035.72685475103,238035.72685475103,0,238035.72685475103,11,null,null,null,null,null,0,"xx",null,18,null,null,null,"xx","xx","xx","xx","xx","xx","xx","xx","xx","xx","xx","xx","xx","xx","xx","xx","xx","xx","xx","xx","xx","xx",null,"xx",null,null,null,null,null,null,null,null,null,null,"xx"]
[19,"vårbyg/fodervikke",null,null,{"$f":"IF('Efterafgrøde beslutningsstøtte'!A$7<>\"Pligtig mellemafgrøde\",HYPERLINK(\"https://dyrk-plant.dlbr.dk/Web/(S(ikevr3oqnx5oe2t5cyfyknyq))/forms/Main.aspx?page=Vejledning&cropID=226\",\"Efterafgrøder\"),HYPERLINK(\"https://dyrk-plant.dlbr.dk/Web/(S(0x3ftyiaahcpttq0ljebuany))/forms/Main.aspx?page=Vejledning&cropID=238\",\"Mellemafgrøder\"))","v":"Efterafgrøder"},"xx","xx","xx","xx","xx","xx","xx","xx","xx","xx","xx","xx","xx","xx","xx","xx","xx","xx","xx","xx","xx","xx","xx",null,"xx",null,null,null,null,null,null,null,"xx",null,null,null,null,null,null,null,null,null,null,null,null,"xx","xx","xx","xx","xx","xx","xx","xx","xx","xx","xx","xx","xx","xx","xx","xx","xx","xx","xx","xx","xx","xx",null,"xx",null,null,null,null,null,null,null,null,"xx",null,null,"xx","xx","xx","xx","xx","xx","xx","xx","xx","xx","xx","xx","xx","xx","xx","xx","xx","xx","xx","xx",null,"xx",null,"xx",null,null,null,null,null,null,null,null,"xx",null,null,null,"xx","xx","xx","xx","xx","xx","xx","xx","xx","xx","xx","xx","xx","xx","xx","xx","xx","xx","xx","xx","xx",null,null,null,null,null,null,null,null,null,null,null,null,null,null,null,"xx","xx","xx","xx","xx","xx","xx","xx","xx","xx","xx","xx","xx","xx","xx","xx","xx","xx","xx","xx","xx",null,null,null,null,null,null,null,null,null,null,null,null,0,"xx","xx","xx",99,null,null,null,null,null,0,"xx",null,19,null,null,null,"xx","xx","xx","xx","xx","xx","xx","xx","xx","xx","xx","xx","xx","xx","xx","xx","xx","xx","xx","xx","xx","xx",null,"xx",null,null,null,null,null,null,null,null,null,null,"xx"]
[20,"Vinterrug ",null,null,{"$f":"IF('Efterafgrøde beslutningsstøtte'!A$7<>\"Pligtig mellemafgrøde\",HYPERLINK(\"https://dyrk-plant.dlbr.dk/Web/(S(ikevr3oqnx5oe2t5cyfyknyq))/forms/Main.aspx?page=Vejledning&cropID=226\",\"Efterafgrøder\"),HYPERLINK(\"https://dyrk-plant.dlbr.dk/Web/(S(0x3ftyiaahcpttq0ljebuany))/forms/Main.aspx?page=Vejledning&cropID=238\",\"Mellemafgrøder\"))","v":"Efterafgrøder"},-849,1,0,1,0,1,1,1,0,0,1,3,0,1,1,3,3,0,0,3,1,20,0,null,"20. august",null,null,null,null,null,null,null,-409,null,null,null,null,null,null,null,null,null,null,null,null,-849,1,0,1,0,1,1,1,0,0,1,3,0,1,1,3,3,0,3,1,20,0,null,"20. august",null,null,null,null,null,null,null,null,-409,null,null,-849,"Ja","Nej","Ja","Nej","Ja","Ja","Ja","Nej","Nej","Brugbar","Meget god","Nej","Middel","Rimelig","Mod de fleste","Aldrig","Nej","Meget god","Ja",null,0,null,"20. august",null,null,null,null,null,null,null,null,-409,null,null,null,720801,1,0,1,0,1,1,1,0,0,1,9,0,1,1,9,9,0,9,1,400,null,null,null,null,null,null,null,null,null,null,null,null,null,null,null,0.23955141083400511,0,-0.36514837167011077,0.83666002653407556,-0.6454972243679028,0,0,0,0,-0.60612812535620397,-5.063696835418334E-2,0.59587957153112403,-0.7385489458759964,-1.1731769201708258,-0.23112508176051222,0.77702868988581131,0.54173633888596151,-0.36514837167011077,1.0271051820261909,0.82222645179303788,0.17787662559068537,null,null,null,null,null,null,null,null,null,null,null,null,238064.39109927832,238064.39109927832,0,238064.39109927832,9,null,null,null,null,null,0,{"$f":"IF(GS60>0,MATCH(GV60,$GM$41:$GM$112,0),\"xx\")","v":"xx"},null,20,null,null,null,"xx","xx","xx","xx","xx","xx","xx","xx","xx","xx","xx","xx","xx","xx","xx","xx","xx","xx","xx","xx","xx","xx",null,"xx",null,null,null,null,null,null,null,null,null,null,"xx"]
[21,"Olierædikke/gul sennep ",null,null,{"$f":"IF('Efterafgrøde beslutningsstøtte'!A$7<>\"Pligtig mellemafgrøde\",HYPERLINK(\"https://dyrk-plant.dlbr.dk/Web/(S(ikevr3oqnx5oe2t5cyfyknyq))/forms/Main.aspx?page=Vejledning&cropID=226\",\"Efterafgrøder\"),HYPERLINK(\"https://dyrk-plant.dlbr.dk/Web/(S(0x3ftyiaahcpttq0ljebuany))/forms/Main.aspx?page=Vejledning&cropID=238\",\"Mellemafgrøder\"))","v":"Efterafgrøder"},{"$f":"VLOOKUP($A61,Karaktermatrice,F$38,FALSE)","v":"xx"},"xx","xx","xx","xx","xx","xx","xx","xx","xx",{"$f":"VLOOKUP($A61,Karaktermatrice,P$38,FALSE)","v":"xx"},"xx","xx","xx","xx","xx","xx","xx","xx","xx","xx","xx","xx",null,"xx",null,null,null,null,null,null,null,"xx",null,null,null,null,null,null,null,null,null,null,null,null,"xx","xx","xx","xx","xx","xx","xx","xx","xx","xx","xx","xx","xx","xx","xx","xx","xx","xx","xx","xx","xx","xx",null,"xx",null,null,null,null,null,null,null,null,"xx",null,null,"xx","xx","xx","xx","xx","xx","xx","xx","xx","xx","xx","xx","xx","xx","xx","xx","xx","xx","xx","xx",null,"xx",null,"xx",null,null,null,null,null,null,null,null,"xx",null,null,null,"xx","xx","xx","xx","xx","xx","xx","xx","xx","xx","xx","xx","xx","xx","xx","xx","xx","xx","xx","xx","xx",null,null,null,null,null,null,null,null,null,null,null,null,null,null,null,"xx","xx","xx","xx","xx","xx","xx","xx","xx","xx","xx","xx","xx","xx","xx","xx","xx","xx","xx","xx","xx",null,null,null,null,null,null,null,null,null,null,null,null,0,"xx","xx","xx",99,null,null,null,null,null,0,"xx",null,21,null,null,null,"xx","xx","xx","xx","xx","xx","xx","xx","xx","xx","xx","xx","xx","xx","xx","xx","xx","xx","xx","xx","xx","xx",null,"xx",null,null,null,null,null,null,null,null,null,null,"xx"]
[22,"Blanding med bælgsæd overvintrene",null,null,{"$f":"IF('Efterafgrøde beslutningsstøtte'!A$7<>\"Pligtig mellemafgrøde\",HYPERLINK(\"https://dyrk-plant.dlbr.dk/Web/(S(ikevr3oqnx5oe2t5cyfyknyq))/forms/Main.aspx?page=Vejledning&cropID=226\",\"Efterafgrøder\"),HYPERLINK(\"https://dyrk-plant.dlbr.dk/Web/(S(0x3ftyiaahcpttq0ljebuany))/forms/Main.aspx?page=Vejledning&cropID=238\",\"Mellemafgrøder\"))","v":"Efterafgrøder"},"xx","xx","xx","xx","xx","xx","xx","xx","xx","xx","xx","xx","xx","xx","xx","xx","xx","xx","xx","xx","xx","xx","xx",null,"xx",null,null,null,null,null,null,null,"xx",null,null,null,null,null,null,null,null,null,null,null,null,"xx","xx","xx","xx","xx","xx","xx","xx","xx","xx","xx","xx","xx","xx","xx","xx","xx","xx","xx","xx","xx","xx",null,"xx",null,null,null,null,null,null,null,null,"xx",null,null,"xx","xx","xx","xx","xx","xx","xx","xx","xx","xx","xx","xx","xx","xx","xx","xx","xx","xx","xx","xx",null,"xx",null,"xx",null,null,null,null,null,null,null,null,"xx",null,null,null,"xx","xx","xx","xx","xx","xx","xx","xx","xx","xx","xx","xx","xx","xx","xx","xx","xx","xx","xx","xx","xx",null,null,null,null,null,null,null,null,null,null,null,null,null,null,null,"xx","xx","xx","xx","xx","xx","xx","xx","xx","xx","xx","xx","xx","xx","xx","xx","xx","xx","xx","xx","xx",null,null,null,null,null,null,null,null,null,null,null,null,0,"xx","xx","xx",99,null,null,null,null,null,0,"xx",null,22,null,null,null,"xx","xx","xx","xx","xx","xx","xx","xx","xx","xx","xx","xx","xx","xx","xx","xx","xx","xx","xx","xx","xx","xx",null,"xx",null,null,null,null,null,null,null,null,null,null,"xx"]
[23,"Blanding uden bælgsæd udvintrene",null,null,{"$f":"IF('Efterafgrøde beslutningsstøtte'!A$7<>\"Pligtig mellemafgrøde\",HYPERLINK(\"https://dyrk-plant.dlbr.dk/Web/(S(ikevr3oqnx5oe2t5cyfyknyq))/forms/Main.aspx?page=Vejledning&cropID=226\",\"Efterafgrøder\"),HYPERLINK(\"https://dyrk-plant.dlbr.dk/Web/(S(0x3ftyiaahcpttq0ljebuany))/forms/Main.aspx?page=Vejledning&cropID=238\",\"Mellemafgrøder\"))","v":"Efterafgrøder"},"xx","xx","xx","xx","xx","xx","xx","xx","xx","xx","xx","xx","xx","xx","xx","xx","xx","xx","xx","xx","xx","xx","xx",null,"xx",null,null,null,null,null,null,null,"xx",null,null,null,null,null,null,null,null,null,null,null,null,"xx","xx","xx","xx","xx","xx","xx","xx","xx","xx","xx","xx","xx","xx","xx","xx","xx","xx","xx","xx","xx","xx",null,"xx",null,null,null,null,null,null,null,null,"xx",null,null,"xx","xx","xx","xx","xx","xx","xx","xx","xx","xx","xx","xx","xx","xx","xx","xx","xx","xx","xx","xx",null,"xx",null,"xx",null,null,null,null,null,null,null,null,"xx",null,null,null,"xx","xx","xx","xx","xx","xx","xx","xx","xx","xx","xx","xx","xx","xx","xx","xx","xx","xx","xx","xx","xx",null,null,null,null,null,null,null,null,null,null,null,null,null,null,null,"xx","xx","xx","xx","xx","xx","xx","xx","xx","xx","xx","xx","xx","xx","xx","xx","xx","xx","xx","xx","xx",null,null,null,null,null,null,null,null,null,null,null,null,0,"xx","xx","xx",99,null,null,null,null,null,0,"xx",null,23,null,null,null,"xx","xx","xx","xx","xx","xx","xx","xx","xx","xx","xx","xx","xx","xx","xx","xx","xx","xx","xx","xx","xx","xx",null,"xx",null,null,null,null,null,null,null,null,null,null,"xx"]
[24,"Cikorie",null,null,{"$f":"IF('Efterafgrøde beslutningsstøtte'!A$7<>\"Pligtig mellemafgrøde\",HYPERLINK(\"https://dyrk-plant.dlbr.dk/Web/(S(ikevr3oqnx5oe2t5cyfyknyq))/forms/Main.aspx?page=Vejledning&cropID=226\",\"Efterafgrøder\"),HYPERLINK(\"https://dyrk-plant.dlbr.dk/Web/(S(0x3ftyiaahcpttq0ljebuany))/forms/Main.aspx?page=Vejledning&cropID=238\",\"Mellemafgrøder\"))","v":"Efterafgrøder"},"xx","xx","xx","xx","xx","xx","xx","xx","xx","xx","xx","xx","xx","xx","xx","xx","xx","xx","xx","xx","xx","xx","xx",null,"xx",null,null,null,null,null,null,null,"xx",null,null,null,null,null,null,null,null,null,null,null,null,"xx","xx","xx","xx","xx","xx","xx","xx","xx","xx","xx","xx","xx","xx","xx","xx","xx","xx","xx","xx","xx","xx",null,"xx",null,null,null,null,null,null,null,null,"xx",null,null,"xx","xx","xx","xx","xx","xx","xx","xx","xx","xx","xx","xx","xx","xx","xx","xx","xx","xx","xx","xx",null,"xx",null,"xx",null,null,null,null,null,null,null,null,"xx",null,null,null,"xx","xx","xx","xx","xx","xx","xx","xx","xx","xx","xx","xx","xx","xx","xx","xx","xx","xx","xx","xx","xx",null,null,null,null,null,null,null,null,null,null,null,null,null,null,null,"xx","xx","xx","xx","xx","xx","xx","xx","xx","xx","xx","xx","xx","xx","xx","xx","xx","xx","xx","xx","xx",null,null,null,null,null,null,null,null,null,null,null,null,0,"xx","xx","xx",99,null,null,null,null,null,0,"xx",null,24,null,null,null,"xx","xx","xx","xx","xx","xx","xx","xx","xx","xx","xx","xx","xx","xx","xx","xx","xx","xx","xx","xx","xx","xx",null,"xx",null,null,null,null,null,null,null,null,null,null,"xx"]
[25,"Honningurt",null,null,{"$f":"IF('Efterafgrøde beslutningsstøtte'!A$7<>\"Pligtig mellemafgrøde\",HYPERLINK(\"https://dyrk-plant.dlbr.dk/Web/(S(ikevr3oqnx5oe2t5cyfyknyq))/forms/Main.aspx?page=Vejledning&cropID=226\",\"Efterafgrøder\"),HYPERLINK(\"https://dyrk-plant.dlbr.dk/Web/(S(0x3ftyiaahcpttq0ljebuany))/forms/Main.aspx?page=Vejledning&cropID=238\",\"Mellemafgrøder\"))","v":"Efterafgrøder"},-2302,1,0,1,0,1,1,1,0,0,0,3,0,2,3,3,3,0,0,0,0,25,0,null,"20. august",null,null,null,null,null,null,null,-2082,null,null,null,null,null,null,null,null,null,null,null,null,-2302,1,0,1,0,1,1,1,0,0,0,3,0,2,3,3,3,0,0,0,25,0,null,"20. august",null,null,null,null,null,null,null,null,-2082,null,null,-2302,"Ja","Nej","Ja","Nej","Ja","Ja","Ja","Nej","Nej","Nej","Meget god","Nej","Over middel","Meget god","Mod de fleste","Aldrig","Nej","Udvintrer","Nej",null,0,null,"20. august",null,null,null,null,null,null,null,null,-2082,null,null,null,5299204,1,0,1,0,1,1,1,0,0,0,9,0,4,9,9,9,0,0,0,625,null,null,null,null,null,null,null,null,null,null,null,null,null,null,null,-2.3460546188844833,0,-0.36514837167011077,0.83666002653407556,-0.6454972243679028,0,0,0,0,-0.60612812535620397,-0.91146543037529992,0.59587957153112403,-0.7385489458759964,7.3323557510676624E-2,1.3405254742109705,0.77702868988581131,0.54173633888596151,-0.36514837167011077,-1.1554933297794647,-0.34259435491376583,0.65036141231594335,null,null,null,null,null,null,null,null,null,null,null,null,238415.34402339722,238415.34402339722,0,238415.34402339722,8,null,null,null,null,null,0,"xx",null,25,null,null,null,"xx","xx","xx","xx","xx","xx","xx","xx","xx","xx","xx","xx","xx","xx","xx","xx","xx","xx","xx","xx","xx","xx",null,"xx",null,null,null,null,null,null,null,null,null,null,"xx"]
[26,"Fodervikke ",null,null,{"$f":"IF('Efterafgrøde beslutningsstøtte'!A$7<>\"Pligtig mellemafgrøde\",HYPERLINK(\"https://dyrk-plant.dlbr.dk/Web/(S(ikevr3oqnx5oe2t5cyfyknyq))/forms/Main.aspx?page=Vejledning&cropID=226\",\"Efterafgrøder\"),HYPERLINK(\"https://dyrk-plant.dlbr.dk/Web/(S(0x3ftyiaahcpttq0ljebuany))/forms/Main.aspx?page=Vejledning&cropID=238\",\"Mellemafgrøder\"))","v":"Efterafgrøder"},"xx","xx","xx","xx","xx","xx","xx","xx","xx","xx","xx","xx","xx","xx","xx","xx","xx","xx","xx","xx","xx","xx","xx",null,"xx",null,null,null,null,null,null,null,"xx",null,null,null,null,null,null,null,null,null,null,null,null,"xx","xx","xx","xx","xx","xx","xx","xx","xx","xx","xx","xx","xx","xx","xx","xx","xx","xx","xx","xx","xx","xx",null,"xx",null,null,null,null,null,null,null,null,"xx",null,null,"xx","xx","xx","xx","xx","xx","xx","xx","xx","xx","xx","xx","xx","xx","xx","xx","xx","xx","xx","xx",null,"xx",null,"xx",null,null,null,null,null,null,null,null,"xx",null,null,null,"xx","xx","xx","xx","xx","xx","xx","xx","xx","xx","xx","xx","xx","xx","xx","xx","xx","xx","xx","xx","xx",null,null,null,null,null,null,null,null,null,null,null,null,null,null,null,"xx","xx","xx","xx","xx","xx","xx","xx","xx","xx","xx","xx","xx","xx","xx","xx","xx","xx","xx","xx","xx",null,null,null,null,null,null,null,null,null,null,null,null,0,"xx","xx","xx",99,null,null,null,null,null,0,"xx",null,26,null,null,null,"xx","xx","xx","xx","xx","xx","xx","xx","xx","xx","xx","xx","xx","xx","xx","xx","xx","xx","xx","xx","xx","xx",null,"xx",null,null,null,null,null,null,null,null,null,null,"xx"]
[27,"Vintervikke",null,null,{"$f":"IF('Efterafgrøde beslutningsstøtte'!A$7<>\"Pligtig mellemafgrøde\",HYPERLINK(\"https://dyrk-plant.dlbr.dk/Web/(S(ikevr3oqnx5oe2t5cyfyknyq))/forms/Main.aspx?page=Vejledning&cropID=226\",\"Efterafgrøder\"),HYPERLINK(\"https://dyrk-plant.dlbr.dk/Web/(S(0x3ftyiaahcpttq0ljebuany))/forms/Main.aspx?page=Vejledning&cropID=238\",\"Mellemafgrøder\"))","v":"Efterafgrøder"},"xx","xx","xx","xx","xx","xx","xx","xx","xx","xx","xx","xx","xx","xx","xx","xx","xx","xx","xx","xx","xx","xx","xx",null,"xx",null,null,null,null,null,null,null,"xx",null,null,null,null,null,null,null,null,null,null,null,null,"xx","xx","xx","xx","xx","xx","xx",{"$f":"M67","v":"xx"},"xx","xx","xx","xx","xx","xx","xx","xx","xx","xx","xx","xx","xx","xx",null,"xx",null,null,null,null,null,null,null,null,"xx",null,null,"xx","xx","xx","xx","xx","xx","xx","xx","xx","xx","xx","xx","xx","xx","xx","xx","xx","xx","xx","xx",null,"xx",null,"xx",null,null,null,null,null,null,null,null,"xx",null,null,null,"xx","xx","xx","xx","xx","xx","xx","xx","xx","xx","xx","xx","xx","xx","xx","xx","xx","xx","xx","xx","xx",null,null,null,null,null,null,null,null,null,null,null,null,null,null,null,"xx","xx","xx","xx","xx","xx","xx","xx","xx","xx","xx","xx","xx","xx","xx","xx","xx","xx","xx","xx","xx",null,null,null,null,null,null,null,null,null,null,null,null,0,"xx","xx","xx",99,null,null,null,null,null,0,"xx",null,27,null,null,null,"xx","xx","xx","xx","xx","xx","xx","xx","xx","xx","xx","xx","xx","xx","xx","xx","xx","xx","xx","xx","xx","xx",null,"xx",null,null,null,null,null,null,null,null,null,null,"xx"]
[28,"Alexandrinekløver",null,null,{"$f":"IF('Efterafgrøde beslutningsstøtte'!A$7<>\"Pligtig mellemafgrøde\",HYPERLINK(\"https://dyrk-plant.dlbr.dk/Web/(S(ikevr3oqnx5oe2t5cyfyknyq))/forms/Main.aspx?page=Vejledning&cropID=226\",\"Efterafgrøder\"),HYPERLINK(\"https://dyrk-plant.dlbr.dk/Web/(S(0x3ftyiaahcpttq0ljebuany))/forms/Main.aspx?page=Vejledning&cropID=238\",\"Mellemafgrøder\"))","v":"Efterafgrøder"},"xx","xx","xx","xx","xx","xx","xx","xx","xx","xx","xx","xx","xx","xx","xx","xx","xx","xx","xx","xx","xx","xx","xx",null,"xx",null,null,null,null,null,null,null,"xx",null,null,null,null,null,null,null,null,null,null,null,null,"xx","xx","xx","xx",{"$f":"J68","v":"xx"},"xx","xx","xx","xx","xx","xx","xx","xx","xx","xx","xx","xx","xx","xx","xx","xx","xx",null,"xx",null,null,null,null,null,null,null,null,"xx",null,null,"xx","xx","xx","xx","xx","xx","xx","xx","xx","xx","xx","xx","xx","xx","xx","xx","xx","xx","xx","xx",null,"xx",null,"xx",null,null,null,null,null,null,null,null,"xx",null,null,null,"xx","xx","xx","xx","xx","xx","xx","xx","xx","xx","xx","xx","xx","xx","xx","xx","xx","xx","xx","xx","xx",null,null,null,null,null,null,null,null,null,null,null,null,null,null,null,"xx","xx","xx","xx","xx","xx","xx","xx","xx","xx","xx","xx","xx","xx","xx","xx","xx","xx","xx","xx","xx",null,null,null,null,null,null,null,null,null,null,null,null,0,"xx","xx","xx",99,null,null,null,null,null,0,"xx",null,28,null,null,null,"xx","xx","xx","xx","xx","xx","xx","xx","xx","xx","xx","xx","xx","xx","xx","xx","xx","xx","xx","xx","xx","xx",null,"xx",null,null,null,null,null,null,null,null,null,null,"xx"]
[29,"Hvidkløver",null,null,{"$f":"IF('Efterafgrøde beslutningsstøtte'!A$7<>\"Pligtig mellemafgrøde\",HYPERLINK(\"https://dyrk-plant.dlbr.dk/Web/(S(ikevr3oqnx5oe2t5cyfyknyq))/forms/Main.aspx?page=Vejledning&cropID=226\",\"Efterafgrøder\"),HYPERLINK(\"https://dyrk-plant.dlbr.dk/Web/(S(0x3ftyiaahcpttq0ljebuany))/forms/Main.aspx?page=Vejledning&cropID=238\",\"Mellemafgrøder\"))","v":"Efterafgrøder"},"xx","xx","xx","xx","xx","xx","xx","xx","xx","xx","xx","xx","xx","xx","xx","xx","xx","xx","xx","xx","xx","xx","xx",null,"xx",null,null,null,null,null,null,null,"xx",null,null,null,null,null,null,null,null,null,null,null,null,"xx","xx","xx","xx","xx","xx","xx","xx","xx","xx","xx","xx","xx","xx","xx","xx","xx","xx","xx","xx","xx","xx",null,"xx",null,null,null,null,null,null,null,null,"xx",null,null,"xx","xx","xx","xx","xx","xx","xx","xx","xx","xx","xx","xx","xx","xx","xx","xx","xx","xx","xx","xx",null,"xx",null,"xx",null,null,null,null,null,null,null,null,"xx",null,null,null,"xx","xx","xx","xx","xx","xx","xx","xx","xx","xx","xx","xx","xx","xx","xx","xx","xx","xx","xx","xx","xx",null,null,null,null,null,null,null,null,null,null,null,null,null,null,null,"xx","xx","xx","xx","xx","xx","xx","xx","xx","xx","xx","xx","xx","xx","xx","xx","xx","xx","xx","xx","xx",null,null,null,null,null,null,null,null,null,null,null,null,0,"xx","xx","xx",99,null,null,null,null,null,0,"xx",null,29,null,null,null,"xx","xx","xx","xx",{"$f":"IF($GS69=0,\"xx\",INDEX($CH$41:$DN$112,$GT69,HD$12))","v":"xx"},"xx","xx","xx","xx","xx","xx","xx","xx","xx","xx","xx","xx","xx","xx","xx","xx","xx",null,"xx",null,null,null,null,null,null,null,null,null,null,"xx"]
[30,"Olieræddike og vintervikke",null,null,{"$f":"IF('Efterafgrøde beslutningsstøtte'!A$7<>\"Pligtig mellemafgrøde\",HYPERLINK(\"https://dyrk-plant.dlbr.dk/Web/(S(ikevr3oqnx5oe2t5cyfyknyq))/forms/Main.aspx?page=Vejledning&cropID=226\",\"Efterafgrøder\"),HYPERLINK(\"https://dyrk-plant.dlbr.dk/Web/(S(0x3ftyiaahcpttq0ljebuany))/forms/Main.aspx?page=Vejledning&cropID=238\",\"Mellemafgrøder\"))","v":"Efterafgrøder"},-828,1,0,0,0,1,1,1,0,0,0,3,1,3,3,3,2,0,0,0,0,30,0,null,"20. august",null,null,null,null,null,null,null,52,null,null,null,null,null,null,null,null,null,null,null,null,{"$f":"F70","v":-828},1,0,0,0,1,1,1,0,0,0,3,1,3,3,3,2,0,0,0,30,0,null,"20. august",null,null,null,null,null,null,null,null,52,null,null,-828,"Ja","Nej","Nej","Nej","Ja","Ja","Ja","Nej","Nej","Nej","Meget god","Ja","Stor","Meget god","Mod de fleste","I mindre grad","Nej","Udvintrer","Nej",null,0,null,"20. august",null,null,null,null,null,null,null,null,52,null,null,null,685584,1,0,0,0,1,1,1,0,0,0,9,1,9,9,9,4,0,0,0,900,null,null,null,null,null,null,null,null,null,null,null,null,null,null,null,0.27692080286710097,0,-0.36514837167011077,-1.1952286093343938,-0.6454972243679028,0,0,0,0,-0.60612812535620397,-0.91146543037529992,0.59587957153112403,1.3540064007726598,1.3198240351921791,1.3405254742109705,0.77702868988581131,-0.48154341234307707,-0.36514837167011077,-1.1554933297794647,-0.34259435491376583,1.1228461990412013,null,null,null,null,null,null,null,null,null,null,null,null,239933.68394010037,{"$f":"IF(FB70=\"xx\",\"xx\",GI70)","v":239933.68394010037},0,239933.68394010037,2,null,null,null,null,null,{"$f":"COUNTIF($GM$41:$GM$112,GV70)","v":0},{"$f":"IF(GS70>0,MATCH(GV70,$GM$41:$GM$112,0),\"xx\")","v":"xx"},null,30]
[31,"Hvidkløver/alm. rajgræs",null,null,{"$f":"IF('Efterafgrøde beslutningsstøtte'!A$7<>\"Pligtig mellemafgrøde\",HYPERLINK(\"https://dyrk-plant.dlbr.dk/Web/(S(ikevr3oqnx5oe2t5cyfyknyq))/forms/Main.aspx?page=Vejledning&cropID=226\",\"Efterafgrøder\"),HYPERLINK(\"https://dyrk-plant.dlbr.dk/Web/(S(0x3ftyiaahcpttq0ljebuany))/forms/Main.aspx?page=Vejledning&cropID=238\",\"Mellemafgrøder\"))","v":"Efterafgrøder"},-185,1,0,0,1,1,1,1,0,3,3,2,1,3,0,1,3,0,0,3,0,31,0,null,"1. august",null,null,null,null,null,null,null,"-",null,null,null,null,null,null,null,null,null,null,null,null,-185,1,0,0,1,1,1,1,0,3,3,2,1,3,0,1,3,0,3,0,31,0,null,"1. august",null,null,null,null,null,null,null,null,"-",null,null,-185,"Ja","Nej","Nej","Ja","Ja","Ja","Ja","Nej","Meget god","Meget god","God","Ja","Stor","Nej","Mod visse","Aldrig","Nej","Meget god","Nej",null,0,null,"1. august",null,null,null,null,null,null,null,null,"-",null,null,null,34225,1,0,0,1,1,1,1,0,9,9,4,1,9,0,1,9,0,9,0,961,null,null,null,null,null,null,null,null,null,null,null,null,null,null,null,1.4211359970233211,0,-0.36514837167011077,-1.1952286093343938,1.5491933384829666,0,0,0,0,1.7717591356565963,1.6710199556880498,-0.85125653075874907,1.3540064007726598,1.3198240351921791,-1.0169503597462535,-0.87415727612153726,0.54173633888596151,-0.36514837167011077,1.0271051820261909,-0.34259435491376583,1.2173431563862529,null,null,null,null,null,null,null,null,null,null,null,null,-339967.28991956788,{"$f":"IF(FB71=\"xx\",\"xx\",GI71)","v":-339967.28991956788},0,-339967.28991956788,13,null,null,null,null,null,{"$f":"COUNTIF($GM$41:$GM$112,GV71)","v":0},{"$f":"IF(GS71>0,MATCH(GV71,$GM$41:$GM$112,0),\"xx\")","v":"xx"},null,31]
[32,"Rødkløver/strandsvingel",null,null,{"$f":"IF('Efterafgrøde beslutningsstøtte'!A$7<>\"Pligtig mellemafgrøde\",HYPERLINK(\"https://dyrk-plant.dlbr.dk/Web/(S(ikevr3oqnx5oe2t5cyfyknyq))/forms/Main.aspx?page=Vejledning&cropID=226\",\"Efterafgrøder\"),HYPERLINK(\"https://dyrk-plant.dlbr.dk/Web/(S(0x3ftyiaahcpttq0ljebuany))/forms/Main.aspx?page=Vejledning&cropID=238\",\"Mellemafgrøder\"))","v":"Efterafgrøder"},-1355,1,0,0,1,1,1,1,0,1,3,1,1,3,0,1,3,0,0,3,0,32,0,null,"1. august",null,null,null,null,null,null,null,"-",null,null,null,null,null,null,null,null,null,null,null,null,-1355,1,0,0,1,1,1,1,0,1,3,1,1,3,0,1,3,0,3,0,32,0,null,"1. august",null,null,null,null,null,null,null,null,"-",null,null,-1355,"Ja","Nej","Nej","Ja","Ja","Ja","Ja","Nej","Brugbar","Meget god","Brugbar","Ja","Stor","Nej","Mod visse","Aldrig","Nej","Meget god","Nej",null,0,null,"1. august",null,null,null,null,null,null,null,null,"-",null,null,null,1836025,1,0,0,1,1,1,1,0,1,9,1,1,9,0,1,9,0,9,0,1024,null,null,null,null,null,null,null,null,null,null,null,null,null,null,null,-0.66087298767773262,0,-0.36514837167011077,-1.1952286093343938,1.5491933384829666,0,0,0,0,0.18650096164806279,1.6710199556880498,-2.2983926330486222,1.3540064007726598,1.3198240351921791,-1.0169503597462535,-0.87415727612153726,0.54173633888596151,-0.36514837167011077,1.0271051820261909,-0.34259435491376583,1.3118401137313045,null,null,null,null,null,null,null,null,null,null,null,null,-919986.95599847916,{"$f":"IF(FB72=\"xx\",\"xx\",GI72)","v":-919986.95599847916},0,-919986.95599847916,16,null,null,null,null,null,{"$f":"COUNTIF($GM$41:$GM$112,GV72)","v":0},{"$f":"IF(GS72>0,MATCH(GV72,$GM$41:$GM$112,0),\"xx\")","v":"xx"},null,32]
[33,"Vintervikke/vinterrug",null,null,{"$f":"IF('Efterafgrøde beslutningsstøtte'!A$7<>\"Pligtig mellemafgrøde\",HYPERLINK(\"https://dyrk-plant.dlbr.dk/Web/(S(ikevr3oqnx5oe2t5cyfyknyq))/forms/Main.aspx?page=Vejledning&cropID=226\",\"Efterafgrøder\"),HYPERLINK(\"https://dyrk-plant.dlbr.dk/Web/(S(0x3ftyiaahcpttq0ljebuany))/forms/Main.aspx?page=Vejledning&cropID=238\",\"Mellemafgrøder\"))","v":"Efterafgrøder"},-969,1,0,0,1,1,1,1,0,0,0,3,1,3,0,3,3,0,0,3,0,33,0,null,"20. august",null,null,null,null,null,null,null,-529,null,null,null,null,null,null,null,null,null,null,null,null,-969,1,0,0,1,1,1,1,0,0,0,3,1,3,0,3,3,0,3,0,33,0,null,"20. august",null,null,null,null,null,null,null,null,-529,null,null,-969,"Ja","Nej","Nej","Ja","Ja","Ja","Ja","Nej","Nej","Nej","Meget god","Ja","Stor","Nej","Mod de fleste","Aldrig","Nej","Meget god","Nej",null,0,null,"20. august",null,null,null,null,null,null,null,null,-529,null,null,null,938961,1,0,0,1,1,1,1,0,0,0,9,1,9,0,9,9,0,9,0,1089,null,null,null,null,null,null,null,null,null,null,null,null,null,null,null,2.6012027787743194E-2,0,-0.36514837167011077,-1.1952286093343938,1.5491933384829666,0,0,0,0,-0.60612812535620397,-0.91146543037529992,0.59587957153112403,1.3540064007726598,1.3198240351921791,-1.0169503597462535,0.77702868988581131,0.54173633888596151,-0.36514837167011077,1.0271051820261909,-0.34259435491376583,1.4063370710763561,null,null,null,null,null,null,null,null,null,null,null,null,239963.15763329866,{"$f":"IF(FB73=\"xx\",\"xx\",GI73)","v":239963.15763329866},0,239963.15763329866,1,null,null,null,null,null,{"$f":"COUNTIF($GM$41:$GM$112,GV73)","v":0},{"$f":"IF(GS73>0,MATCH(GV73,$GM$41:$GM$112,0),\"xx\")","v":"xx"},null,33]
[34,"Kløvergræs (blanding)",null,null,{"$f":"IF('Efterafgrøde beslutningsstøtte'!A$7<>\"Pligtig mellemafgrøde\",HYPERLINK(\"https://dyrk-plant.dlbr.dk/Web/(S(ikevr3oqnx5oe2t5cyfyknyq))/forms/Main.aspx?page=Vejledning&cropID=226\",\"Efterafgrøder\"),HYPERLINK(\"https://dyrk-plant.dlbr.dk/Web/(S(0x3ftyiaahcpttq0ljebuany))/forms/Main.aspx?page=Vejledning&cropID=238\",\"Mellemafgrøder\"))","v":"Efterafgrøder"},-2145,1,0,0,1,1,1,1,0,3,3,3,1,3,0,1,3,0,0,3,0,34,{"$f":"VLOOKUP($A74,Karaktermatrice,AB$38,FALSE)","v":0},null,{"$f":"VLOOKUP($A74,Karaktermatrice,AD$38,FALSE)","v":"1. august"},null,null,null,null,null,null,null,"-",null,null,null,null,null,null,null,null,null,null,null,null,-2145,1,0,0,1,1,1,1,0,3,3,3,1,3,0,1,3,0,3,0,34,0,null,"1. august",null,null,null,null,null,null,null,null,"-",null,null,-2145,"Ja","Nej","Nej","Ja","Ja","Ja","Ja","Nej","Meget god","Meget god","Meget god","Ja","Stor","Nej","Mod visse","Aldrig","Nej","Meget god","Nej",null,{"$f":"BT74","v":0},null,{"$f":"BV74","v":"1. august"},null,null,null,null,null,null,null,null,"-",null,null,null,4601025,1,0,0,1,1,1,1,0,9,9,9,1,9,0,1,9,0,9,0,1156,null,null,null,null,null,null,null,null,null,null,null,null,null,null,null,-2.0666739260656239,0,-0.36514837167011077,-1.1952286093343938,1.5491933384829666,0,0,0,0,1.7717591356565963,1.6710199556880498,0.59587957153112403,1.3540064007726598,1.3198240351921791,-1.0169503597462535,-0.87415727612153726,0.54173633888596151,-0.36514837167011077,1.0271051820261909,-0.34259435491376583,1.5008340284214077,null,null,null,null,null,null,null,null,null,null,null,null,239824.88290036822,{"$f":"IF(FB74=\"xx\",\"xx\",GI74)","v":239824.88290036822},0,239824.88290036822,3,null,null,null,null,null,{"$f":"COUNTIF($GM$41:$GM$112,GV74)","v":0},{"$f":"IF(GS74>0,MATCH(GV74,$GM$41:$GM$112,0),\"xx\")","v":"xx"},null,34]
[]
[]
[]
[null,null,null,null,null,null,null,null,null,null,null,null,null,null,null,null,null,null,null,null,null,null,null," "]
[null,null,null,null,null,null,null,null,null,null,null,null,null,null,null,null,null,null,null,null,null,null,null,null,null,null,null,null,null,null,null,null,null,null,null,null,null,null,null,null,null,null,null,null,null,null,null,null,null,null,null,null,null,null,null,null,null,null,null,null,null,null,null,null,null,null,null,null,null,null,null,null,null,null,null,null,null,null,null,null,null,null,null,null,null,null,null,null,null,null,null,null,null,null,null,null,null,null,null,null,null,null,null,null,null,null,null,null,null,null,null,null,null,null,null,null,null,null,null,null,null,null,null,null,null,null,null,null,null,null,null,null,null,null,null,null,null,null,null,null,null,null,null,null,null,null,null,null,null,null,null,null,null,null,null,null,null,null,null,null,null,null,null,null,null,null,null,null,null,null,null,null,null,null,null,null,null,null,null,null,null,null,null,null,null,null,null,null,null,null,null,null,null,null,null,null,null,null,null,null,null,null,null,null,null,null,"Frontend output"]
[null,null,null,null,null,null,null,null,null,null,null,null,null,null,null,null,null,null,null,null,null,null,null,null,null,null,null,null,null,null,null,null,null,null,null,null,null,null,null,null,null,null,null,null,null,null,null,null,null,null,null,null,null,null,null,null,null,null,null,null,null,null,null,null,null,null,null,null,null,null,null,null,null,null,null,null,null,null,null,null,null,null,null,null,null,null,null,null,null,null,null,null,null,null,null,null,null,null,null,null,null,null,null,null,null,null,null,null,null,null,null,null,null,null,null,null,null,null,null,null,null,null,null,null,null,null,null,null,null,null,null,null,null,null,null,null,null,null,null,null,null,null,null,null,null,null,null,null,null,null,null,null,null,null,null,null,null,null,null,null,null,null,null,null,null,null,null,null,null,null,null,null,null,null,null,null,null,null,null,null,null,null,null,null,null,null,null,null,null,null,null,null,null,null,null,null,null,null,null,null,null,null,null,null,null,null,null,{"$f":"GZ40","v":"Efterafgrøde"},"Seneste lovlige såtidspunkt","Egnet til udsåning efter tidlig høst (10. august)","Kvælstoffikserende","Stor kvælstof-eftervirkning","Bruttoomkostninger","Nettoomkostninger","Er afgrøden robust mod ukrudtsmidler?","Afgrøden opformere kålbrok","Der findes sorter, der er sanerende for roecystenematoder","Vinterfast","Egen udsæd kan anvendes","Hurtig og dyb rodvækst på lerjord","Pligtig efterafgrøde","Pligtig mellemafgrøde","MFO-efterafgrøde i blanding2)","MFO-udlæg","Miljø-efterafgrøder","Frivillig efterafgrøde","Grønne marker (2,3 DE-brug)","Egnet til udlæg efterår i vinterkorn","Egnet til udlæg forår",null,null,null,null,null,null,null,null,null,null,null,null,{"$f":"IF(IH40=\"xx\",\"\",IH40)","v":"Vejledning"}]
[null,null,null,null,null,null,null,null,null,null,null,null,null,null,null,null,null,null,null,null,null,null,null,null,null,null,null,null,null,null,null,null,null,null,null,null,null,null,null,null,null,null,null,null,null,null,null,null,null,null,null,null,null,null,null,null,null,null,null,null,null,null,null,null,null,null,null,null,null,null,null,null,null,null,null,null,null,null,null,null,null,null,null,null,null,null,null,null,null,null,null,null,null,null,null,null,null,null,null,null,null,null,null,null,null,null,null,null,null,null,null,null,null,null,null,null,null,null,null,null,null,null,null,null,null,null,null,null,null,null,null,null,null,null,null,null,null,null,null,null,null,null,null,null,null,null,null,null,null,null,null,null,null,null,null,null,null,null,null,null,null,null,null,null,null,null,null,null,null,null,null,null,null,null,null,null,null,null,null,null,null,null,null,null,null,null,null,null,null,null,null,null,null,null,null,null,null,null,null,null,null,null,null,null,null,null,null,{"$f":"IF(GZ41=\"xx\",\"\",GZ41)","v":"Vintervikke/vinterrug"},{"$f":"IF(HA41=\"xx\",\"\",HA41)","v":"20. august"},"Meget god","Ja","Stor",-969,-529,"Mod de fleste","Aldrig","Nej","Meget god","Nej","Nej","Ja","Nej","Nej","Ja","Ja","Ja","Ja","Nej","Nej",null,null,null,null,null,null,null,null,null,null,null,null,{"$f":"IF(IH41=\"xx\",\"\",IH41)","v":"Efterafgrøder"}]
[null,null,null,null,null,null,null,null,null,null,null,null,null,null,null,null,null,null,null,null,null,null,null,null,null,null,null,null,null,null,null,null,null,null,null,null,null,null,null,null,null,null,null,null,null,null,null,null,null,null,null,null,null,null,null,null,null,null,null,null,null,null,null,null,null,null,null,null,null,null,null,null,null,null,null,null,null,null,null,null,null,null,null,null,null,null,null,null,null,null,null,null,null,null,null,null,null,null,null,null,null,null,null,null,null,null,null,null,null,null,null,null,null,null,null,null,null,null,null,null,null,null,null,null,null,null,null,null,null,null,null,null,null,null,null,null,null,null,null,null,null,null,null,null,null,null,null,null,null,null,null,null,null,null,null,null,null,null,null,null,null,null,null,null,null,null,null,null,null,null,null,null,null,null,null,null,null,null,null,null,null,null,null,null,null,null,null,null,null,null,null,null,null,null,null,null,null,null,null,null,null,null,null,null,null,null,null,{"$f":"IF(GZ42=\"xx\",\"\",GZ42)","v":"Olieræddike og vintervikke"},"20. august","Meget god","Ja","Stor",-828,52,"Mod de fleste","I mindre grad","Nej","Udvintrer","Nej","Meget god","Ja","Nej","Nej","Nej","Ja","Ja","Ja","Nej","Nej",null,null,null,null,null,null,null,null,null,null,null,null,{"$f":"IF(IH42=\"xx\",\"\",IH42)","v":"Efterafgrøder"}]
[null,null,null,null,null,null,null,null,null,null,null,null,null,null,null,null,null,null,null,null,null,null,null,null,null,null,null,null,null,null,null,null,null,null,null,null,null,null,null,null,null,null,null,null,null,null,null,null,null,null,null,null,null,null,null,null,null,null,null,null,null,null,null,null,null,null,null,null,null,null,null,null,null,null,null,null,null,null,null,null,null,null,null,null,null,null,null,null,null,null,null,null,null,null,null,null,null,null,null,null,null,null,null,null,null,null,null,null,null,null,null,null,null,null,null,null,null,null,null,null,null,null,null,null,null,null,null,null,null,null,null,null,null,null,null,null,null,null,null,null,null,null,null,null,null,null,null,null,null,null,null,null,null,null,null,null,null,null,null,null,null,null,null,null,null,null,null,null,null,null,null,null,null,null,null,null,null,null,null,null,null,null,null,null,null,null,null,null,null,null,null,null,null,null,null,null,null,null,null,null,null,null,null,null,null,null,null,{"$f":"IF(GZ43=\"xx\",\"\",GZ43)","v":"Kløvergræs (blanding)"},"1. august","Meget god","Ja","Stor",-2145,"-","Mod visse","Aldrig","Nej","Meget god","Nej","Nej","Ja","Nej","Nej","Ja","Ja","Ja","Ja","Nej","Meget god",null,null,null,null,null,null,null,null,null,null,null,null,"Efterafgrøder"]
[null,null,null,null,null,null,null,null,null,null,null,null,null,null,null,null,null,null,null,null,null,null,null,null,null,null,null,null,null,null,null,null,null,null,null,null,null,null,null,null,null,null,null,null,null,null,null,null,null,null,null,null,null,null,null,null,null,null,null,null,null,null,null,null,null,null,null,null,null,null,null,null,null,null,null,null,null,null,null,null,null,null,null,null,null,null,null,null,null,null,null,null,null,null,null,null,null,null,null,null,null,null,null,null,null,null,null,null,null,null,null,null,null,null,null,null,null,null,null,null,null,null,null,null,null,null,null,null,null,null,null,null,null,null,null,null,null,null,null,null,null,null,null,null,null,null,null,null,null,null,null,null,null,null,null,null,null,null,null,null,null,null,null,null,null,null,null,null,null,null,null,null,null,null,null,null,null,null,null,null,null,null,null,null,null,null,null,null,null,null,null,null,null,null,null,null,null,null,null,null,null,null,null,null,null,null,null,{"$f":"IF(GZ44=\"xx\",\"\",GZ44)","v":"Vårbyg /Vikke /Gul Sennep"},"20. august","Meget god","Ja","Over middel",-789,-348.5,"Nej","Aldrig","Nej","Dårlig","Nej","Rimelig","Ja","Nej","Nej","Nej","Ja","Ja","Ja","Nej","Nej",null,null,null,null,null,null,null,null,null,null,null,null,"Efterafgrøder"]
[null,null,null,null,null,null,null,null,null,null,null,null,null,null,null,null,null,null,null,null,null,null,null,null,null,null,null,null,null,null,null,null,null,null,null,null,null,null,null,null,null,null,null,null,null,null,null,null,null,null,null,null,null,null,null,null,null,null,null,null,null,null,null,null,null,null,null,null,null,null,null,null,null,null,null,null,null,null,null,null,null,null,null,null,null,null,null,null,null,null,null,null,null,null,null,null,null,null,null,null,null,null,null,null,null,null,null,null,null,null,null,null,null,null,null,null,null,null,null,null,null,null,null,null,null,null,null,null,null,null,null,null,null,null,null,null,null,null,null,null,null,null,null,null,null,null,null,null,null,null,null,null,null,null,null,null,null,null,null,null,null,null,null,null,null,null,null,null,null,null,null,null,null,null,null,null,null,null,null,null,null,null,null,null,null,null,null,null,null,null,null,null,null,null,null,null,null,null,null,null,null,null,null,null,null,null,null,{"$f":"IF(GZ45=\"xx\",\"\",GZ45)","v":"Olieræddike"},"20. august","Meget god","Nej","Over middel",-649,231,"Mod de fleste","I mindre grad","Mange","Udvintrer","Nej","Meget god","Ja","Ja","Ja","Nej","Ja","Ja","Ja","Nej","Nej",null,null,null,null,null,null,null,null,null,null,null,null,"Efterafgrøder"]
[null,null,null,null,null,null,null,null,null,null,null,null,null,null,null,null,null,null,null,null,null,null,null,null,null,null,null,null,null,null,null,null,null,null,null,null,null,null,null,null,null,null,null,null,null,null,null,null,null,null,null,null,null,null,null,null,null,null,null,null,null,null,null,null,null,null,null,null,null,null,null,null,null,null,null,null,null,null,null,null,null,null,null,null,null,null,null,null,null,null,null,null,null,null,null,null,null,null,null,null,null,null,null,null,null,null,null,null,null,null,null,null,null,null,null,null,null,null,null,null,null,null,null,null,null,null,null,null,null,null,null,null,null,null,null,null,null,null,null,null,null,null,null,null,null,null,null,null,null,null,null,null,null,null,null,null,null,null,null,null,null,null,null,null,null,null,null,null,null,null,null,null,null,null,null,null,null,null,null,null,null,null,null,null,null,null,null,null,null,null,null,null,null,null,null,null,null,null,null,null,null,null,null,null,null,null,null,{"$f":"IF(GZ46=\"xx\",\"\",GZ46)","v":"Gul sennep"},"20. august","Meget god","Nej","Over middel",-503,377,"Mod de fleste","Altid","Mange","Udvintrer","Nej","God","Ja","Ja","Ja","Nej","Ja","Ja","Ja","Nej","Nej",null,null,null,null,null,null,null,null,null,null,null,null,"Efterafgrøder"]
[null,null,null,null,null,null,null,null,null,null,null,null,null,null,null,null,null,null,null,null,null,null,null,null,null,null,null,null,null,null,null,null,null,null,null,null,null,null,null,null,null,null,null,null,null,null,null,null,null,null,null,null,null,null,null,null,null,null,null,null,null,null,null,null,null,null,null,null,null,null,null,null,null,null,null,null,null,null,null,null,null,null,null,null,null,null,null,null,null,null,null,null,null,null,null,null,null,null,null,null,null,null,null,null,null,null,null,null,null,null,null,null,null,null,null,null,null,null,null,null,null,null,null,null,null,null,null,null,null,null,null,null,null,null,null,null,null,null,null,null,null,null,null,null,null,null,null,null,null,null,null,null,null,null,null,null,null,null,null,null,null,null,null,null,null,null,null,null,null,null,null,null,null,null,null,null,null,null,null,null,null,null,null,null,null,null,null,null,null,null,null,null,null,null,null,null,null,null,null,null,null,null,null,null,null,null,null,{"$f":"IF(GZ47=\"xx\",\"\",GZ47)","v":"Foderradise (Strukturator)"},"20. august","Meget god","Nej","Over middel",-913,-33,"Mod de fleste","I mindre grad","Nej","Udvintrer",{"$f":"IF(HK47=\"xx\",\"\",HK47)","v":"Nej"},"Meget god","Ja","Nej","Ja","Nej","Ja","Ja","Ja","Nej","Nej",null,null,null,null,null,null,null,null,null,null,null,null,"Efterafgrøder"]
[null,null,null,null,null,null,null,null,null,null,null,null,null,null,null,null,null,null,null,null,null,null,null,null,null,null,null,null,null,null,null,null,null,null,null,null,null,null,null,null,null,null,null,null,null,null,null,null,null,null,null,null,null,null,null,null,null,null,null,null,null,null,null,null,null,null,null,null,null,null,null,null,null,null,null,null,null,null,null,null,null,null,null,null,null,null,null,null,null,null,null,null,null,null,null,null,null,null,null,null,null,null,null,null,null,null,null,null,null,null,null,null,null,null,null,null,null,null,null,null,null,null,null,null,null,null,null,null,null,null,null,null,null,null,null,null,null,null,null,null,null,null,null,null,null,null,null,null,null,null,null,null,null,null,null,null,null,null,null,null,null,null,null,null,null,null,null,null,null,null,null,null,null,null,null,null,null,null,null,null,null,null,null,null,null,null,null,null,null,null,null,null,null,null,null,null,null,null,null,null,null,null,null,null,null,null,null,{"$f":"IF(GZ48=\"xx\",\"\",GZ48)","v":"Honningurt"},"20. august","Meget god","Nej","Over middel",-2302,-2082,"Mod de fleste","Aldrig","Nej","Udvintrer","Nej","Meget god","Ja","Nej","Ja","Nej","Ja","Ja","Ja","Nej","Nej",null,null,null,null,null,null,null,null,null,null,null,null,"Efterafgrøder"]
[null,null,null,null,null,null,null,null,null,null,null,null,null,null,null,null,null,null,null,null,null,null,null,null,null,null,null,null,null,null,null,null,null,null,null,null,null,null,null,null,null,null,null,null,null,null,null,null,null,null,null,null,null,null,null,null,null,null,null,null,null,null,null,null,null,null,null,null,null,null,null,null,null,null,null,null,null,null,null,null,null,null,null,null,null,null,null,null,null,null,null,null,null,null,null,null,null,null,null,null,null,null,null,null,null,null,null,null,null,null,null,null,null,null,null,null,null,null,null,null,null,null,null,null,null,null,null,null,null,null,null,null,null,null,null,null,null,null,null,null,null,null,null,null,null,null,null,null,null,null,null,null,null,null,null,null,null,null,null,null,null,null,null,null,null,null,null,null,null,null,null,null,null,null,null,null,null,null,null,null,null,null,null,null,null,null,null,null,null,null,null,null,null,null,null,null,null,null,null,null,null,null,null,null,null,null,null,{"$f":"IF(GZ49=\"xx\",\"\",GZ49)","v":"Vinterrug "},"20. august","Meget god","Nej","Middel",-849,-409,"Mod de fleste","Aldrig","Nej","Meget god","Ja","Rimelig","Ja","Nej","Ja","Nej","Ja","Ja","Ja","Nej","Nej",null,null,null,null,null,null,null,null,null,null,null,null,"Efterafgrøder"]
[null,null,null,null,null,null,null,null,null,null,null,null,null,null,null,null,null,null,null,null,null,null,null,null,null,null,null,null,null,null,null,null,null,null,null,null,null,null,null,null,null,null,null,null,null,null,null,null,null,null,null,null,null,null,null,null,null,null,null,null,null,null,null,null,null,null,null,null,null,null,null,null,null,null,null,null,null,null,null,null,null,null,null,null,null,null,null,null,null,null,null,null,null,null,null,null,null,null,null,null,null,null,null,null,null,null,null,null,null,null,null,null,null,null,null,null,null,null,null,null,null,null,null,null,null,null,null,null,null,null,null,null,null,null,null,null,null,null,null,null,null,null,null,null,null,null,null,null,null,null,null,null,null,null,null,null,null,null,null,null,null,null,null,null,null,null,null,null,null,null,null,null,null,null,null,null,null,null,null,null,null,null,null,null,null,null,null,null,null,null,null,null,null,null,null,null,null,null,null,null,null,null,null,null,null,null,null,{"$f":"IF(GZ50=\"xx\",\"\",GZ50)","v":"Havre"},"20. august","Meget god","Nej","Middel",-877,-657,"Mod de fleste","Aldrig","Nej","Dårlig","Ja","Rimelig","Ja","Nej","Ja","Nej","Ja","Ja","Ja","Nej","Nej",null,null,null,null,null,null,null,null,null,null,null,null,"Efterafgrøder"]
[null,null,null,null,null,null,null,null,null,null,null,null,null,null,null,null,null,null,null,null,null,null,null,null,null,null,null,null,null,null,null,null,null,null,null,null,null,null,null,null,null,null,null,null,null,null,null,null,null,null,null,null,null,null,null,null,null,null,null,null,null,null,null,null,null,null,null,null,null,null,null,null,null,null,null,null,null,null,null,null,null,null,null,null,null,null,null,null,null,null,null,null,null,null,null,null,null,null,null,null,null,null,null,null,null,null,null,null,null,null,null,null,null,null,null,null,null,null,null,null,null,null,null,null,null,null,null,null,null,null,null,null,null,null,null,null,null,null,null,null,null,null,null,null,null,null,null,null,null,null,null,null,null,null,null,null,null,null,null,null,null,null,null,null,null,null,null,null,null,null,null,null,null,null,null,null,null,null,null,null,null,null,null,null,null,null,null,null,null,null,null,null,null,null,null,null,null,null,null,null,null,null,null,null,null,null,null,{"$f":"IF(GZ51=\"xx\",\"\",GZ51)","v":"Vårbyg"},"20. august","Meget god","Nej","Middel",-877,-657,"Mod de fleste","Aldrig","Nej","Dårlig","Ja",{"$f":"IF(HL51=\"xx\",\"\",HL51)","v":"Nej"},"Ja","Nej","Ja","Nej","Ja","Ja","Ja","Nej","Nej",null,null,null,null,null,null,null,null,null,null,null,null,"Efterafgrøder"]
[null,null,null,null,null,null,null,null,null,null,null,null,null,null,null,null,null,null,null,null,null,null,null,null,null,null,null,null,null,null,null,null,null,null,null,null,null,null,null,null,null,null,null,null,null,null,null,null,null,null,null,null,null,null,null,null,null,null,null,null,null,null,null,null,null,null,null,null,null,null,null,null,null,null,null,null,null,null,null,null,null,null,null,null,null,null,null,null,null,null,null,null,null,null,null,null,null,null,null,null,null,null,null,null,null,null,null,null,null,null,null,null,null,null,null,null,null,null,null,null,null,null,null,null,null,null,null,null,null,null,null,null,null,null,null,null,null,null,null,null,null,null,null,null,null,null,null,null,null,null,null,null,null,null,null,null,null,null,null,null,null,null,null,null,null,null,null,null,null,null,null,null,null,null,null,null,null,null,null,null,null,null,null,null,null,null,null,null,null,null,null,null,null,null,null,null,null,null,null,null,null,null,null,null,null,null,null,{"$f":"IF(GZ52=\"xx\",\"\",GZ52)","v":"Vinterrybs"},"20. august","Meget god","Nej","Middel",-1513,-633,"Nej","Aldrig","Nej","Meget god","Ja","God","Ja","Nej","Ja","Nej","Ja","Ja","Ja","Nej","Nej",null,null,null,null,null,null,null,null,null,null,null,null,"Efterafgrøder"]
[null,null,null,null,null,null,null,null,null,null,null,null,null,null,null,null,null,null,null,null,null,null,null,null,null,null,null,null,null,null,null,null,null,null,null,null,null,null,null,null,null,null,null,null,null,null,null,null,null,null,null,null,null,null,null,null,null,null,null,null,null,null,null,null,null,null,null,null,null,null,null,null,null,null,null,null,null,null,null,null,null,null,null,null,null,null,null,null,null,null,null,null,null,null,null,null,null,null,null,null,null,null,null,null,null,null,null,null,null,null,null,null,null,null,null,null,null,null,null,null,null,null,null,null,null,null,null,null,null,null,null,null,null,null,null,null,null,null,null,null,null,null,null,null,null,null,null,null,null,null,null,null,null,null,null,null,null,null,null,null,null,null,null,null,null,null,null,null,null,null,null,null,null,null,null,null,null,null,null,null,null,null,null,null,null,null,null,null,null,null,null,null,null,null,null,null,null,null,null,null,null,null,null,null,null,null,null,{"$f":"IF(GZ53=\"xx\",\"\",GZ53)","v":"Hvidkløver/alm. rajgræs"},"1. august","God","Ja","Stor",-185,"-","Mod visse","Aldrig","Nej","Meget god","Nej","Nej","Ja","Nej","Nej","Ja","Ja","Ja","Ja","Nej","Meget god",null,null,null,null,null,null,null,null,null,null,null,null,"Efterafgrøder"]
[null,null,null,null,null,null,null,null,null,null,null,null,null,null,null,null,null,null,null,null,null,null,null,null,null,null,null,null,null,null,null,null,null,null,null,null,null,null,null,null,null,null,null,null,null,null,null,null,null,null,null,null,null,null,null,null,null,null,null,null,null,null,null,null,null,null,null,null,null,null,null,null,null,null,null,null,null,null,null,null,null,null,null,null,null,null,null,null,null,null,null,null,null,null,null,null,null,null,null,null,null,null,null,null,null,null,null,null,null,null,null,null,null,null,null,null,null,null,null,null,null,null,null,null,null,null,null,null,null,null,null,null,null,null,null,null,null,null,null,null,null,null,null,null,null,null,null,null,null,null,null,null,null,null,null,null,null,null,null,null,null,null,null,null,null,null,null,null,null,null,null,null,null,null,null,null,null,null,null,null,null,null,null,null,null,null,null,null,null,null,null,null,null,null,null,null,null,null,null,null,null,null,null,null,null,null,null,{"$f":"IF(GZ54=\"xx\",\"\",GZ54)","v":"Vinterraps , linie"},"20. august","God","Nej","Over middel",-1136,-476,"Mod de fleste","Altid","Nej","Meget god","Ja","Meget god","Ja","Nej","Ja","Nej","Ja","Ja","Ja","Nej","Nej",null,null,null,null,null,null,null,null,null,null,null,null,"Efterafgrøder"]
[null,null,null,null,null,null,null,null,null,null,null,null,null,null,null,null,null,null,null,null,null,null,null,null,null,null,null,null,null,null,null,null,null,null,null,null,null,null,null,null,null,null,null,null,null,null,null,null,null,null,null,null,null,null,null,null,null,null,null,null,null,null,null,null,null,null,null,null,null,null,null,null,null,null,null,null,null,null,null,null,null,null,null,null,null,null,null,null,null,null,null,null,null,null,null,null,null,null,null,null,null,null,null,null,null,null,null,null,null,null,null,null,null,null,null,null,null,null,null,null,null,null,null,null,null,null,null,null,null,null,null,null,null,null,null,null,null,null,null,null,null,null,null,null,null,null,null,null,null,null,null,null,null,null,null,null,null,null,null,null,null,null,null,null,null,null,null,null,null,null,null,null,null,null,null,null,null,null,null,null,null,null,null,null,null,null,null,null,null,null,null,null,null,null,null,null,null,null,null,null,null,null,null,null,null,null,null,{"$f":"IF(GZ55=\"xx\",\"\",GZ55)","v":"Alm. rajgræs, dipl."},"1.august","God","Nej","Middel",-185,"-","Mod mange","Aldrig","Nej","Meget god","Nej","Nej","Ja","Nej","Ja","Ja","Ja","Ja","Ja","Nej","Meget god",null,null,null,null,null,null,null,null,null,null,null,null,"Efterafgrøder"]
[null,null,null,null,null,null,null,null,null,null,null,null,null,null,null,null,null,null,null,null,null,null,null,null,null,null,null,null,null,null,null,null,null,null,null,null,null,null,null,null,null,null,null,null,null,null,null,null,null,null,null,null,null,null,null,null,null,null,null,null,null,null,null,null,null,null,null,null,null,null,null,null,null,null,null,null,null,null,null,null,null,null,null,null,null,null,null,null,null,null,null,null,null,null,null,null,null,null,null,null,null,null,null,null,null,null,null,null,null,null,null,null,null,null,null,null,null,null,null,null,null,null,null,null,null,null,null,null,null,null,null,null,null,null,null,null,null,null,null,null,null,null,null,null,null,null,null,null,null,null,null,null,null,null,null,null,null,null,null,null,null,null,null,null,null,null,null,null,null,null,null,null,null,null,null,null,null,null,null,null,null,null,null,null,null,null,null,null,null,null,null,null,null,null,null,null,null,null,null,null,null,null,null,null,null,null,null,{"$f":"IF(GZ56=\"xx\",\"\",GZ56)","v":"Rødkløver/strandsvingel"},"1. august","Brugbar","Ja","Stor",-1355,"-","Mod visse","Aldrig","Nej","Meget god","Nej","Nej","Ja","Nej","Nej","Ja","Ja","Ja","Ja","Nej","Brugbar",null,null,null,null,null,null,null,null,null,null,null,null,"Efterafgrøder"]
[null,null,null,null,null,null,null,null,null,null,null,null,null,null,null,null,null,null,null,null,null,null,null,null,null,null,null,null,null,null,null,null,null,null,null,null,null,null,null,null,null,null,null,null,null,null,null,null,null,null,null,null,null,null,null,null,null,null,null,null,null,null,null,null,null,null,null,null,null,null,null,null,null,null,null,null,null,null,null,null,null,null,null,null,null,null,null,null,null,null,null,null,null,null,null,null,null,null,null,null,null,null,null,null,null,null,null,null,null,null,null,null,null,null,null,null,null,null,null,null,null,null,null,null,null,null,null,null,null,null,null,null,null,null,null,null,null,null,null,null,null,null,null,null,null,null,null,null,null,null,null,null,null,null,null,null,null,null,null,null,null,null,null,null,null,null,null,null,null,null,null,null,null,null,null,null,null,null,null,null,null,null,null,null,null,null,null,null,null,null,null,null,null,null,null,null,null,null,null,null,null,null,null,null,null,null,null,{"$f":"IF(GZ57=\"xx\",\"\",GZ57)","v":"Triticale/Gul Sennep"},"1. august","Brugbar","Nej","Middel",-647,"-","Nej","Aldrig","Nej","Udvintrer","Nej","Nej","Ja","Nej","Nej","Nej","Ja","Ja","Ja","Nej","Meget god",null,null,null,null,null,null,null,null,null,null,null,null,"Efterafgrøder"]
[null,null,null,null,null,null,null,null,null,null,null,null,null,null,null,null,null,null,null,null,null,null,null,null,null,null,null,null,null,null,null,null,null,null,null,null,null,null,null,null,null,null,null,null,null,null,null,null,null,null,null,null,null,null,null,null,null,null,null,null,null,null,null,null,null,null,null,null,null,null,null,null,null,null,null,null,null,null,null,null,null,null,null,null,null,null,null,null,null,null,null,null,null,null,null,null,null,null,null,null,null,null,null,null,null,null,null,null,null,null,null,null,null,null,null,null,null,null,null,null,null,null,null,null,null,null,null,null,null,null,null,null,null,null,null,null,null,null,null,null,null,null,null,null,null,null,null,null,null,null,null,null,null,null,null,null,null,null,null,null,null,null,null,null,null,null,null,null,null,null,null,null,null,null,null,null,null,null,null,null,null,null,null,null,null,null,null,null,null,null,null,null,null,null,null,null,null,null,null,null,null,null,null,null,null,null,null,{"$f":"IF(GZ58=\"xx\",\"\",GZ58)","v":""},"","","","","","","","","","","","","","","","","","","","","",null,null,null,null,null,null,null,null,null,null,null,null,""]
[null,null,null,null,null,null,null,null,null,null,null,null,null,null,null,null,null,null,null,null,null,null,null,null,null,null,null,null,null,null,null,null,null,null,null,null,null,null,null,null,null,null,null,null,null,null,null,null,null,null,null,null,null,null,null,null,null,null,null,null,null,null,null,null,null,null,null,null,null,null,null,null,null,null,null,null,null,null,null,null,null,null,null,null,null,null,null,null,null,null,null,null,null,null,null,null,null,null,null,null,null,null,null,null,null,null,null,null,null,null,null,null,null,null,null,null,null,null,null,null,null,null,null,null,null,null,null,null,null,null,null,null,null,null,null,null,null,null,null,null,null,null,null,null,null,null,null,null,null,null,null,null,null,null,null,null,null,null,null,null,null,null,null,null,null,null,null,null,null,null,null,null,null,null,null,null,null,null,null,null,null,null,null,null,null,null,null,null,null,null,null,null,null,null,null,null,null,null,null,null,null,null,null,null,null,null,null,{"$f":"IF(GZ59=\"xx\",\"\",GZ59)","v":""},"","","","","","","","","","","","","","","","","","","","","",null,null,null,null,null,null,null,null,null,null,null,null,""]
[null,null,null,null,null,null,null,null,null,null,null,null,null,null,null,null,null,null,null,null,null,null,null,null,null,null,null,null,null,null,null,null,null,null,null,null,null,null,null,null,null,null,null,null,null,null,null,null,null,null,null,null,null,null,null,null,null,null,null,null,null,null,null,null,null,null,null,null,null,null,null,null,null,null,null,null,null,null,null,null,null,null,null,null,null,null,null,null,null,null,null,null,null,null,null,null,null,null,null,null,null,null,null,null,null,null,null,null,null,null,null,null,null,null,null,null,null,null,null,null,null,null,null,null,null,null,null,null,null,null,null,null,null,null,null,null,null,null,null,null,null,null,null,null,null,null,null,null,null,null,null,null,null,null,null,null,null,null,null,null,null,null,null,null,null,null,null,null,null,null,null,null,null,null,null,null,null,null,null,null,null,null,null,null,null,null,null,null,null,null,null,null,null,null,null,null,null,null,null,null,null,null,null,null,null,null,null,{"$f":"IF(GZ60=\"xx\",\"\",GZ60)","v":""},"","","","","","","","","","","","","","","","","","","","","",null,null,null,null,null,null,null,null,null,null,null,null,""]
[null,null,null,null,null,null,null,null,null,null,null,null,null,null,null,null,null,null,null,null,null,null,null,null,null,null,null,null,null,null,null,null,null,null,null,null,null,null,null,null,null,null,null,null,null,null,null,null,null,null,null,null,null,null,null,null,null,null,null,null,null,null,null,null,null,null,null,null,null,null,null,null,null,null,null,null,null,null,null,null,null,null,null,null,null,null,null,null,null,null,null,null,null,null,null,null,null,null,null,null,null,null,null,null,null,null,null,null,null,null,null,null,null,null,null,null,null,null,null,null,null,null,null,null,null,null,null,null,null,null,null,null,null,null,null,null,null,null,null,null,null,null,null,null,null,null,null,null,null,null,null,null,null,null,null,null,null,null,null,null,null,null,null,null,null,null,null,null,null,null,null,null,null,null,null,null,null,null,null,null,null,null,null,null,null,null,null,null,null,null,null,null,null,null,null,null,null,null,null,null,null,null,null,null,null,null,null,{"$f":"IF(GZ61=\"xx\",\"\",GZ61)","v":""},"","","","","","","","","","","","","","","","","","","","","",null,null,null,null,null,null,null,null,null,null,null,null,""]
[null,null,null,null,null,null,null,null,null,null,null,null,null,null,null,null,null,null,null,null,null,null,null,null,null,null,null,null,null,null,null,null,null,null,null,null,null,null,null,null,null,null,null,null,null,null,null,null,null,null,null,null,null,null,null,null,null,null,null,null,null,null,null,null,null,null,null,null,null,null,null,null,null,null,null,null,null,null,null,null,null,null,null,null,null,null,null,null,null,null,null,null,null,null,null,null,null,null,null,null,null,null,null,null,null,null,null,null,null,null,null,null,null,null,null,null,null,null,null,null,null,null,null,null,null,null,null,null,null,null,null,null,null,null,null,null,null,null,null,null,null,null,null,null,null,null,null,null,null,null,null,null,null,null,null,null,null,null,null,null,null,null,null,null,null,null,null,null,null,null,null,null,null,null,null,null,null,null,null,null,null,null,null,null,null,null,null,null,null,null,null,null,null,null,null,null,null,null,null,null,null,null,null,null,null,null,null,{"$f":"IF(GZ62=\"xx\",\"\",GZ62)","v":""},"","","","","","","","","","","","","","","","","","","","","",null,null,null,null,null,null,null,null,null,null,null,null,""]
[null,null,null,null,null,null,null,null,null,null,null,null,null,null,null,null,null,null,null,null,null,null,null,null,null,null,null,null,null,null,null,null,null,null,null,null,null,null,null,null,null,null,null,null,null,null,null,null,null,null,null,null,null,null,null,null,null,null,null,null,null,null,null,null,null,null,null,null,null,null,null,null,null,null,null,null,null,null,null,null,null,null,null,null,null,null,null,null,null,null,null,null,null,null,null,null,null,null,null,null,null,null,null,null,null,null,null,null,null,null,null,null,null,null,null,null,null,null,null,null,null,null,null,null,null,null,null,null,null,null,null,null,null,null,null,null,null,null,null,null,null,null,null,null,null,null,null,null,null,null,null,null,null,null,null,null,null,null,null,null,null,null,null,null,null,null,null,null,null,null,null,null,null,null,null,null,null,null,null,null,null,null,null,null,null,null,null,null,null,null,null,null,null,null,null,null,null,null,null,null,null,null,null,null,null,null,null,{"$f":"IF(GZ63=\"xx\",\"\",GZ63)","v":""},"","","","","","","","","","","","","","","","","","","","","",null,null,null,null,null,null,null,null,null,null,null,null,""]
[null,null,null,null,null,null,null,null,null,null,null,null,null,null,null,null,null,null,null,null,null,null,null,null,null,null,null,null,null,null,null,null,null,null,null,null,null,null,null,null,null,null,null,null,null,null,null,null,null,null,null,null,null,null,null,null,null,null,null,null,null,null,null,null,null,null,null,null,null,null,null,null,null,null,null,null,null,null,null,null,null,null,null,null,null,null,null,null,null,null,null,null,null,null,null,null,null,null,null,null,null,null,null,null,null,null,null,null,null,null,null,null,null,null,null,null,null,null,null,null,null,null,null,null,null,null,null,null,null,null,null,null,null,null,null,null,null,null,null,null,null,null,null,null,null,null,null,null,null,null,null,null,null,null,null,null,null,null,null,null,null,null,null,null,null,null,null,null,null,null,null,null,null,null,null,null,null,null,null,null,null,null,null,null,null,null,null,null,null,null,null,null,null,null,null,null,null,null,null,null,null,null,null,null,null,null,null,{"$f":"IF(GZ64=\"xx\",\"\",GZ64)","v":""},"","","","","","","","","","","","","","","","","","","","","",null,null,null,null,null,null,null,null,null,null,null,null,""]
[null,null,null,null,null,null,null,null,null,null,null,null,null,null,null,null,null,null,null,null,null,null,null,null,null,null,null,null,null,null,null,null,null,null,null,null,null,null,null,null,null,null,null,null,null,null,null,null,null,null,null,null,null,null,null,null,null,null,null,null,null,null,null,null,null,null,null,null,null,null,null,null,null,null,null,null,null,null,null,null,null,null,null,null,null,null,null,null,null,null,null,null,null,null,null,null,null,null,null,null,null,null,null,null,null,null,null,null,null,null,null,null,null,null,null,null,null,null,null,null,null,null,null,null,null,null,null,null,null,null,null,null,null,null,null,null,null,null,null,null,null,null,null,null,null,null,null,null,null,null,null,null,null,null,null,null,null,null,null,null,null,null,null,null,null,null,null,null,null,null,null,null,null,null,null,null,null,null,null,null,null,null,null,null,null,null,null,null,null,null,null,null,null,null,null,null,null,null,null,null,null,null,null,null,null,null,null,{"$f":"IF(GZ65=\"xx\",\"\",GZ65)","v":""},"","","","","","","","","","","","","","","","","","","","","",null,null,null,null,null,null,null,null,null,null,null,null,""]
[null,null,null,null,null,null,null,null,null,null,null,null,null,null,null,null,null,null,null,null,null,null,null,null,null,null,null,null,null,null,null,null,null,null,null,null,null,null,null,null,null,null,null,null,null,null,null,null,null,null,null,null,null,null,null,null,null,null,null,null,null,null,null,null,null,null,null,null,null,null,null,null,null,null,null,null,null,null,null,null,null,null,null,null,null,null,null,null,null,null,null,null,null,null,null,null,null,null,null,null,null,null,null,null,null,null,null,null,null,null,null,null,null,null,null,null,null,null,null,null,null,null,null,null,null,null,null,null,null,null,null,null,null,null,null,null,null,null,null,null,null,null,null,null,null,null,null,null,null,null,null,null,null,null,null,null,null,null,null,null,null,null,null,null,null,null,null,null,null,null,null,null,null,null,null,null,null,null,null,null,null,null,null,null,null,null,null,null,null,null,null,null,null,null,null,null,null,null,null,null,null,null,null,null,null,null,null,{"$f":"IF(GZ66=\"xx\",\"\",GZ66)","v":""},"","","","","","","","","","","","","","","","","","","","","",null,null,null,null,null,null,null,null,null,null,null,null,""]
[null,null,null,null,null,null,null,null,null,null,null,null,null,null,null,null,null,null,null,null,null,null,null,null,null,null,null,null,null,null,null,null,null,null,null,null,null,null,null,null,null,null,null,null,null,null,null,null,null,null,null,null,null,null,null,null,null,null,null,null,null,null,null,null,null,null,null,null,null,null,null,null,null,null,null,null,null,null,null,null,null,null,null,null,null,null,null,null,null,null,null,null,null,null,null,null,null,null,null,null,null,null,null,null,null,null,null,null,null,null,null,null,null,null,null,null,null,null,null,null,null,null,null,null,null,null,null,null,null,null,null,null,null,null,null,null,null,null,null,null,null,null,null,null,null,null,null,null,null,null,null,null,null,null,null,null,null,null,null,null,null,null,null,null,null,null,null,null,null,null,null,null,null,null,null,null,null,null,null,null,null,null,null,null,null,null,null,null,null,null,null,null,null,null,null,null,null,null,null,null,null,null,null,null,null,null,null,{"$f":"IF(GZ67=\"xx\",\"\",GZ67)","v":""},"","","","","","","","","","","","","","","","","","","","","",null,null,null,null,null,null,null,null,null,null,null,null,""]
[null,null,null,null,null,null,null,null,null,null,null,null,null,null,null,null,null,null,null,null,null,null,null,null,null,null,null,null,null,null,null,null,null,null,null,null,null,null,null,null,null,null,null,null,null,null,null,null,null,null,null,null,null,null,null,null,null,null,null,null,null,null,null,null,null,null,null,null,null,null,null,null,null,null,null,null,null,null,null,null,null,null,null,null,null,null,null,null,null,null,null,null,null,null,null,null,null,null,null,null,null,null,null,null,null,null,null,null,null,null,null,null,null,null,null,null,null,null,null,null,null,null,null,null,null,null,null,null,null,null,null,null,null,null,null,null,null,null,null,null,null,null,null,null,null,null,null,null,null,null,null,null,null,null,null,null,null,null,null,null,null,null,null,null,null,null,null,null,null,null,null,null,null,null,null,null,null,null,null,null,null,null,null,null,null,null,null,null,null,null,null,null,null,null,null,null,null,null,null,null,null,null,null,null,null,null,null,{"$f":"IF(GZ68=\"xx\",\"\",GZ68)","v":""},"","","","","","","","","","","","","","","","","","","","","",null,null,null,null,null,null,null,null,null,null,null,null,""]
[null,null,null,null,null,null,null,null,null,null,null,null,null,null,null,null,null,null,null,null,null,null,null,null,null,null,null,null,null,null,null,null,null,null,null,null,null,null,null,null,null,null,null,null,null,null,null,null,null,null,null,null,null,null,null,null,null,null,null,null,null,null,null,null,null,null,null,null,null,null,null,null,null,null,null,null,null,null,null,null,null,null,null,null,null,null,null,null,null,null,null,null,null,null,null,null,null,null,null,null,null,null,null,null,null,null,null,null,null,null,null,null,null,null,null,null,null,null,null,null,null,null,null,null,null,null,null,null,null,null,null,null,null,null,null,null,null,null,null,null,null,null,null,null,null,null,null,null,null,null,null,null,null,null,null,null,null,null,null,null,null,null,null,null,null,null,null,null,null,null,null,null,null,null,null,null,null,null,null,null,null,null,null,null,null,null,null,null,null,null,null,null,null,null,null,null,null,null,null,null,null,null,null,null,null,null,null,{"$f":"IF(GZ69=\"xx\",\"\",GZ69)","v":""},"","","","","","","","","","","","","","","","","","","","","",null,null,null,null,null,null,null,null,null,null,null,null,""]
[]
[]
[]
[]
[]
[]
[]
[]
[]
[]
[]
[null,null,null,null,null,null,null,null,null,null,null,null,null,null,null,null,null,null,null,null,null,null,null,null,null,null,null,null,null,null,null,null,null,null,null,null,null,null,null,null,null,null,null,null,null,null,null,null,null,null,null,null,null,null,null,null,null,null,null,null,null,null,null,null,null,null,null,null,null,null,null,null,null,null,null,null,null,null,null,null,null,null,null,null,null,null,null,null,null,null,null,null,null,null,null,null,null,null,null,null,null,null,null,null,null,null,null,null,null,null,null,null,null,null,null,null,null,null,null,null,null,null,null,null,null,null,null,null,null,null,null,null,null,null,null,null,null,null,null,null,null,null,null,null,null,null,null,null,null,null,null,null,null,null,null,null,null,null,null,null,null,null,null,null,null,null,null,null,null,null,null,null,null,null,null,null,null,null,null,null,null,null,null,null,null,null,null,null,null,null,null,null,null,null,null,null,null,null,null,null,null,null,null,null,null,null,null,{"$f":"IF(GZ81=\"xx\",\"\",GZ81)","v":"Vintervikke/vinterrug"},"20. august","Meget god","Ja","Stor",-969,-529,"Mod de fleste","Aldrig","Nej","Meget god","Nej","Nej","Ja","Nej","Nej","Ja","Ja","Ja","Ja","Nej","Nej",null,null,null,null,null,null,null,null,null,null,null,null,"Efterafgrøder"]
[null,null,null,null,null,null,null,null,null,null,null,null,null,null,null,null,null,null,null,null,null,null,null,null,null,null,null,null,null,null,null,null,null,null,null,null,null,null,null,null,null,null,null,null,null,null,null,null,null,null,null,null,null,null,null,null,null,null,null,null,null,null,null,null,null,null,null,null,null,null,null,null,null,null,null,null,null,null,null,null,null,null,null,null,null,null,null,null,null,null,null,null,null,null,null,null,null,null,null,null,null,null,null,null,null,null,null,null,null,null,null,null,null,null,null,null,null,null,null,null,null,null,null,null,null,null,null,null,null,null,null,null,null,null,null,null,null,null,null,null,null,null,null,null,null,null,null,null,null,null,null,null,null,null,null,null,null,null,null,null,null,null,null,null,null,null,null,null,null,null,null,null,null,null,null,null,null,null,null,null,null,null,null,null,null,null,null,null,null,null,null,null,null,null,null,null,null,null,null,null,null,null,null,null,null,null,null,{"$f":"IF(GZ82=\"xx\",\"\",GZ82)","v":"Olieræddike og vintervikke"},"20. august","Meget god","Ja","Stor",-828,52,"Mod de fleste","I mindre grad","Nej","Udvintrer","Nej","Meget god","Ja","Nej","Nej","Nej","Ja","Ja","Ja","Nej","Nej",null,null,null,null,null,null,null,null,null,null,null,null,"Efterafgrøder"]
[null,null,null,null,null,null,null,null,null,null,null,null,null,null,null,null,null,null,null,null,null,null,null,null,null,null,null,null,null,null,null,null,null,null,null,null,null,null,null,null,null,null,null,null,null,null,null,null,null,null,null,null,null,null,null,null,null,null,null,null,null,null,null,null,null,null,null,null,null,null,null,null,null,null,null,null,null,null,null,null,null,null,null,null,null,null,null,null,null,null,null,null,null,null,null,null,null,null,null,null,null,null,null,null,null,null,null,null,null,null,null,null,null,null,null,null,null,null,null,null,null,null,null,null,null,null,null,null,null,null,null,null,null,null,null,null,null,null,null,null,null,null,null,null,null,null,null,null,null,null,null,null,null,null,null,null,null,null,null,null,null,null,null,null,null,null,null,null,null,null,null,null,null,null,null,null,null,null,null,null,null,null,null,null,null,null,null,null,null,null,null,null,null,null,null,null,null,null,null,null,null,null,null,null,null,null,null,{"$f":"IF(GZ83=\"xx\",\"\",GZ83)","v":"Kløvergræs (blanding)"},"1. august","Meget god","Ja","Stor",-2145,"-","Mod visse","Aldrig","Nej","Meget god","Nej","Nej","Ja","Nej","Nej","Ja","Ja","Ja","Ja","Nej","Meget god",null,null,null,null,null,null,null,null,null,null,null,null,"Efterafgrøder"]
[null,null,null,null,null,null,null,null,null,null,null,null,null,null,null,null,null,null,null,null,null,null,null,null,null,null,null,null,null,null,null,null,null,null,null,null,null,null,null,null,null,null,null,null,null,null,null,null,null,null,null,null,null,null,null,null,null,null,null,null,null,null,null,null,null,null,null,null,null,null,null,null,null,null,null,null,null,null,null,null,null,null,null,null,null,null,null,null,null,null,null,null,null,null,null,null,null,null,null,null,null,null,null,null,null,null,null,null,null,null,null,null,null,null,null,null,null,null,null,null,null,null,null,null,null,null,null,null,null,null,null,null,null,null,null,null,null,null,null,null,null,null,null,null,null,null,null,null,null,null,null,null,null,null,null,null,null,null,null,null,null,null,null,null,null,null,null,null,null,null,null,null,null,null,null,null,null,null,null,null,null,null,null,null,null,null,null,null,null,null,null,null,null,null,null,null,null,null,null,null,null,null,null,null,null,null,null,{"$f":"IF(GZ84=\"xx\",\"\",GZ84)","v":"Vårbyg /Vikke /Gul Sennep"},"20. august","Meget god","Ja","Over middel",-789,-348.5,"Nej","Aldrig","Nej","Dårlig","Nej","Rimelig","Ja","Nej","Nej","Nej","Ja","Ja","Ja","Nej","Nej",null,null,null,null,null,null,null,null,null,null,null,null,"Efterafgrøder"]
[null,null,null,null,null,null,null,null,null,null,null,null,null,null,null,null,null,null,null,null,null,null,null,null,null,null,null,null,null,null,null,null,null,null,null,null,null,null,null,null,null,null,null,null,null,null,null,null,null,null,null,null,null,null,null,null,null,null,null,null,null,null,null,null,null,null,null,null,null,null,null,null,null,null,null,null,null,null,null,null,null,null,null,null,null,null,null,null,null,null,null,null,null,null,null,null,null,null,null,null,null,null,null,null,null,null,null,null,null,null,null,null,null,null,null,null,null,null,null,null,null,null,null,null,null,null,null,null,null,null,null,null,null,null,null,null,null,null,null,null,null,null,null,null,null,null,null,null,null,null,null,null,null,null,null,null,null,null,null,null,null,null,null,null,null,null,null,null,null,null,null,null,null,null,null,null,null,null,null,null,null,null,null,null,null,null,null,null,null,null,null,null,null,null,null,null,null,null,null,null,null,null,null,null,null,null,null,{"$f":"IF(GZ85=\"xx\",\"\",GZ85)","v":"Olieræddike"},"20. august","Meget god","Nej","Over middel",-649,231,"Mod de fleste","I mindre grad","Mange","Udvintrer","Nej","Meget god","Ja","Ja","Ja","Nej","Ja","Ja","Ja","Nej","Nej",null,null,null,null,null,null,null,null,null,null,null,null,"Efterafgrøder"]
[null,null,null,null,null,null,null,null,null,null,null,null,null,null,null,null,null,null,null,null,null,null,null,null,null,null,null,null,null,null,null,null,null,null,null,null,null,null,null,null,null,null,null,null,null,null,null,null,null,null,null,null,null,null,null,null,null,null,null,null,null,null,null,null,null,null,null,null,null,null,null,null,null,null,null,null,null,null,null,null,null,null,null,null,null,null,null,null,null,null,null,null,null,null,null,null,null,null,null,null,null,null,null,null,null,null,null,null,null,null,null,null,null,null,null,null,null,null,null,null,null,null,null,null,null,null,null,null,null,null,null,null,null,null,null,null,null,null,null,null,null,null,null,null,null,null,null,null,null,null,null,null,null,null,null,null,null,null,null,null,null,null,null,null,null,null,null,null,null,null,null,null,null,null,null,null,null,null,null,null,null,null,null,null,null,null,null,null,null,null,null,null,null,null,null,null,null,null,null,null,null,null,null,null,null,null,null,{"$f":"IF(GZ86=\"xx\",\"\",GZ86)","v":"Gul sennep"},"20. august","Meget god","Nej","Over middel",-503,377,"Mod de fleste","Altid","Mange","Udvintrer","Nej","God","Ja","Ja","Ja","Nej","Ja","Ja","Ja","Nej","Nej",null,null,null,null,null,null,null,null,null,null,null,null,"Efterafgrøder"]
[null,null,null,null,null,null,null,null,null,null,null,null,null,null,null,null,null,null,null,null,null,null,null,null,null,null,null,null,null,null,null,null,null,null,null,null,null,null,null,null,null,null,null,null,null,null,null,null,null,null,null,null,null,null,null,null,null,null,null,null,null,null,null,null,null,null,null,null,null,null,null,null,null,null,null,null,null,null,null,null,null,null,null,null,null,null,null,null,null,null,null,null,null,null,null,null,null,null,null,null,null,null,null,null,null,null,null,null,null,null,null,null,null,null,null,null,null,null,null,null,null,null,null,null,null,null,null,null,null,null,null,null,null,null,null,null,null,null,null,null,null,null,null,null,null,null,null,null,null,null,null,null,null,null,null,null,null,null,null,null,null,null,null,null,null,null,null,null,null,null,null,null,null,null,null,null,null,null,null,null,null,null,null,null,null,null,null,null,null,null,null,null,null,null,null,null,null,null,null,null,null,null,null,null,null,null,null,{"$f":"IF(GZ87=\"xx\",\"\",GZ87)","v":"Foderradise (Strukturator)"},"20. august","Meget god","Nej","Over middel",-913,-33,"Mod de fleste","I mindre grad","Nej","Udvintrer","Nej","Meget god","Ja","Nej","Ja","Nej","Ja","Ja","Ja","Nej","Nej",null,null,null,null,null,null,null,null,null,null,null,null,"Efterafgrøder"]
[null,null,null,null,null,null,null,null,null,null,null,null,null,null,null,null,null,null,null,null,null,null,null,null,null,null,null,null,null,null,null,null,null,null,null,null,null,null,null,null,null,null,null,null,null,null,null,null,null,null,null,null,null,null,null,null,null,null,null,null,null,null,null,null,null,null,null,null,null,null,null,null,null,null,null,null,null,null,null,null,null,null,null,null,null,null,null,null,null,null,null,null,null,null,null,null,null,null,null,null,null,null,null,null,null,null,null,null,null,null,null,null,null,null,null,null,null,null,null,null,null,null,null,null,null,null,null,null,null,null,null,null,null,null,null,null,null,null,null,null,null,null,null,null,null,null,null,null,null,null,null,null,null,null,null,null,null,null,null,null,null,null,null,null,null,null,null,null,null,null,null,null,null,null,null,null,null,null,null,null,null,null,null,null,null,null,null,null,null,null,null,null,null,null,null,null,null,null,null,null,null,null,null,null,null,null,null,{"$f":"IF(GZ88=\"xx\",\"\",GZ88)","v":"Honningurt"},"20. august","Meget god","Nej","Over middel",-2302,-2082,"Mod de fleste","Aldrig","Nej","Udvintrer","Nej","Meget god","Ja","Nej","Ja","Nej","Ja","Ja","Ja","Nej","Nej",null,null,null,null,null,null,null,null,null,null,null,null,"Efterafgrøder"]

{"sheet":"Karaktermatrice","index":4,"n_rows":73,"n_cols":32,"rows_kept":73,"cut":false,"hidden":false,"merged":[]}
[null,null,null,null,null,null,1,2,3,4,5,6,7,8,9,10,11,12,13,14,15,16,17,18,19,20,21,22,23,24,25]
["Basis valg",null,null,null,null,"Efterafgrøde","Index","Efterafgrøde - karakter","Mellemafgrøde - karakter","MFO i blanding - karakter","MFO udlæg - karakter","Egnet til udlæg efterår i vinterkorn","Egnet til udlæg forår","Egnet til udsåning ved sidste radrensning","Egnet til udsåning efter tidlig høst (10. august)","Efterafgrøde","Mellemafgrøde","MFO i blanding","MFO i udlæg","MFO total","Opformere ikke kålbrok ","Egen udsæd lovlig?","Default","Sys","Plads","Ok ifht. Kålbrok (Hvis det er valgt at der ikke må opformeres kålbrok vises kun afgrøde hvor der findes ok sorter) ","Ok ifht egen udsæd(hvis det er valg at det skal kunne anvendes?)","Kan etableres på valgt tidspunkt","Er godkendt afgrøde","Med?","Index","Efterafgrøde"]
["Lovkrav","Valg i frontend","Konsekvens","Styring af såtidspunkt",null,"Alm. rajgræs, dipl.",1,{"$f":"Grundkarakterer!N8","v":1},{"$f":"Grundkarakterer!O8","v":0},{"$f":"Grundkarakterer!P8","v":1},{"$f":"Grundkarakterer!Q8","v":1},{"$f":"Grundkarakterer!U8","v":0},{"$f":"Grundkarakterer!V8","v":3},{"$f":"Grundkarakterer!W8","v":3},{"$f":"Grundkarakterer!X8","v":2},{"$f":"IF(OR($C$4=1,$C$5=1),Grundkarakterer!N8,0)","v":1},{"$f":"IF(C$7=1,Grundkarakterer!O8,0)","v":0},{"$f":"IF(OR(C$5=1,C$6=1),Grundkarakterer!P8,0)","v":0},{"$f":"IF(OR(C$5=1,C$6=1),Grundkarakterer!Q8,0)","v":0},{"$f":"SUM(R3:S3)","v":0},{"$f":"Grundkarakterer!AC8","v":3},{"$f":"Grundkarakterer!AG8","v":0},34,{"$f":"W3/($G$36+1)+P3+Q3+T3","v":1.9714285714285715},{"$f":"_xlfn.RANK.EQ(X3,X$3:X$36,0)","v":1},{"$f":"IF(AND(U3<3,C$27=1),\"Nej\",\"Ja\")","v":"Ja"},{"$f":"IF(AND(V3=0,C$28=1),\"Nej\",\"Ja\")","v":"Ja"},{"$f":"IF(C$22=1,IF(L3>0,\"Ja\",\"Nej\"),IF(C$23=1,IF(M3>0,\"Ja\",\"Nej\"),IF(C$24=1,IF(N3>0,\"Ja\",\"Nej\"),IF(C$25=1,IF(O3>0,\"Ja\",\"Nej\")))))","v":"Ja"},{"$f":"IF( $C$9=0,\"Ja\",IF(X3>=$C$9,\"Ja\",\"Nej\"))","v":"Ja"},{"$f":"IF(AND(AB3=\"Ja\",AC3=\"Ja\",Z3=\"Ja\",AA3=\"Ja\"),\"Ja\",\"Nej\")","v":"Ja"},1,"Alm. rajgræs, dipl."]
["Pligtig efterafgrøde",{"$f":"IF('Efterafgrøde beslutningsstøtte'!A$7=\"Vælg funktion\",\"xx\",IF('Efterafgrøde beslutningsstøtte'!A$7=Karaktermatrice!A4,1,0))","v":1},{"$f":"IF(B4=\"xx\",\"xx\",B4)","v":1},{"$f":"IF(B4=1,1,0)","v":1},null,"Blanding uden bælgsæd overvintrene",2,{"$f":"Grundkarakterer!N9","v":0},{"$f":"Grundkarakterer!O9","v":0},{"$f":"Grundkarakterer!P9","v":0},{"$f":"Grundkarakterer!Q9","v":1},{"$f":"Grundkarakterer!U9","v":0},{"$f":"Grundkarakterer!V9","v":0},{"$f":"Grundkarakterer!W9","v":2},{"$f":"Grundkarakterer!X9","v":2},{"$f":"IF(OR($C$4=1,$C$5=1),Grundkarakterer!N9,0)","v":0},{"$f":"IF(C$7=1,Grundkarakterer!O9,0)","v":0},{"$f":"IF(OR(C$5=1,C$6=1),Grundkarakterer!P9,0)","v":0},{"$f":"IF(OR(C$5=1,C$6=1),Grundkarakterer!Q9,0)","v":0},{"$f":"SUM(R4:S4)","v":0},{"$f":"Grundkarakterer!AC9","v":3},{"$f":"Grundkarakterer!AG9","v":0},33,{"$f":"W4/($G$36+1)+P4+Q4+T4","v":0.94285714285714284},21,{"$f":"IF(AND(U4<3,C$27=1),\"Nej\",\"Ja\")","v":"Ja"},"Ja","Ja",{"$f":"IF( $C$9=0,\"Ja\",IF(X4>=$C$9,\"Ja\",\"Nej\"))","v":"Nej"},"Nej",2,"Ital. rajgræs, dipl."]
["Pligtig efterafgrøde og MFO afgrøde",{"$f":"IF('Efterafgrøde beslutningsstøtte'!A$7=\"Vælg funktion\",\"xx\",IF('Efterafgrøde beslutningsstøtte'!A$7=Karaktermatrice!A5,1,0))","v":0},{"$f":"IF(B5=\"xx\",\"xx\",B5)","v":0},{"$f":"IF(B5=1,2,0)","v":0},null,"Vårbyg /Vikke /Gul Sennep",3,{"$f":"Grundkarakterer!N10","v":1},{"$f":"Grundkarakterer!O10","v":0},{"$f":"Grundkarakterer!P10","v":0},{"$f":"Grundkarakterer!Q10","v":0},{"$f":"Grundkarakterer!U10","v":0},{"$f":"Grundkarakterer!V10","v":0},{"$f":"Grundkarakterer!W10","v":0},{"$f":"Grundkarakterer!X10","v":3},{"$f":"IF(OR($C$4=1,$C$5=1),Grundkarakterer!N10,0)","v":1},{"$f":"IF(C$7=1,Grundkarakterer!O10,0)","v":0},{"$f":"IF(OR(C$5=1,C$6=1),Grundkarakterer!P10,0)","v":0},{"$f":"IF(OR(C$5=1,C$6=1),Grundkarakterer!Q10,0)","v":0},0,{"$f":"Grundkarakterer!AC10","v":3},{"$f":"Grundkarakterer!AG10","v":0},32,1.9142857142857141,2,"Ja","Ja","Ja","Ja","Ja",3,"Westerwoldisk rajgræs"]
["Kun MFO afgrøde",{"$f":"IF('Efterafgrøde beslutningsstøtte'!A$7=\"Vælg funktion\",\"xx\",IF('Efterafgrøde beslutningsstøtte'!A$7=Karaktermatrice!A6,1,0))","v":0},{"$f":"IF(B6=\"xx\",\"xx\",B6)","v":0},{"$f":"IF(B6=1,3,0)","v":0},null,"Rajgræs /cikorie /hvidkløver",4,{"$f":"Grundkarakterer!N11","v":0},{"$f":"Grundkarakterer!O11","v":0},{"$f":"Grundkarakterer!P11","v":0},{"$f":"Grundkarakterer!Q11","v":1},{"$f":"Grundkarakterer!U11","v":1},{"$f":"Grundkarakterer!V11","v":3},{"$f":"Grundkarakterer!W11","v":2},{"$f":"Grundkarakterer!X11","v":0},{"$f":"IF(OR($C$4=1,$C$5=1),Grundkarakterer!N11,0)","v":0},{"$f":"IF(C$7=1,Grundkarakterer!O11,0)","v":0},{"$f":"IF(OR(C$5=1,C$6=1),Grundkarakterer!P11,0)","v":0},{"$f":"IF(OR(C$5=1,C$6=1),Grundkarakterer!Q11,0)","v":0},0,{"$f":"Grundkarakterer!AC11","v":3},{"$f":"Grundkarakterer!AG11","v":0},31,0.88571428571428568,22,"Ja","Ja","Nej","Nej","Nej",4,"Strandsvingel"]
["Pligtig mellemafgrøde",{"$f":"IF('Efterafgrøde beslutningsstøtte'!A$7=\"Vælg funktion\",\"xx\",IF('Efterafgrøde beslutningsstøtte'!A$7=Karaktermatrice!A7,1,0))","v":0},{"$f":"IF(B7=\"xx\",\"xx\",B7)","v":0},{"$f":"IF(B7=1,4,0)","v":0},null,"Rødkløver",5,{"$f":"Grundkarakterer!N12","v":0},{"$f":"Grundkarakterer!O12","v":0},{"$f":"Grundkarakterer!P12","v":0},{"$f":"Grundkarakterer!Q12","v":1},{"$f":"Grundkarakterer!U12","v":1},{"$f":"Grundkarakterer!V12","v":3},{"$f":"Grundkarakterer!W12","v":2},{"$f":"Grundkarakterer!X12","v":0},{"$f":"IF(OR($C$4=1,$C$5=1),Grundkarakterer!N12,0)","v":0},{"$f":"IF(C$7=1,Grundkarakterer!O12,0)","v":0},{"$f":"IF(OR(C$5=1,C$6=1),Grundkarakterer!P12,0)","v":0},{"$f":"IF(OR(C$5=1,C$6=1),Grundkarakterer!Q12,0)","v":0},0,{"$f":"Grundkarakterer!AC12","v":3},{"$f":"Grundkarakterer!AG12","v":0},30,0.8571428571428571,23,"Ja","Ja","Nej","Nej","Nej",5,"Rødsvingel"]
["Frivillig efterafgrøde (ingen statslig ordning)",{"$f":"IF('Efterafgrøde beslutningsstøtte'!A$7=\"Vælg funktion\",\"xx\",IF('Efterafgrøde beslutningsstøtte'!A$7=Karaktermatrice!A8,1,0))","v":0},{"$f":"IF(B8=\"xx\",\"xx\",IF(B8=1,0,0))","v":0},{"$f":"IF(B8=1,5,0)","v":0},null,"Vinterrug/fodervikke/olieræddike",6,{"$f":"Grundkarakterer!N13","v":0},{"$f":"Grundkarakterer!O13","v":0},{"$f":"Grundkarakterer!P13","v":0},{"$f":"Grundkarakterer!Q13","v":0},{"$f":"Grundkarakterer!U13","v":0},{"$f":"Grundkarakterer!V13","v":2},{"$f":"Grundkarakterer!W13","v":2},{"$f":"Grundkarakterer!X13","v":0},{"$f":"IF(OR($C$4=1,$C$5=1),Grundkarakterer!N13,0)","v":0},{"$f":"IF(C$7=1,Grundkarakterer!O13,0)","v":0},{"$f":"IF(OR(C$5=1,C$6=1),Grundkarakterer!P13,0)","v":0},{"$f":"IF(OR(C$5=1,C$6=1),Grundkarakterer!Q13,0)","v":0},0,{"$f":"Grundkarakterer!AC13","v":3},{"$f":"Grundkarakterer!AG13","v":0},29,0.82857142857142863,24,"Ja","Ja","Nej","Nej","Nej",6,"Engrapgræs"]
["SUM",null,{"$f":"IF(AND(C4=\"xx\",C5=\"xx\",C6=\"xx\",C7=\"xx\",C8=\"xx\"),\"xx\",IF(C5=1,SUM(C4:C8)+1,SUM(C4:C8)))","v":1},{"$f":"SUM(D4:D8)","v":1},null,"Triticale/Gul Sennep",7,{"$f":"Grundkarakterer!N14","v":1},{"$f":"Grundkarakterer!O14","v":0},{"$f":"Grundkarakterer!P14","v":0},{"$f":"Grundkarakterer!Q14","v":0},{"$f":"Grundkarakterer!U14","v":0},{"$f":"Grundkarakterer!V14","v":3},{"$f":"Grundkarakterer!W14","v":1},{"$f":"Grundkarakterer!X14","v":1},{"$f":"IF(OR($C$4=1,$C$5=1),Grundkarakterer!N14,0)","v":1},{"$f":"IF(C$7=1,Grundkarakterer!O14,0)","v":0},{"$f":"IF(OR(C$5=1,C$6=1),Grundkarakterer!P14,0)","v":0},{"$f":"IF(OR(C$5=1,C$6=1),Grundkarakterer!Q14,0)","v":0},0,{"$f":"Grundkarakterer!AC14","v":3},{"$f":"Grundkarakterer!AG14","v":0},28,1.8,3,"Ja","Ja","Ja","Ja",{"$f":"IF(AND(AB9=\"Ja\",AC9=\"Ja\",Z9=\"Ja\",AA9=\"Ja\"),\"Ja\",\"Nej\")","v":"Ja"},7,"Hundegræs"]
[null,null,null,null,null,"Frøgræs, udtjent",8,{"$f":"Grundkarakterer!N15","v":1},{"$f":"Grundkarakterer!O15","v":1},{"$f":"Grundkarakterer!P15","v":0},{"$f":"Grundkarakterer!Q15","v":0},{"$f":"Grundkarakterer!U15","v":0},{"$f":"Grundkarakterer!V15","v":0},{"$f":"Grundkarakterer!W15","v":0},{"$f":"Grundkarakterer!X15","v":0},{"$f":"IF(OR($C$4=1,$C$5=1),Grundkarakterer!N15,0)","v":1},{"$f":"IF(C$7=1,Grundkarakterer!O15,0)","v":0},{"$f":"IF(OR(C$5=1,C$6=1),Grundkarakterer!P15,0)","v":0},{"$f":"IF(OR(C$5=1,C$6=1),Grundkarakterer!Q15,0)","v":0},0,{"$f":"Grundkarakterer!AC15","v":3},{"$f":"Grundkarakterer!AG15","v":0},27,1.7714285714285714,4,"Ja","Ja","Nej",{"$f":"IF( $C$9=0,\"Ja\",IF(X10>=$C$9,\"Ja\",\"Nej\"))","v":"Ja"},"Nej",8,"Frøgræs, udtjent"]
[null,null,null,null,null,"Gul sennep",9,{"$f":"Grundkarakterer!N16","v":1},{"$f":"Grundkarakterer!O16","v":1},{"$f":"Grundkarakterer!P16","v":1},{"$f":"Grundkarakterer!Q16","v":0},{"$f":"Grundkarakterer!U16","v":0},{"$f":"Grundkarakterer!V16","v":0},{"$f":"Grundkarakterer!W16","v":0},{"$f":"Grundkarakterer!X16","v":3},{"$f":"IF(OR($C$4=1,$C$5=1),Grundkarakterer!N16,0)","v":1},{"$f":"IF(C$7=1,Grundkarakterer!O16,0)","v":0},{"$f":"IF(OR(C$5=1,C$6=1),Grundkarakterer!P16,0)","v":0},{"$f":"IF(OR(C$5=1,C$6=1),Grundkarakterer!Q16,0)","v":0},0,{"$f":"Grundkarakterer!AC16","v":0},{"$f":"Grundkarakterer!AG16","v":0},26,1.7428571428571429,5,"Ja","Ja","Ja","Ja","Ja",9,"Gul sennep"]
["Etablering",null,null,null,null,"Olieræddike",10,{"$f":"Grundkarakterer!N17","v":1},{"$f":"Grundkarakterer!O17","v":1},{"$f":"Grundkarakterer!P17","v":1},{"$f":"Grundkarakterer!Q17","v":0},{"$f":"Grundkarakterer!U17","v":0},{"$f":"Grundkarakterer!V17","v":0},{"$f":"Grundkarakterer!W17","v":0},{"$f":"Grundkarakterer!X17","v":3},{"$f":"IF(OR($C$4=1,$C$5=1),Grundkarakterer!N17,0)","v":1},{"$f":"IF(C$7=1,Grundkarakterer!O17,0)","v":0},{"$f":"IF(OR(C$5=1,C$6=1),Grundkarakterer!P17,0)","v":0},{"$f":"IF(OR(C$5=1,C$6=1),Grundkarakterer!Q17,0)","v":0},0,{"$f":"Grundkarakterer!AC17","v":2},{"$f":"Grundkarakterer!AG17","v":0},25,1.7142857142857144,6,"Ja","Ja","Ja","Ja","Ja",10,"Olieræddike"]
[null,"Valg i frontend","Konsekvens","Styring af såtidspunkt",null,"Blanding med bælgsæd udvintrene",11,{"$f":"Grundkarakterer!N18","v":0},{"$f":"Grundkarakterer!O18","v":0},{"$f":"Grundkarakterer!P18","v":0},{"$f":"Grundkarakterer!Q18","v":1},{"$f":"Grundkarakterer!U18","v":0},{"$f":"Grundkarakterer!V18","v":0},{"$f":"Grundkarakterer!W18","v":1},{"$f":"Grundkarakterer!X18","v":2},{"$f":"IF(OR($C$4=1,$C$5=1),Grundkarakterer!N18,0)","v":0},{"$f":"IF(C$7=1,Grundkarakterer!O18,0)","v":0},{"$f":"IF(OR(C$5=1,C$6=1),Grundkarakterer!P18,0)","v":0},{"$f":"IF(OR(C$5=1,C$6=1),Grundkarakterer!Q18,0)","v":0},0,{"$f":"Grundkarakterer!AC18","v":0},{"$f":"Grundkarakterer!AG18","v":0},24,0.68571428571428572,25,"Ja","Ja","Ja","Nej","Nej",11,"Vinterraps, hybrid"]
["Afgrøde type",{"$f":"'Efterafgrøde beslutningsstøtte'!A10","v":"Vårsæd"},{"$f":"IF(B14=\"Vårsæd\",1,IF(B14=\"Vintersæd\",0,\"xx\"))","v":1},null,"Vårsæd =1","Vinterraps , linie",12,{"$f":"Grundkarakterer!N19","v":1},{"$f":"Grundkarakterer!O19","v":0},{"$f":"Grundkarakterer!P19","v":1},{"$f":"Grundkarakterer!Q19","v":0},{"$f":"Grundkarakterer!U19","v":0},{"$f":"Grundkarakterer!V19","v":0},{"$f":"Grundkarakterer!W19","v":1},{"$f":"Grundkarakterer!X19","v":2},{"$f":"IF(OR($C$4=1,$C$5=1),Grundkarakterer!N19,0)","v":1},{"$f":"IF(C$7=1,Grundkarakterer!O19,0)","v":0},{"$f":"IF(OR(C$5=1,C$6=1),Grundkarakterer!P19,0)","v":0},{"$f":"IF(OR(C$5=1,C$6=1),Grundkarakterer!Q19,0)","v":0},0,{"$f":"Grundkarakterer!AC19","v":0},{"$f":"Grundkarakterer!AG19","v":1},23,1.657142857142857,7,"Ja","Ja","Ja","Ja","Ja",12,"Vinterraps , linie"]
[null,null,null,null,null,"Foderradise (Strukturator)",13,{"$f":"Grundkarakterer!N20","v":1},{"$f":"Grundkarakterer!O20","v":0},{"$f":"Grundkarakterer!P20","v":1},{"$f":"Grundkarakterer!Q20","v":0},{"$f":"Grundkarakterer!U20","v":0},{"$f":"Grundkarakterer!V20","v":0},{"$f":"Grundkarakterer!W20","v":1},{"$f":"Grundkarakterer!X20","v":3},{"$f":"IF(OR($C$4=1,$C$5=1),Grundkarakterer!N20,0)","v":1},{"$f":"IF(C$7=1,Grundkarakterer!O20,0)","v":0},{"$f":"IF(OR(C$5=1,C$6=1),Grundkarakterer!P20,0)","v":0},{"$f":"IF(OR(C$5=1,C$6=1),Grundkarakterer!Q20,0)","v":0},0,{"$f":"Grundkarakterer!AC20","v":2},{"$f":"Grundkarakterer!AG20","v":0},22,1.6285714285714286,8,"Ja","Ja","Ja","Ja","Ja",13,"Foderradise (Strukturator)"]
["Etableringstidspunkt",null,null,null,null,"Havre",14,{"$f":"Grundkarakterer!N21","v":1},{"$f":"Grundkarakterer!O21","v":0},{"$f":"Grundkarakterer!P21","v":1},{"$f":"Grundkarakterer!Q21","v":0},{"$f":"Grundkarakterer!U21","v":0},{"$f":"Grundkarakterer!V21","v":0},{"$f":"Grundkarakterer!W21","v":1},{"$f":"Grundkarakterer!X21","v":3},{"$f":"IF(OR($C$4=1,$C$5=1),Grundkarakterer!N21,0)","v":1},{"$f":"IF(C$7=1,Grundkarakterer!O21,0)","v":0},{"$f":"IF(OR(C$5=1,C$6=1),Grundkarakterer!P21,0)","v":0},{"$f":"IF(OR(C$5=1,C$6=1),Grundkarakterer!Q21,0)","v":0},0,{"$f":"Grundkarakterer!AC21","v":3},{"$f":"Grundkarakterer!AG21","v":1},21,1.6,9,"Ja","Ja","Ja","Ja","Ja",14,"Havre"]
["Ved såning af primærafgrøde",{"$f":"IF('Efterafgrøde beslutningsstøtte'!A$13=Karaktermatrice!A17,1,0)","v":0},{"$f":"B17","v":0},{"$f":"IF(B17=1,1,0)","v":0},null,"Boghvede",15,{"$f":"Grundkarakterer!N22","v":0},{"$f":"Grundkarakterer!O22","v":0},{"$f":"Grundkarakterer!P22","v":0},{"$f":"Grundkarakterer!Q22","v":0},{"$f":"Grundkarakterer!U22","v":0},{"$f":"Grundkarakterer!V22","v":0},{"$f":"Grundkarakterer!W22","v":0},{"$f":"Grundkarakterer!X22","v":0},{"$f":"IF(OR($C$4=1,$C$5=1),Grundkarakterer!N22,0)","v":0},{"$f":"IF(C$7=1,Grundkarakterer!O22,0)","v":0},{"$f":"IF(OR(C$5=1,C$6=1),Grundkarakterer!P22,0)","v":0},{"$f":"IF(OR(C$5=1,C$6=1),Grundkarakterer!Q22,0)","v":0},0,{"$f":"Grundkarakterer!AC22","v":0},{"$f":"Grundkarakterer!AG22","v":0},20,0.5714285714285714,26,"Ja","Ja","Nej","Nej","Nej",15,"Tom"]
["Egnet til udsåning ved sidste radrensning",{"$f":"IF('Efterafgrøde beslutningsstøtte'!A$13=Karaktermatrice!A18,1,0)","v":0},{"$f":"B18","v":0},{"$f":"IF(B18=1,2,0)","v":0},null,"Vinterrybs",16,{"$f":"Grundkarakterer!N23","v":1},{"$f":"Grundkarakterer!O23","v":0},{"$f":"Grundkarakterer!P23","v":1},{"$f":"Grundkarakterer!Q23","v":0},{"$f":"Grundkarakterer!U23","v":0},{"$f":"Grundkarakterer!V23","v":0},{"$f":"Grundkarakterer!W23","v":1},{"$f":"Grundkarakterer!X23","v":3},{"$f":"IF(OR($C$4=1,$C$5=1),Grundkarakterer!N23,0)","v":1},{"$f":"IF(C$7=1,Grundkarakterer!O23,0)","v":0},{"$f":"IF(OR(C$5=1,C$6=1),Grundkarakterer!P23,0)","v":0},{"$f":"IF(OR(C$5=1,C$6=1),Grundkarakterer!Q23,0)","v":0},0,{"$f":"Grundkarakterer!AC23","v":3},{"$f":"Grundkarakterer!AG23","v":1},19,1.5428571428571427,10,"Ja","Ja","Ja","Ja","Ja",16,"Stauderug"]
["Efter høst af primærafgrøde",{"$f":"IF('Efterafgrøde beslutningsstøtte'!A$13=Karaktermatrice!A19,1,0)","v":1},{"$f":"B19","v":1},{"$f":"IF(B19=1,2,0)","v":2},null,"Gul Lupin",17,{"$f":"Grundkarakterer!N24","v":0},{"$f":"Grundkarakterer!O24","v":0},{"$f":"Grundkarakterer!P24","v":0},{"$f":"Grundkarakterer!Q24","v":0},{"$f":"Grundkarakterer!U24","v":0},{"$f":"Grundkarakterer!V24","v":0},{"$f":"Grundkarakterer!W24","v":0},{"$f":"Grundkarakterer!X24","v":0},{"$f":"IF(OR($C$4=1,$C$5=1),Grundkarakterer!N24,0)","v":0},{"$f":"IF(C$7=1,Grundkarakterer!O24,0)","v":0},{"$f":"IF(OR(C$5=1,C$6=1),Grundkarakterer!P24,0)","v":0},{"$f":"IF(OR(C$5=1,C$6=1),Grundkarakterer!Q24,0)","v":0},0,{"$f":"Grundkarakterer!AC24","v":0},{"$f":"Grundkarakterer!AG24","v":0},18,0.51428571428571423,27,"Ja","Ja","Nej","Nej","Nej",17,"Tom"]
[null,null,null,{"$f":"SUM(D17:D19)","v":2},null,"Vårbyg",18,{"$f":"Grundkarakterer!N25","v":1},{"$f":"Grundkarakterer!O25","v":0},{"$f":"Grundkarakterer!P25","v":1},{"$f":"Grundkarakterer!Q25","v":0},{"$f":"Grundkarakterer!U25","v":0},{"$f":"Grundkarakterer!V25","v":0},{"$f":"Grundkarakterer!W25","v":0},{"$f":"Grundkarakterer!X25","v":3},{"$f":"IF(OR($C$4=1,$C$5=1),Grundkarakterer!N25,0)","v":1},{"$f":"IF(C$7=1,Grundkarakterer!O25,0)","v":0},{"$f":"IF(OR(C$5=1,C$6=1),Grundkarakterer!P25,0)","v":0},{"$f":"IF(OR(C$5=1,C$6=1),Grundkarakterer!Q25,0)","v":0},0,{"$f":"Grundkarakterer!AC25","v":3},{"$f":"Grundkarakterer!AG25","v":1},17,1.4857142857142858,11,"Ja","Ja","Ja","Ja","Ja",18,"Vårbyg"]
[null,null,null,null,null,"vårbyg/fodervikke",19,{"$f":"Grundkarakterer!N26","v":0},{"$f":"Grundkarakterer!O26","v":0},{"$f":"Grundkarakterer!P26","v":0},{"$f":"Grundkarakterer!Q26","v":0},{"$f":"Grundkarakterer!U26","v":0},{"$f":"Grundkarakterer!V26","v":0},{"$f":"Grundkarakterer!W26","v":0},{"$f":"Grundkarakterer!X26","v":0},{"$f":"IF(OR($C$4=1,$C$5=1),Grundkarakterer!N26,0)","v":0},{"$f":"IF(C$7=1,Grundkarakterer!O26,0)","v":0},{"$f":"IF(OR(C$5=1,C$6=1),Grundkarakterer!P26,0)","v":0},{"$f":"IF(OR(C$5=1,C$6=1),Grundkarakterer!Q26,0)","v":0},0,{"$f":"Grundkarakterer!AC26","v":0},{"$f":"Grundkarakterer!AG26","v":1},16,0.45714285714285713,28,"Ja","Ja","Nej","Nej","Nej",19,"Tom"]
["Egnet til udlæg efterår i vinterkorn",null,{"$f":"IF(C14=\"xx\",\"xx\",IF(AND(C14=0,C17=1),1,0))","v":0},null,null,"Vinterrug ",20,{"$f":"Grundkarakterer!N27","v":1},{"$f":"Grundkarakterer!O27","v":0},{"$f":"Grundkarakterer!P27","v":1},{"$f":"Grundkarakterer!Q27","v":0},{"$f":"Grundkarakterer!U27","v":0},{"$f":"Grundkarakterer!V27","v":0},{"$f":"Grundkarakterer!W27","v":1},{"$f":"Grundkarakterer!X27","v":3},{"$f":"IF(OR($C$4=1,$C$5=1),Grundkarakterer!N27,0)","v":1},{"$f":"IF(C$7=1,Grundkarakterer!O27,0)","v":0},{"$f":"IF(OR(C$5=1,C$6=1),Grundkarakterer!P27,0)","v":0},{"$f":"IF(OR(C$5=1,C$6=1),Grundkarakterer!Q27,0)","v":0},0,{"$f":"Grundkarakterer!AC27","v":3},{"$f":"Grundkarakterer!AG27","v":1},15,1.4285714285714286,12,"Ja","Ja","Ja","Ja","Ja",20,"Vinterrug (population)"]
["Egnet til udlæg forår",null,{"$f":"IF(C14=\"xx\",\"xx\",IF(AND(C14=1,C17=1),1,IF(OR(C18=1,C19=1),0,0)))","v":0},null,null,"Olierædikke/gul sennep ",21,{"$f":"Grundkarakterer!N28","v":1},{"$f":"Grundkarakterer!O28","v":0},{"$f":"Grundkarakterer!P28","v":1},{"$f":"Grundkarakterer!Q28","v":0},{"$f":"Grundkarakterer!U28","v":0},{"$f":"Grundkarakterer!V28","v":0},{"$f":"Grundkarakterer!W28","v":0},{"$f":"Grundkarakterer!X28","v":0},{"$f":"IF(OR($C$4=1,$C$5=1),Grundkarakterer!N28,0)","v":1},{"$f":"IF(C$7=1,Grundkarakterer!O28,0)","v":0},{"$f":"IF(OR(C$5=1,C$6=1),Grundkarakterer!P28,0)","v":0},{"$f":"IF(OR(C$5=1,C$6=1),Grundkarakterer!Q28,0)","v":0},0,{"$f":"Grundkarakterer!AC28","v":0},{"$f":"Grundkarakterer!AG28","v":0},14,1.4,13,"Ja","Ja","Nej","Ja","Nej",21,"Tom"]
["Egnet til udsåning ved sidste radrensning",null,{"$f":"IF(C14=\"xx\",\"xx\",IF(C18=1,1,0))","v":0},null,null,"Blanding med bælgsæd overvintrene",22,{"$f":"Grundkarakterer!N29","v":0},{"$f":"Grundkarakterer!O29","v":0},{"$f":"Grundkarakterer!P29","v":0},{"$f":"Grundkarakterer!Q29","v":1},{"$f":"Grundkarakterer!U29","v":0},{"$f":"Grundkarakterer!V29","v":0},{"$f":"Grundkarakterer!W29","v":1},{"$f":"Grundkarakterer!X29","v":2},{"$f":"IF(OR($C$4=1,$C$5=1),Grundkarakterer!N29,0)","v":0},{"$f":"IF(C$7=1,Grundkarakterer!O29,0)","v":0},{"$f":"IF(OR(C$5=1,C$6=1),Grundkarakterer!P29,0)","v":0},{"$f":"IF(OR(C$5=1,C$6=1),Grundkarakterer!Q29,0)","v":0},0,{"$f":"Grundkarakterer!AC29","v":3},{"$f":"Grundkarakterer!AG29","v":0},13,0.37142857142857144,29,"Ja","Ja","Ja","Nej","Nej",22,"Vinterrug (hybrid og syntetisk)"]
["Efter høst af primærafgrøde",null,{"$f":"IF(C14=\"xx\",\"xx\",IF(C19=1,1,0))","v":1},null,null,"Blanding uden bælgsæd udvintrene",23,{"$f":"Grundkarakterer!N30","v":0},{"$f":"Grundkarakterer!O30","v":0},{"$f":"Grundkarakterer!P30","v":0},{"$f":"Grundkarakterer!Q30","v":1},{"$f":"Grundkarakterer!U30","v":0},{"$f":"Grundkarakterer!V30","v":0},{"$f":"Grundkarakterer!W30","v":0},{"$f":"Grundkarakterer!X30","v":1},{"$f":"IF(OR($C$4=1,$C$5=1),Grundkarakterer!N30,0)","v":0},{"$f":"IF(C$7=1,Grundkarakterer!O30,0)","v":0},{"$f":"IF(OR(C$5=1,C$6=1),Grundkarakterer!P30,0)","v":0},{"$f":"IF(OR(C$5=1,C$6=1),Grundkarakterer!Q30,0)","v":0},0,{"$f":"Grundkarakterer!AC30","v":3},{"$f":"Grundkarakterer!AG30","v":0},12,0.34285714285714286,30,"Ja","Ja","Ja","Nej","Nej",23,"Tom"]
[null,null,null,null,null,"Cikorie",24,{"$f":"Grundkarakterer!N31","v":1},{"$f":"Grundkarakterer!O31","v":0},{"$f":"Grundkarakterer!P31","v":1},{"$f":"Grundkarakterer!Q31","v":1},{"$f":"Grundkarakterer!U31","v":0},{"$f":"Grundkarakterer!V31","v":3},{"$f":"Grundkarakterer!W31","v":2},{"$f":"Grundkarakterer!X31","v":0},{"$f":"IF(OR($C$4=1,$C$5=1),Grundkarakterer!N31,0)","v":1},{"$f":"IF(C$7=1,Grundkarakterer!O31,0)","v":0},{"$f":"IF(OR(C$5=1,C$6=1),Grundkarakterer!P31,0)","v":0},{"$f":"IF(OR(C$5=1,C$6=1),Grundkarakterer!Q31,0)","v":0},0,{"$f":"Grundkarakterer!AC31","v":3},{"$f":"Grundkarakterer!AG31","v":0},11,1.3142857142857143,14,"Ja","Ja","Nej","Ja","Nej",24,"Cikorie"]
["Kålbrok",{"$f":"'Efterafgrøde beslutningsstøtte'!B28","v":"Ikke vigtigt"},{"$f":"IF(OR(B27=\"Ikke vigtigt\",B27=\"Foretrækkes\"),0,IF(B27=\"Der må ikke opformeres kålbrok\",1,\"Fejl\"))","v":0},"1= må ikke forekomme",null,"Honningurt",25,{"$f":"Grundkarakterer!N32","v":1},{"$f":"Grundkarakterer!O32","v":0},{"$f":"Grundkarakterer!P32","v":1},{"$f":"Grundkarakterer!Q32","v":0},{"$f":"Grundkarakterer!U32","v":0},{"$f":"Grundkarakterer!V32","v":0},{"$f":"Grundkarakterer!W32","v":0},{"$f":"Grundkarakterer!X32","v":3},{"$f":"IF(OR($C$4=1,$C$5=1),Grundkarakterer!N32,0)","v":1},{"$f":"IF(C$7=1,Grundkarakterer!O32,0)","v":0},{"$f":"IF(OR(C$5=1,C$6=1),Grundkarakterer!P32,0)","v":0},{"$f":"IF(OR(C$5=1,C$6=1),Grundkarakterer!Q32,0)","v":0},0,{"$f":"Grundkarakterer!AC32","v":3},{"$f":"Grundkarakterer!AG32","v":0},10,{"$f":"W27/($G$36+1)+P27+Q27+T27","v":1.2857142857142856},15,"Ja","Ja","Ja",{"$f":"IF( $C$9=0,\"Ja\",IF(X27>=$C$9,\"Ja\",\"Nej\"))","v":"Ja"},"Ja",25,"Honningurt"]
["Egen udsæd",{"$f":"'Efterafgrøde beslutningsstøtte'!B33","v":"Ikke vigtigt"},{"$f":"IF(B28=\"Egen udsæd skal anvendes \",1,0)","v":0},"1 = Egen udsæd skal kunne anvendes",null,"Fodervikke ",26,{"$f":"Grundkarakterer!N33","v":0},{"$f":"Grundkarakterer!O33","v":0},{"$f":"Grundkarakterer!P33","v":0},{"$f":"Grundkarakterer!Q33","v":1},{"$f":"Grundkarakterer!U33","v":0},{"$f":"Grundkarakterer!V33","v":0},{"$f":"Grundkarakterer!W33","v":0},{"$f":"Grundkarakterer!X33","v":3},{"$f":"IF(OR($C$4=1,$C$5=1),Grundkarakterer!N33,0)","v":0},{"$f":"IF(C$7=1,Grundkarakterer!O33,0)","v":0},{"$f":"IF(OR(C$5=1,C$6=1),Grundkarakterer!P33,0)","v":0},{"$f":"IF(OR(C$5=1,C$6=1),Grundkarakterer!Q33,0)","v":0},0,{"$f":"Grundkarakterer!AC33","v":3},{"$f":"Grundkarakterer!AG33","v":1},9,0.25714285714285712,31,"Ja","Ja","Ja","Nej","Nej",26,"Fodervikke "]
[null,null,null,null,null,"Vintervikke",27,{"$f":"Grundkarakterer!N34","v":0},{"$f":"Grundkarakterer!O34","v":0},{"$f":"Grundkarakterer!P34","v":0},{"$f":"Grundkarakterer!Q34","v":1},{"$f":"Grundkarakterer!U34","v":0},{"$f":"Grundkarakterer!V34","v":0},{"$f":"Grundkarakterer!W34","v":0},{"$f":"Grundkarakterer!X34","v":3},{"$f":"IF(OR($C$4=1,$C$5=1),Grundkarakterer!N34,0)","v":0},{"$f":"IF(C$7=1,Grundkarakterer!O34,0)","v":0},{"$f":"IF(OR(C$5=1,C$6=1),Grundkarakterer!P34,0)","v":0},{"$f":"IF(OR(C$5=1,C$6=1),Grundkarakterer!Q34,0)","v":0},0,{"$f":"Grundkarakterer!AC34","v":3},{"$f":"Grundkarakterer!AG34","v":0},8,0.22857142857142856,32,"Ja","Ja","Ja","Nej","Nej",27,"Vintervikke"]
["Obligatoriske valg foretaget?",null,null,null,null,"Alexandrinekløver",28,{"$f":"Grundkarakterer!N35","v":0},{"$f":"Grundkarakterer!O35","v":0},{"$f":"Grundkarakterer!P35","v":0},{"$f":"Grundkarakterer!Q35","v":1},{"$f":"Grundkarakterer!U35","v":0},{"$f":"Grundkarakterer!V35","v":2},{"$f":"Grundkarakterer!W35","v":1},{"$f":"Grundkarakterer!X35","v":2},{"$f":"IF(OR($C$4=1,$C$5=1),Grundkarakterer!N35,0)","v":0},{"$f":"IF(C$7=1,Grundkarakterer!O35,0)","v":0},{"$f":"IF(OR(C$5=1,C$6=1),Grundkarakterer!P35,0)","v":0},{"$f":"IF(OR(C$5=1,C$6=1),Grundkarakterer!Q35,0)","v":0},0,{"$f":"Grundkarakterer!AC35","v":3},{"$f":"Grundkarakterer!AG35","v":1},7,0.2,33,"Ja","Ja","Ja","Nej","Nej",28,"Alexandrinekløver"]
[{"$f":"IF(AND('Efterafgrøde beslutningsstøtte'!A7<>\"Vælg funktion\",'Efterafgrøde beslutningsstøtte'!A10<>\"Vælg afgrøde\",'Efterafgrøde beslutningsstøtte'!A13<>\"Vælg etableringstidspunkt\",'Efterafgrøde beslutningsstøtte'!A16<>\"Vælg jordtype\",'Efterafgrøde beslutningsstøtte'!A19<>\"Vælg afgrøde\"),\"Ja\",\"Nej\")","v":"Ja"},null,null,null,null,"Hvidkløver",29,{"$f":"Grundkarakterer!N36","v":0},{"$f":"Grundkarakterer!O36","v":0},{"$f":"Grundkarakterer!P36","v":0},{"$f":"Grundkarakterer!Q36","v":1},{"$f":"Grundkarakterer!U36","v":0},{"$f":"Grundkarakterer!V36","v":3},{"$f":"Grundkarakterer!W36","v":3},{"$f":"Grundkarakterer!X36","v":1},{"$f":"IF(OR($C$4=1,$C$5=1),Grundkarakterer!N36,0)","v":0},{"$f":"IF(C$7=1,Grundkarakterer!O36,0)","v":0},{"$f":"IF(OR(C$5=1,C$6=1),Grundkarakterer!P36,0)","v":0},{"$f":"IF(OR(C$5=1,C$6=1),Grundkarakterer!Q36,0)","v":0},0,{"$f":"Grundkarakterer!AC36","v":3},{"$f":"Grundkarakterer!AG36","v":0},6,0.17142857142857143,34,"Ja","Ja","Ja","Nej","Nej",29,"Hvidkløver"]
[null,null,null,null,null,"Olieræddike og vintervikke",30,{"$f":"Grundkarakterer!N37","v":1},{"$f":"Grundkarakterer!O37","v":0},{"$f":"Grundkarakterer!P37","v":0},{"$f":"Grundkarakterer!Q37","v":0},{"$f":"Grundkarakterer!U37","v":0},{"$f":"Grundkarakterer!V37","v":0},{"$f":"Grundkarakterer!W37","v":0},{"$f":"Grundkarakterer!X37","v":3},{"$f":"IF(OR($C$4=1,$C$5=1),Grundkarakterer!N37,0)","v":1},{"$f":"IF(C$7=1,Grundkarakterer!O37,0)","v":0},{"$f":"IF(OR(C$5=1,C$6=1),Grundkarakterer!P37,0)","v":0},{"$f":"IF(OR(C$5=1,C$6=1),Grundkarakterer!Q37,0)","v":0},0,{"$f":"Grundkarakterer!AC37","v":2},{"$f":"Grundkarakterer!AG37","v":0},5,1.1428571428571428,16,"Ja","Ja","Ja","Ja","Ja",30,"Blanding af olieræddike og fodervikke"]
[null,null,null,null,null,"Hvidkløver/alm. rajgræs",31,{"$f":"Grundkarakterer!N38","v":1},{"$f":"Grundkarakterer!O38","v":0},{"$f":"Grundkarakterer!P38","v":0},{"$f":"Grundkarakterer!Q38","v":1},{"$f":"Grundkarakterer!U38","v":0},{"$f":"Grundkarakterer!V38","v":3},{"$f":"Grundkarakterer!W38","v":3},{"$f":"Grundkarakterer!X38","v":2},{"$f":"IF(OR($C$4=1,$C$5=1),Grundkarakterer!N38,0)","v":1},{"$f":"IF(C$7=1,Grundkarakterer!O38,0)","v":0},{"$f":"IF(OR(C$5=1,C$6=1),Grundkarakterer!P38,0)","v":0},{"$f":"IF(OR(C$5=1,C$6=1),Grundkarakterer!Q38,0)","v":0},0,{"$f":"Grundkarakterer!AC38","v":3},{"$f":"Grundkarakterer!AG38","v":0},4,1.1142857142857143,17,"Ja","Ja","Ja","Ja","Ja",31,"Hvidkløver/alm. rajgræs"]
[null,null,null,null,null,"Rødkløver/strandsvingel",32,{"$f":"Grundkarakterer!N39","v":1},{"$f":"Grundkarakterer!O39","v":0},{"$f":"Grundkarakterer!P39","v":0},{"$f":"Grundkarakterer!Q39","v":1},{"$f":"Grundkarakterer!U39","v":0},{"$f":"Grundkarakterer!V39","v":1},{"$f":"Grundkarakterer!W39","v":3},{"$f":"Grundkarakterer!X39","v":1},{"$f":"IF(OR($C$4=1,$C$5=1),Grundkarakterer!N39,0)","v":1},{"$f":"IF(C$7=1,Grundkarakterer!O39,0)","v":0},{"$f":"IF(OR(C$5=1,C$6=1),Grundkarakterer!P39,0)","v":0},{"$f":"IF(OR(C$5=1,C$6=1),Grundkarakterer!Q39,0)","v":0},0,{"$f":"Grundkarakterer!AC39","v":3},{"$f":"Grundkarakterer!AG39","v":0},3,1.0857142857142856,18,"Ja","Ja","Ja","Ja","Ja",32,"Rødkløver/strandsvingel"]
[null,null,null,null,null,"Vintervikke/vinterrug",33,{"$f":"Grundkarakterer!N40","v":1},{"$f":"Grundkarakterer!O40","v":0},{"$f":"Grundkarakterer!P40","v":0},{"$f":"Grundkarakterer!Q40","v":1},{"$f":"Grundkarakterer!U40","v":0},{"$f":"Grundkarakterer!V40","v":0},{"$f":"Grundkarakterer!W40","v":0},{"$f":"Grundkarakterer!X40","v":3},{"$f":"IF(OR($C$4=1,$C$5=1),Grundkarakterer!N40,0)","v":1},{"$f":"IF(C$7=1,Grundkarakterer!O40,0)","v":0},{"$f":"IF(OR(C$5=1,C$6=1),Grundkarakterer!P40,0)","v":0},{"$f":"IF(OR(C$5=1,C$6=1),Grundkarakterer!Q40,0)","v":0},0,{"$f":"Grundkarakterer!AC40","v":3},{"$f":"Grundkarakterer!AG40","v":0},2,1.0571428571428572,19,"Ja","Ja","Ja","Ja","Ja",33,"Vintervikke/vinterrug"]
[null,null,null,null,null,"Kløvergræs (blanding)",34,{"$f":"Grundkarakterer!N41","v":1},{"$f":"Grundkarakterer!O41","v":0},{"$f":"Grundkarakterer!P41","v":0},{"$f":"Grundkarakterer!Q41","v":1},{"$f":"Grundkarakterer!U41","v":0},{"$f":"Grundkarakterer!V41","v":3},{"$f":"Grundkarakterer!W41","v":3},{"$f":"Grundkarakterer!X41","v":3},{"$f":"IF(OR($C$4=1,$C$5=1),Grundkarakterer!N41,0)","v":1},{"$f":"IF(C$7=1,Grundkarakterer!O41,0)","v":0},{"$f":"IF(OR(C$5=1,C$6=1),Grundkarakterer!P41,0)","v":0},{"$f":"IF(OR(C$5=1,C$6=1),Grundkarakterer!Q41,0)","v":0},0,{"$f":"Grundkarakterer!AC41","v":3},{"$f":"Grundkarakterer!AG41","v":0},1,1.0285714285714285,20,"Ja","Ja","Ja","Ja","Ja",34,"Kløvergræs"]
[null,null,null,null,null,null,null,null,null,null,null,null,null,null,null,null,null,null,null,null,null,null,null,null,null,null,null,null,null,{"$f":"COUNTIF(AD3:AD36,\"Ja\")","v":17}]
[null,null,null,null,null,null,null,7,8,9,10,11,12,13,14,15,16,17,18,19,20,21,22,23,24,25,26,27,28,29,30,31]
[null,"Index","Med","Efterafgrøde","Afgrøde","Tidspunkt","Link","Seneste såtidspunkt","Omkostninger","Pligtig efterafgrøde","Pligtig mellemafgrøde","MFO-efterafgrøde i blanding2)","MFO-udlæg3)","Miljø-efterafgrøder","Frivillig efterafgrøde","Grønne marker (2,3 DE-brug)","Egnet til udlæg efterår i vinterkorn","Egnet til udlæg forår","Egnet til udsåning ved sidste radrensning","Egnet til udsåning efter tidlig høst (10. august)","Kvælstoffikserende","Stor kvælstof-eftervirkning","Hurtig og dyb rodvækst på lerjord","Er afgrøden robust mod ukrudtsmidler?","Der findes sorter, der ikke opformerer kålbrok","Der findes sorter, der er sanerende for roecystenematoder","Kan anvendes i sædskifter med kartofler (opformerer ikke fritlevende nematoder og rodfiltsvamp","Vinterfast","Egen udsæd kan anvendes4)","Tiebreak","Kommentare ang. ukrudt","Nettoomkostninger"]
[1,{"$f":"INDEX(Grundkarakterer!A$8:A$41,AE3)","v":1},{"$f":"IF(AND(VLOOKUP(B40,$G$3:$AE$36,24,FALSE)=\"Ja\",A$31=\"Ja\"),\"Ja\",\"Nej\")","v":"Ja"},{"$f":"IF(C40=\"Ja\",INDEX(Grundkarakterer!B$8:B$41,AE3),\"xx\")","v":"Alm. rajgræs, dipl."},{"$f":"IF(C40=\"Ja\",INDEX(Grundkarakterer!C$8:C$41,$AE3),\"xx\")","v":"1. Vintersæd"},{"$f":"IF(C40=\"Ja\",INDEX(Grundkarakterer!D$8:D$41,$AE3),\"xx\")","v":"1. Ved etablering af primærafgrøde"},{"$f":"IF(C40=\"Ja\",INDEX(Grundkarakterer!#REF!,$AE3),\"xx\")","v":{"$error":"#REF!"}},{"$f":"IF($C40=\"Ja\",IF($D$9=1,INDEX(Grundkarakterer!E$8:E$41,$AE3),IF(AND($D$9=2,$D$20=1),INDEX(Grundkarakterer!H$8:H$41,$AE3),IF(AND($D$9=2,$D$20<>1),INDEX(Grundkarakterer!F$8:F$41,$AE3),IF(AND($D$9=3,$D$20=1),INDEX(Grundkarakterer!I$8:I$41,$AE3),IF(AND($D$9=3,$D$20<>1),INDEX(Grundkarakterer!G$8:G$41,$AE3),IF($D$9=4,INDEX(Grundkarakterer!J$8:J$41,$AE3),IF($D$9=5,INDEX(Grundkarakterer!K$8:K$41,$AE3),\"Fejl\"))))))),\"xx\")","v":"1.august"},{"$f":"IF($C40=\"Ja\",INDEX(Grundkarakterer!L$8:L$41,$AE3),\"xx\")","v":-185},{"$f":"IF($C40=\"Ja\",INDEX(Grundkarakterer!N$8:N$41,$AE3),\"xx\")","v":1},{"$f":"IF($C40=\"Ja\",INDEX(Grundkarakterer!O$8:O$41,$AE3),\"xx\")","v":0},{"$f":"IF($C40=\"Ja\",INDEX(Grundkarakterer!P$8:P$41,$AE3),\"xx\")","v":1},{"$f":"IF($C40=\"Ja\",INDEX(Grundkarakterer!Q$8:Q$41,$AE3),\"xx\")","v":1},{"$f":"IF($C40=\"Ja\",INDEX(Grundkarakterer!R$8:R$41,$AE3),\"xx\")","v":1},{"$f":"IF($C40=\"Ja\",INDEX(Grundkarakterer!S$8:S$41,$AE3),\"xx\")","v":1},{"$f":"IF($C40=\"Ja\",INDEX(Grundkarakterer!T$8:T$41,$AE3),\"xx\")","v":1},{"$f":"IF($C40=\"Ja\",INDEX(Grundkarakterer!U$8:U$41,$AE3),\"xx\")","v":0},{"$f":"IF($C40=\"Ja\",INDEX(Grundkarakterer!V$8:V$41,$AE3),\"xx\")","v":3},{"$f":"IF($C40=\"Ja\",INDEX(Grundkarakterer!W$8:W$41,$AE3),\"xx\")","v":3},{"$f":"IF($C40=\"Ja\",INDEX(Grundkarakterer!X$8:X$41,$AE3),\"xx\")","v":2},{"$f":"IF($C40=\"Ja\",INDEX(Grundkarakterer!Y$8:Y$41,$AE3),\"xx\")","v":0},{"$f":"IF($C40=\"Ja\",INDEX(Grundkarakterer!Z$8:Z$41,$AE3),\"xx\")","v":1},{"$f":"IF($C40=\"Ja\",INDEX(Grundkarakterer!AA$8:AA$41,$AE3),\"xx\")","v":0},{"$f":"IF($C40=\"Ja\",INDEX(Grundkarakterer!AB$8:AB$41,$AE3),\"xx\")","v":2},{"$f":"IF($C40=\"Ja\",INDEX(Grundkarakterer!AC$8:AC$41,$AE3),\"xx\")","v":3},{"$f":"IF($C40=\"Ja\",INDEX(Grundkarakterer!AD$8:AD$41,$AE3),\"xx\")","v":0},{"$f":"IF($C40=\"Ja\",INDEX(Grundkarakterer!AE$8:AE$41,$AE3),\"xx\")","v":0},{"$f":"IF($C40=\"Ja\",INDEX(Grundkarakterer!AF$8:AF$41,$AE3),\"xx\")","v":3},{"$f":"IF($C40=\"Ja\",INDEX(Grundkarakterer!AG$8:AG$41,$AE3),\"xx\")","v":0},{"$f":"IF($C40=\"Ja\",INDEX(Grundkarakterer!AH$8:AH$41,$AE3),\"xx\")","v":1},{"$f":"IF($C40=\"Ja\",INDEX(Grundkarakterer!AI$8:AI$41,$AE3),\"xx\")","v":0},{"$f":"IF($C40=\"Ja\",INDEX(Grundkarakterer!M$8:M$41,$AE3),\"xx\")","v":"-"}]
[2,{"$f":"INDEX(Grundkarakterer!A$8:A$41,AE4)","v":2},"Nej",{"$f":"IF(C41=\"Ja\",INDEX(Grundkarakterer!B$8:B$41,AE4),\"xx\")","v":"xx"},{"$f":"IF(C41=\"Ja\",INDEX(Grundkarakterer!C$8:C$41,$AE4),\"xx\")","v":"xx"},{"$f":"IF(C41=\"Ja\",INDEX(Grundkarakterer!D$8:D$41,$AE4),\"xx\")","v":"xx"},{"$f":"IF(C41=\"Ja\",INDEX(Grundkarakterer!#REF!,$AE4),\"xx\")","v":"xx"},{"$f":"IF($C41=\"Ja\",IF($D$9=1,INDEX(Grundkarakterer!E$8:E$41,$AE4),IF(AND($D$9=2,$D$20=1),INDEX(Grundkarakterer!H$8:H$41,$AE4),IF(AND($D$9=2,$D$20<>1),INDEX(Grundkarakterer!F$8:F$41,$AE4),IF(AND($D$9=3,$D$20=1),INDEX(Grundkarakterer!I$8:I$41,$AE4),IF(AND($D$9=3,$D$20<>1),INDEX(Grundkarakterer!G$8:G$41,$AE4),IF($D$9=4,INDEX(Grundkarakterer!J$8:J$41,$AE4),IF($D$9=5,INDEX(Grundkarakterer!K$8:K$41,$AE4),\"Fejl\"))))))),\"xx\")","v":"xx"},{"$f":"IF($C41=\"Ja\",INDEX(Grundkarakterer!L$8:L$41,$AE4),\"xx\")","v":"xx"},{"$f":"IF($C41=\"Ja\",INDEX(Grundkarakterer!N$8:N$41,$AE4),\"xx\")","v":"xx"},{"$f":"IF($C41=\"Ja\",INDEX(Grundkarakterer!O$8:O$41,$AE4),\"xx\")","v":"xx"},{"$f":"IF($C41=\"Ja\",INDEX(Grundkarakterer!P$8:P$41,$AE4),\"xx\")","v":"xx"},{"$f":"IF($C41=\"Ja\",INDEX(Grundkarakterer!Q$8:Q$41,$AE4),\"xx\")","v":"xx"},{"$f":"IF($C41=\"Ja\",INDEX(Grundkarakterer!R$8:R$41,$AE4),\"xx\")","v":"xx"},{"$f":"IF($C41=\"Ja\",INDEX(Grundkarakterer!S$8:S$41,$AE4),\"xx\")","v":"xx"},{"$f":"IF($C41=\"Ja\",INDEX(Grundkarakterer!T$8:T$41,$AE4),\"xx\")","v":"xx"},{"$f":"IF($C41=\"Ja\",INDEX(Grundkarakterer!U$8:U$41,$AE4),\"xx\")","v":"xx"},{"$f":"IF($C41=\"Ja\",INDEX(Grundkarakterer!V$8:V$41,$AE4),\"xx\")","v":"xx"},{"$f":"IF($C41=\"Ja\",INDEX(Grundkarakterer!W$8:W$41,$AE4),\"xx\")","v":"xx"},{"$f":"IF($C41=\"Ja\",INDEX(Grundkarakterer!X$8:X$41,$AE4),\"xx\")","v":"xx"},{"$f":"IF($C41=\"Ja\",INDEX(Grundkarakterer!Y$8:Y$41,$AE4),\"xx\")","v":"xx"},{"$f":"IF($C41=\"Ja\",INDEX(Grundkarakterer!Z$8:Z$41,$AE4),\"xx\")","v":"xx"},{"$f":"IF($C41=\"Ja\",INDEX(Grundkarakterer!AA$8:AA$41,$AE4),\"xx\")","v":"xx"},{"$f":"IF($C41=\"Ja\",INDEX(Grundkarakterer!AB$8:AB$41,$AE4),\"xx\")","v":"xx"},{"$f":"IF($C41=\"Ja\",INDEX(Grundkarakterer!AC$8:AC$41,$AE4),\"xx\")","v":"xx"},{"$f":"IF($C41=\"Ja\",INDEX(Grundkarakterer!AD$8:AD$41,$AE4),\"xx\")","v":"xx"},{"$f":"IF($C41=\"Ja\",INDEX(Grundkarakterer!AE$8:AE$41,$AE4),\"xx\")","v":"xx"},{"$f":"IF($C41=\"Ja\",INDEX(Grundkarakterer!AF$8:AF$41,$AE4),\"xx\")","v":"xx"},{"$f":"IF($C41=\"Ja\",INDEX(Grundkarakterer!AG$8:AG$41,$AE4),\"xx\")","v":"xx"},{"$f":"IF($C41=\"Ja\",INDEX(Grundkarakterer!AH$8:AH$41,$AE4),\"xx\")","v":"xx"},{"$f":"IF($C41=\"Ja\",INDEX(Grundkarakterer!AI$8:AI$41,$AE4),\"xx\")","v":"xx"},{"$f":"IF($C41=\"Ja\",INDEX(Grundkarakterer!M$8:M$41,$AE4),\"xx\")","v":"xx"}]
[3,{"$f":"INDEX(Grundkarakterer!A$8:A$41,AE5)","v":3},"Ja",{"$f":"IF(C42=\"Ja\",INDEX(Grundkarakterer!B$8:B$41,AE5),\"xx\")","v":"Vårbyg /Vikke /Gul Sennep"},{"$f":"IF(C42=\"Ja\",INDEX(Grundkarakterer!C$8:C$41,$AE5),\"xx\")","v":0},{"$f":"IF(C42=\"Ja\",INDEX(Grundkarakterer!D$8:D$41,$AE5),\"xx\")","v":0},{"$f":"IF(C42=\"Ja\",INDEX(Grundkarakterer!#REF!,$AE5),\"xx\")","v":{"$error":"#REF!"}},{"$f":"IF($C42=\"Ja\",IF($D$9=1,INDEX(Grundkarakterer!E$8:E$41,$AE5),IF(AND($D$9=2,$D$20=1),INDEX(Grundkarakterer!H$8:H$41,$AE5),IF(AND($D$9=2,$D$20<>1),INDEX(Grundkarakterer!F$8:F$41,$AE5),IF(AND($D$9=3,$D$20=1),INDEX(Grundkarakterer!I$8:I$41,$AE5),IF(AND($D$9=3,$D$20<>1),INDEX(Grundkarakterer!G$8:G$41,$AE5),IF($D$9=4,INDEX(Grundkarakterer!J$8:J$41,$AE5),IF($D$9=5,INDEX(Grundkarakterer!K$8:K$41,$AE5),\"Fejl\"))))))),\"xx\")","v":"20. august"},{"$f":"IF($C42=\"Ja\",INDEX(Grundkarakterer!L$8:L$41,$AE5),\"xx\")","v":-788.5},{"$f":"IF($C42=\"Ja\",INDEX(Grundkarakterer!N$8:N$41,$AE5),\"xx\")","v":1},{"$f":"IF($C42=\"Ja\",INDEX(Grundkarakterer!O$8:O$41,$AE5),\"xx\")","v":0},{"$f":"IF($C42=\"Ja\",INDEX(Grundkarakterer!P$8:P$41,$AE5),\"xx\")","v":0},{"$f":"IF($C42=\"Ja\",INDEX(Grundkarakterer!Q$8:Q$41,$AE5),\"xx\")","v":0},{"$f":"IF($C42=\"Ja\",INDEX(Grundkarakterer!R$8:R$41,$AE5),\"xx\")","v":1},{"$f":"IF($C42=\"Ja\",INDEX(Grundkarakterer!S$8:S$41,$AE5),\"xx\")","v":1},{"$f":"IF($C42=\"Ja\",INDEX(Grundkarakterer!T$8:T$41,$AE5),\"xx\")","v":1},{"$f":"IF($C42=\"Ja\",INDEX(Grundkarakterer!U$8:U$41,$AE5),\"xx\")","v":0},{"$f":"IF($C42=\"Ja\",INDEX(Grundkarakterer!V$8:V$41,$AE5),\"xx\")","v":0},{"$f":"IF($C42=\"Ja\",INDEX(Grundkarakterer!W$8:W$41,$AE5),\"xx\")","v":0},{"$f":"IF($C42=\"Ja\",INDEX(Grundkarakterer!X$8:X$41,$AE5),\"xx\")","v":3},{"$f":"IF($C42=\"Ja\",INDEX(Grundkarakterer!Y$8:Y$41,$AE5),\"xx\")","v":1},{"$f":"IF($C42=\"Ja\",INDEX(Grundkarakterer!Z$8:Z$41,$AE5),\"xx\")","v":2},{"$f":"IF($C42=\"Ja\",INDEX(Grundkarakterer!AA$8:AA$41,$AE5),\"xx\")","v":1},{"$f":"IF($C42=\"Ja\",INDEX(Grundkarakterer!AB$8:AB$41,$AE5),\"xx\")","v":0},{"$f":"IF($C42=\"Ja\",INDEX(Grundkarakterer!AC$8:AC$41,$AE5),\"xx\")","v":3},{"$f":"IF($C42=\"Ja\",INDEX(Grundkarakterer!AD$8:AD$41,$AE5),\"xx\")","v":0},{"$f":"IF($C42=\"Ja\",INDEX(Grundkarakterer!AE$8:AE$41,$AE5),\"xx\")","v":0},{"$f":"IF($C42=\"Ja\",INDEX(Grundkarakterer!AF$8:AF$41,$AE5),\"xx\")","v":1},{"$f":"IF($C42=\"Ja\",INDEX(Grundkarakterer!AG$8:AG$41,$AE5),\"xx\")","v":0},{"$f":"IF($C42=\"Ja\",INDEX(Grundkarakterer!AH$8:AH$41,$AE5),\"xx\")","v":3},{"$f":"IF($C42=\"Ja\",INDEX(Grundkarakterer!AI$8:AI$41,$AE5),\"xx\")","v":0},{"$f":"IF($C42=\"Ja\",INDEX(Grundkarakterer!M$8:M$41,$AE5),\"xx\")","v":-348.5}]
[4,{"$f":"INDEX(Grundkarakterer!A$8:A$41,AE6)","v":4},"Nej",{"$f":"IF(C43=\"Ja\",INDEX(Grundkarakterer!B$8:B$41,AE6),\"xx\")","v":"xx"},{"$f":"IF(C43=\"Ja\",INDEX(Grundkarakterer!C$8:C$41,$AE6),\"xx\")","v":"xx"},{"$f":"IF(C43=\"Ja\",INDEX(Grundkarakterer!D$8:D$41,$AE6),\"xx\")","v":"xx"},{"$f":"IF(C43=\"Ja\",INDEX(Grundkarakterer!#REF!,$AE6),\"xx\")","v":"xx"},{"$f":"IF($C43=\"Ja\",IF($D$9=1,INDEX(Grundkarakterer!E$8:E$41,$AE6),IF(AND($D$9=2,$D$20=1),INDEX(Grundkarakterer!H$8:H$41,$AE6),IF(AND($D$9=2,$D$20<>1),INDEX(Grundkarakterer!F$8:F$41,$AE6),IF(AND($D$9=3,$D$20=1),INDEX(Grundkarakterer!I$8:I$41,$AE6),IF(AND($D$9=3,$D$20<>1),INDEX(Grundkarakterer!G$8:G$41,$AE6),IF($D$9=4,INDEX(Grundkarakterer!J$8:J$41,$AE6),IF($D$9=5,INDEX(Grundkarakterer!K$8:K$41,$AE6),\"Fejl\"))))))),\"xx\")","v":"xx"},{"$f":"IF($C43=\"Ja\",INDEX(Grundkarakterer!L$8:L$41,$AE6),\"xx\")","v":"xx"},{"$f":"IF($C43=\"Ja\",INDEX(Grundkarakterer!N$8:N$41,$AE6),\"xx\")","v":"xx"},{"$f":"IF($C43=\"Ja\",INDEX(Grundkarakterer!O$8:O$41,$AE6),\"xx\")","v":"xx"},{"$f":"IF($C43=\"Ja\",INDEX(Grundkarakterer!P$8:P$41,$AE6),\"xx\")","v":"xx"},{"$f":"IF($C43=\"Ja\",INDEX(Grundkarakterer!Q$8:Q$41,$AE6),\"xx\")","v":"xx"},{"$f":"IF($C43=\"Ja\",INDEX(Grundkarakterer!R$8:R$41,$AE6),\"xx\")","v":"xx"},{"$f":"IF($C43=\"Ja\",INDEX(Grundkarakterer!S$8:S$41,$AE6),\"xx\")","v":"xx"},{"$f":"IF($C43=\"Ja\",INDEX(Grundkarakterer!T$8:T$41,$AE6),\"xx\")","v":"xx"},{"$f":"IF($C43=\"Ja\",INDEX(Grundkarakterer!U$8:U$41,$AE6),\"xx\")","v":"xx"},{"$f":"IF($C43=\"Ja\",INDEX(Grundkarakterer!V$8:V$41,$AE6),\"xx\")","v":"xx"},{"$f":"IF($C43=\"Ja\",INDEX(Grundkarakterer!W$8:W$41,$AE6),\"xx\")","v":"xx"},{"$f":"IF($C43=\"Ja\",INDEX(Grundkarakterer!X$8:X$41,$AE6),\"xx\")","v":"xx"},{"$f":"IF($C43=\"Ja\",INDEX(Grundkarakterer!Y$8:Y$41,$AE6),\"xx\")","v":"xx"},{"$f":"IF($C43=\"Ja\",INDEX(Grundkarakterer!Z$8:Z$41,$AE6),\"xx\")","v":"xx"},{"$f":"IF($C43=\"Ja\",INDEX(Grundkarakterer!AA$8:AA$41,$AE6),\"xx\")","v":"xx"},{"$f":"IF($C43=\"Ja\",INDEX(Grundkarakterer!AB$8:AB$41,$AE6),\"xx\")","v":"xx"},{"$f":"IF($C43=\"Ja\",INDEX(Grundkarakterer!AC$8:AC$41,$AE6),\"xx\")","v":"xx"},{"$f":"IF($C43=\"Ja\",INDEX(Grundkarakterer!AD$8:AD$41,$AE6),\"xx\")","v":"xx"},{"$f":"IF($C43=\"Ja\",INDEX(Grundkarakterer!AE$8:AE$41,$AE6),\"xx\")","v":"xx"},{"$f":"IF($C43=\"Ja\",INDEX(Grundkarakterer!AF$8:AF$41,$AE6),\"xx\")","v":"xx"},{"$f":"IF($C43=\"Ja\",INDEX(Grundkarakterer!AG$8:AG$41,$AE6),\"xx\")","v":"xx"},{"$f":"IF($C43=\"Ja\",INDEX(Grundkarakterer!AH$8:AH$41,$AE6),\"xx\")","v":"xx"},{"$f":"IF($C43=\"Ja\",INDEX(Grundkarakterer!AI$8:AI$41,$AE6),\"xx\")","v":"xx"},{"$f":"IF($C43=\"Ja\",INDEX(Grundkarakterer!M$8:M$41,$AE6),\"xx\")","v":"xx"}]
[5,{"$f":"INDEX(Grundkarakterer!A$8:A$41,AE7)","v":5},"Nej",{"$f":"IF(C44=\"Ja\",INDEX(Grundkarakterer!B$8:B$41,AE7),\"xx\")","v":"xx"},{"$f":"IF(C44=\"Ja\",INDEX(Grundkarakterer!C$8:C$41,$AE7),\"xx\")","v":"xx"},{"$f":"IF(C44=\"Ja\",INDEX(Grundkarakterer!D$8:D$41,$AE7),\"xx\")","v":"xx"},{"$f":"IF(C44=\"Ja\",INDEX(Grundkarakterer!#REF!,$AE7),\"xx\")","v":"xx"},{"$f":"IF($C44=\"Ja\",IF($D$9=1,INDEX(Grundkarakterer!E$8:E$41,$AE7),IF(AND($D$9=2,$D$20=1),INDEX(Grundkarakterer!H$8:H$41,$AE7),IF(AND($D$9=2,$D$20<>1),INDEX(Grundkarakterer!F$8:F$41,$AE7),IF(AND($D$9=3,$D$20=1),INDEX(Grundkarakterer!I$8:I$41,$AE7),IF(AND($D$9=3,$D$20<>1),INDEX(Grundkarakterer!G$8:G$41,$AE7),IF($D$9=4,INDEX(Grundkarakterer!J$8:J$41,$AE7),IF($D$9=5,INDEX(Grundkarakterer!K$8:K$41,$AE7),\"Fejl\"))))))),\"xx\")","v":"xx"},{"$f":"IF($C44=\"Ja\",INDEX(Grundkarakterer!L$8:L$41,$AE7),\"xx\")","v":"xx"},{"$f":"IF($C44=\"Ja\",INDEX(Grundkarakterer!N$8:N$41,$AE7),\"xx\")","v":"xx"},{"$f":"IF($C44=\"Ja\",INDEX(Grundkarakterer!O$8:O$41,$AE7),\"xx\")","v":"xx"},{"$f":"IF($C44=\"Ja\",INDEX(Grundkarakterer!P$8:P$41,$AE7),\"xx\")","v":"xx"},{"$f":"IF($C44=\"Ja\",INDEX(Grundkarakterer!Q$8:Q$41,$AE7),\"xx\")","v":"xx"},{"$f":"IF($C44=\"Ja\",INDEX(Grundkarakterer!R$8:R$41,$AE7),\"xx\")","v":"xx"},{"$f":"IF($C44=\"Ja\",INDEX(Grundkarakterer!S$8:S$41,$AE7),\"xx\")","v":"xx"},{"$f":"IF($C44=\"Ja\",INDEX(Grundkarakterer!T$8:T$41,$AE7),\"xx\")","v":"xx"},{"$f":"IF($C44=\"Ja\",INDEX(Grundkarakterer!U$8:U$41,$AE7),\"xx\")","v":"xx"},{"$f":"IF($C44=\"Ja\",INDEX(Grundkarakterer!V$8:V$41,$AE7),\"xx\")","v":"xx"},{"$f":"IF($C44=\"Ja\",INDEX(Grundkarakterer!W$8:W$41,$AE7),\"xx\")","v":"xx"},{"$f":"IF($C44=\"Ja\",INDEX(Grundkarakterer!X$8:X$41,$AE7),\"xx\")","v":"xx"},{"$f":"IF($C44=\"Ja\",INDEX(Grundkarakterer!Y$8:Y$41,$AE7),\"xx\")","v":"xx"},{"$f":"IF($C44=\"Ja\",INDEX(Grundkarakterer!Z$8:Z$41,$AE7),\"xx\")","v":"xx"},{"$f":"IF($C44=\"Ja\",INDEX(Grundkarakterer!AA$8:AA$41,$AE7),\"xx\")","v":"xx"},{"$f":"IF($C44=\"Ja\",INDEX(Grundkarakterer!AB$8:AB$41,$AE7),\"xx\")","v":"xx"},{"$f":"IF($C44=\"Ja\",INDEX(Grundkarakterer!AC$8:AC$41,$AE7),\"xx\")","v":"xx"},{"$f":"IF($C44=\"Ja\",INDEX(Grundkarakterer!AD$8:AD$41,$AE7),\"xx\")","v":"xx"},{"$f":"IF($C44=\"Ja\",INDEX(Grundkarakterer!AE$8:AE$41,$AE7),\"xx\")","v":"xx"},{"$f":"IF($C44=\"Ja\",INDEX(Grundkarakterer!AF$8:AF$41,$AE7),\"xx\")","v":"xx"},{"$f":"IF($C44=\"Ja\",INDEX(Grundkarakterer!AG$8:AG$41,$AE7),\"xx\")","v":"xx"},{"$f":"IF($C44=\"Ja\",INDEX(Grundkarakterer!AH$8:AH$41,$AE7),\"xx\")","v":"xx"},{"$f":"IF($C44=\"Ja\",INDEX(Grundkarakterer!AI$8:AI$41,$AE7),\"xx\")","v":"xx"},{"$f":"IF($C44=\"Ja\",INDEX(Grundkarakterer!M$8:M$41,$AE7),\"xx\")","v":"xx"}]
[6,{"$f":"INDEX(Grundkarakterer!A$8:A$41,AE8)","v":6},"Nej",{"$f":"IF(C45=\"Ja\",INDEX(Grundkarakterer!B$8:B$41,AE8),\"xx\")","v":"xx"},{"$f":"IF(C45=\"Ja\",INDEX(Grundkarakterer!C$8:C$41,$AE8),\"xx\")","v":"xx"},{"$f":"IF(C45=\"Ja\",INDEX(Grundkarakterer!D$8:D$41,$AE8),\"xx\")","v":"xx"},{"$f":"IF(C45=\"Ja\",INDEX(Grundkarakterer!#REF!,$AE8),\"xx\")","v":"xx"},{"$f":"IF($C45=\"Ja\",IF($D$9=1,INDEX(Grundkarakterer!E$8:E$41,$AE8),IF(AND($D$9=2,$D$20=1),INDEX(Grundkarakterer!H$8:H$41,$AE8),IF(AND($D$9=2,$D$20<>1),INDEX(Grundkarakterer!F$8:F$41,$AE8),IF(AND($D$9=3,$D$20=1),INDEX(Grundkarakterer!I$8:I$41,$AE8),IF(AND($D$9=3,$D$20<>1),INDEX(Grundkarakterer!G$8:G$41,$AE8),IF($D$9=4,INDEX(Grundkarakterer!J$8:J$41,$AE8),IF($D$9=5,INDEX(Grundkarakterer!K$8:K$41,$AE8),\"Fejl\"))))))),\"xx\")","v":"xx"},{"$f":"IF($C45=\"Ja\",INDEX(Grundkarakterer!L$8:L$41,$AE8),\"xx\")","v":"xx"},{"$f":"IF($C45=\"Ja\",INDEX(Grundkarakterer!N$8:N$41,$AE8),\"xx\")","v":"xx"},{"$f":"IF($C45=\"Ja\",INDEX(Grundkarakterer!O$8:O$41,$AE8),\"xx\")","v":"xx"},{"$f":"IF($C45=\"Ja\",INDEX(Grundkarakterer!P$8:P$41,$AE8),\"xx\")","v":"xx"},{"$f":"IF($C45=\"Ja\",INDEX(Grundkarakterer!Q$8:Q$41,$AE8),\"xx\")","v":"xx"},{"$f":"IF($C45=\"Ja\",INDEX(Grundkarakterer!R$8:R$41,$AE8),\"xx\")","v":"xx"},{"$f":"IF($C45=\"Ja\",INDEX(Grundkarakterer!S$8:S$41,$AE8),\"xx\")","v":"xx"},{"$f":"IF($C45=\"Ja\",INDEX(Grundkarakterer!T$8:T$41,$AE8),\"xx\")","v":"xx"},{"$f":"IF($C45=\"Ja\",INDEX(Grundkarakterer!U$8:U$41,$AE8),\"xx\")","v":"xx"},{"$f":"IF($C45=\"Ja\",INDEX(Grundkarakterer!V$8:V$41,$AE8),\"xx\")","v":"xx"},{"$f":"IF($C45=\"Ja\",INDEX(Grundkarakterer!W$8:W$41,$AE8),\"xx\")","v":"xx"},{"$f":"IF($C45=\"Ja\",INDEX(Grundkarakterer!X$8:X$41,$AE8),\"xx\")","v":"xx"},{"$f":"IF($C45=\"Ja\",INDEX(Grundkarakterer!Y$8:Y$41,$AE8),\"xx\")","v":"xx"},{"$f":"IF($C45=\"Ja\",INDEX(Grundkarakterer!Z$8:Z$41,$AE8),\"xx\")","v":"xx"},{"$f":"IF($C45=\"Ja\",INDEX(Grundkarakterer!AA$8:AA$41,$AE8),\"xx\")","v":"xx"},{"$f":"IF($C45=\"Ja\",INDEX(Grundkarakterer!AB$8:AB$41,$AE8),\"xx\")","v":"xx"},{"$f":"IF($C45=\"Ja\",INDEX(Grundkarakterer!AC$8:AC$41,$AE8),\"xx\")","v":"xx"},{"$f":"IF($C45=\"Ja\",INDEX(Grundkarakterer!AD$8:AD$41,$AE8),\"xx\")","v":"xx"},{"$f":"IF($C45=\"Ja\",INDEX(Grundkarakterer!AE$8:AE$41,$AE8),\"xx\")","v":"xx"},{"$f":"IF($C45=\"Ja\",INDEX(Grundkarakterer!AF$8:AF$41,$AE8),\"xx\")","v":"xx"},{"$f":"IF($C45=\"Ja\",INDEX(Grundkarakterer!AG$8:AG$41,$AE8),\"xx\")","v":"xx"},{"$f":"IF($C45=\"Ja\",INDEX(Grundkarakterer!AH$8:AH$41,$AE8),\"xx\")","v":"xx"},{"$f":"IF($C45=\"Ja\",INDEX(Grundkarakterer!AI$8:AI$41,$AE8),\"xx\")","v":"xx"},{"$f":"IF($C45=\"Ja\",INDEX(Grundkarakterer!M$8:M$41,$AE8),\"xx\")","v":"xx"}]
[7,{"$f":"INDEX(Grundkarakterer!A$8:A$41,AE9)","v":7},"Ja",{"$f":"IF(C46=\"Ja\",INDEX(Grundkarakterer!B$8:B$41,AE9),\"xx\")","v":"Triticale/Gul Sennep"},{"$f":"IF(C46=\"Ja\",INDEX(Grundkarakterer!C$8:C$41,$AE9),\"xx\")","v":"1. Vintersæd"},{"$f":"IF(C46=\"Ja\",INDEX(Grundkarakterer!D$8:D$41,$AE9),\"xx\")","v":"1. Ved etablering af primærafgrøde"},{"$f":"IF(C46=\"Ja\",INDEX(Grundkarakterer!#REF!,$AE9),\"xx\")","v":{"$error":"#REF!"}},{"$f":"IF($C46=\"Ja\",IF($D$9=1,INDEX(Grundkarakterer!E$8:E$41,$AE9),IF(AND($D$9=2,$D$20=1),INDEX(Grundkarakterer!H$8:H$41,$AE9),IF(AND($D$9=2,$D$20<>1),INDEX(Grundkarakterer!F$8:F$41,$AE9),IF(AND($D$9=3,$D$20=1),INDEX(Grundkarakterer!I$8:I$41,$AE9),IF(AND($D$9=3,$D$20<>1),INDEX(Grundkarakterer!G$8:G$41,$AE9),IF($D$9=4,INDEX(Grundkarakterer!J$8:J$41,$AE9),IF($D$9=5,INDEX(Grundkarakterer!K$8:K$41,$AE9),\"Fejl\"))))))),\"xx\")","v":"1. august"},{"$f":"IF($C46=\"Ja\",INDEX(Grundkarakterer!L$8:L$41,$AE9),\"xx\")","v":-647},{"$f":"IF($C46=\"Ja\",INDEX(Grundkarakterer!N$8:N$41,$AE9),\"xx\")","v":1},{"$f":"IF($C46=\"Ja\",INDEX(Grundkarakterer!O$8:O$41,$AE9),\"xx\")","v":0},{"$f":"IF($C46=\"Ja\",INDEX(Grundkarakterer!P$8:P$41,$AE9),\"xx\")","v":0},{"$f":"IF($C46=\"Ja\",INDEX(Grundkarakterer!Q$8:Q$41,$AE9),\"xx\")","v":0},{"$f":"IF($C46=\"Ja\",INDEX(Grundkarakterer!R$8:R$41,$AE9),\"xx\")","v":1},{"$f":"IF($C46=\"Ja\",INDEX(Grundkarakterer!S$8:S$41,$AE9),\"xx\")","v":1},{"$f":"IF($C46=\"Ja\",INDEX(Grundkarakterer!T$8:T$41,$AE9),\"xx\")","v":1},{"$f":"IF($C46=\"Ja\",INDEX(Grundkarakterer!U$8:U$41,$AE9),\"xx\")","v":0},{"$f":"IF($C46=\"Ja\",INDEX(Grundkarakterer!V$8:V$41,$AE9),\"xx\")","v":3},{"$f":"IF($C46=\"Ja\",INDEX(Grundkarakterer!W$8:W$41,$AE9),\"xx\")","v":1},{"$f":"IF($C46=\"Ja\",INDEX(Grundkarakterer!X$8:X$41,$AE9),\"xx\")","v":1},{"$f":"IF($C46=\"Ja\",INDEX(Grundkarakterer!Y$8:Y$41,$AE9),\"xx\")","v":0},{"$f":"IF($C46=\"Ja\",INDEX(Grundkarakterer!Z$8:Z$41,$AE9),\"xx\")","v":1},{"$f":"IF($C46=\"Ja\",INDEX(Grundkarakterer!AA$8:AA$41,$AE9),\"xx\")","v":0},{"$f":"IF($C46=\"Ja\",INDEX(Grundkarakterer!AB$8:AB$41,$AE9),\"xx\")","v":0},{"$f":"IF($C46=\"Ja\",INDEX(Grundkarakterer!AC$8:AC$41,$AE9),\"xx\")","v":3},{"$f":"IF($C46=\"Ja\",INDEX(Grundkarakterer!AD$8:AD$41,$AE9),\"xx\")","v":0},{"$f":"IF($C46=\"Ja\",INDEX(Grundkarakterer!AE$8:AE$41,$AE9),\"xx\")","v":0},{"$f":"IF($C46=\"Ja\",INDEX(Grundkarakterer!AF$8:AF$41,$AE9),\"xx\")","v":0},{"$f":"IF($C46=\"Ja\",INDEX(Grundkarakterer!AG$8:AG$41,$AE9),\"xx\")","v":0},{"$f":"IF($C46=\"Ja\",INDEX(Grundkarakterer!AH$8:AH$41,$AE9),\"xx\")","v":7},{"$f":"IF($C46=\"Ja\",INDEX(Grundkarakterer!AI$8:AI$41,$AE9),\"xx\")","v":0},{"$f":"IF($C46=\"Ja\",INDEX(Grundkarakterer!M$8:M$41,$AE9),\"xx\")","v":"-"}]
[8,{"$f":"INDEX(Grundkarakterer!A$8:A$41,AE10)","v":8},"Nej",{"$f":"IF(C47=\"Ja\",INDEX(Grundkarakterer!B$8:B$41,AE10),\"xx\")","v":"xx"},{"$f":"IF(C47=\"Ja\",INDEX(Grundkarakterer!C$8:C$41,$AE10),\"xx\")","v":"xx"},{"$f":"IF(C47=\"Ja\",INDEX(Grundkarakterer!D$8:D$41,$AE10),\"xx\")","v":"xx"},{"$f":"IF(C47=\"Ja\",INDEX(Grundkarakterer!#REF!,$AE10),\"xx\")","v":"xx"},{"$f":"IF($C47=\"Ja\",IF($D$9=1,INDEX(Grundkarakterer!E$8:E$41,$AE10),IF(AND($D$9=2,$D$20=1),INDEX(Grundkarakterer!H$8:H$41,$AE10),IF(AND($D$9=2,$D$20<>1),INDEX(Grundkarakterer!F$8:F$41,$AE10),IF(AND($D$9=3,$D$20=1),INDEX(Grundkarakterer!I$8:I$41,$AE10),IF(AND($D$9=3,$D$20<>1),INDEX(Grundkarakterer!G$8:G$41,$AE10),IF($D$9=4,INDEX(Grundkarakterer!J$8:J$41,$AE10),IF($D$9=5,INDEX(Grundkarakterer!K$8:K$41,$AE10),\"Fejl\"))))))),\"xx\")","v":"xx"},{"$f":"IF($C47=\"Ja\",INDEX(Grundkarakterer!L$8:L$41,$AE10),\"xx\")","v":"xx"},{"$f":"IF($C47=\"Ja\",INDEX(Grundkarakterer!N$8:N$41,$AE10),\"xx\")","v":"xx"},{"$f":"IF($C47=\"Ja\",INDEX(Grundkarakterer!O$8:O$41,$AE10),\"xx\")","v":"xx"},{"$f":"IF($C47=\"Ja\",INDEX(Grundkarakterer!P$8:P$41,$AE10),\"xx\")","v":"xx"},{"$f":"IF($C47=\"Ja\",INDEX(Grundkarakterer!Q$8:Q$41,$AE10),\"xx\")","v":"xx"},{"$f":"IF($C47=\"Ja\",INDEX(Grundkarakterer!R$8:R$41,$AE10),\"xx\")","v":"xx"},{"$f":"IF($C47=\"Ja\",INDEX(Grundkarakterer!S$8:S$41,$AE10),\"xx\")","v":"xx"},{"$f":"IF($C47=\"Ja\",INDEX(Grundkarakterer!T$8:T$41,$AE10),\"xx\")","v":"xx"},{"$f":"IF($C47=\"Ja\",INDEX(Grundkarakterer!U$8:U$41,$AE10),\"xx\")","v":"xx"},{"$f":"IF($C47=\"Ja\",INDEX(Grundkarakterer!V$8:V$41,$AE10),\"xx\")","v":"xx"},{"$f":"IF($C47=\"Ja\",INDEX(Grundkarakterer!W$8:W$41,$AE10),\"xx\")","v":"xx"},{"$f":"IF($C47=\"Ja\",INDEX(Grundkarakterer!X$8:X$41,$AE10),\"xx\")","v":"xx"},{"$f":"IF($C47=\"Ja\",INDEX(Grundkarakterer!Y$8:Y$41,$AE10),\"xx\")","v":"xx"},{"$f":"IF($C47=\"Ja\",INDEX(Grundkarakterer!Z$8:Z$41,$AE10),\"xx\")","v":"xx"},{"$f":"IF($C47=\"Ja\",INDEX(Grundkarakterer!AA$8:AA$41,$AE10),\"xx\")","v":"xx"},{"$f":"IF($C47=\"Ja\",INDEX(Grundkarakterer!AB$8:AB$41,$AE10),\"xx\")","v":"xx"},{"$f":"IF($C47=\"Ja\",INDEX(Grundkarakterer!AC$8:AC$41,$AE10),\"xx\")","v":"xx"},{"$f":"IF($C47=\"Ja\",INDEX(Grundkarakterer!AD$8:AD$41,$AE10),\"xx\")","v":"xx"},{"$f":"IF($C47=\"Ja\",INDEX(Grundkarakterer!AE$8:AE$41,$AE10),\"xx\")","v":"xx"},{"$f":"IF($C47=\"Ja\",INDEX(Grundkarakterer!AF$8:AF$41,$AE10),\"xx\")","v":"xx"},{"$f":"IF($C47=\"Ja\",INDEX(Grundkarakterer!AG$8:AG$41,$AE10),\"xx\")","v":"xx"},{"$f":"IF($C47=\"Ja\",INDEX(Grundkarakterer!AH$8:AH$41,$AE10),\"xx\")","v":"xx"},{"$f":"IF($C47=\"Ja\",INDEX(Grundkarakterer!AI$8:AI$41,$AE10),\"xx\")","v":"xx"},{"$f":"IF($C47=\"Ja\",INDEX(Grundkarakterer!M$8:M$41,$AE10),\"xx\")","v":"xx"}]
[9,{"$f":"INDEX(Grundkarakterer!A$8:A$41,AE11)","v":9},"Ja",{"$f":"IF(C48=\"Ja\",INDEX(Grundkarakterer!B$8:B$41,AE11),\"xx\")","v":"Gul sennep"},{"$f":"IF(C48=\"Ja\",INDEX(Grundkarakterer!C$8:C$41,$AE11),\"xx\")","v":"1. Vintersæd"},{"$f":"IF(C48=\"Ja\",INDEX(Grundkarakterer!D$8:D$41,$AE11),\"xx\")","v":"1. Ved etablering af primærafgrøde"},{"$f":"IF(C48=\"Ja\",INDEX(Grundkarakterer!#REF!,$AE11),\"xx\")","v":{"$error":"#REF!"}},{"$f":"IF($C48=\"Ja\",IF($D$9=1,INDEX(Grundkarakterer!E$8:E$41,$AE11),IF(AND($D$9=2,$D$20=1),INDEX(Grundkarakterer!H$8:H$41,$AE11),IF(AND($D$9=2,$D$20<>1),INDEX(Grundkarakterer!F$8:F$41,$AE11),IF(AND($D$9=3,$D$20=1),INDEX(Grundkarakterer!I$8:I$41,$AE11),IF(AND($D$9=3,$D$20<>1),INDEX(Grundkarakterer!G$8:G$41,$AE11),IF($D$9=4,INDEX(Grundkarakterer!J$8:J$41,$AE11),IF($D$9=5,INDEX(Grundkarakterer!K$8:K$41,$AE11),\"Fejl\"))))))),\"xx\")","v":"20. august"},{"$f":"IF($C48=\"Ja\",INDEX(Grundkarakterer!L$8:L$41,$AE11),\"xx\")","v":-503},{"$f":"IF($C48=\"Ja\",INDEX(Grundkarakterer!N$8:N$41,$AE11),\"xx\")","v":1},{"$f":"IF($C48=\"Ja\",INDEX(Grundkarakterer!O$8:O$41,$AE11),\"xx\")","v":1},{"$f":"IF($C48=\"Ja\",INDEX(Grundkarakterer!P$8:P$41,$AE11),\"xx\")","v":1},{"$f":"IF($C48=\"Ja\",INDEX(Grundkarakterer!Q$8:Q$41,$AE11),\"xx\")","v":0},{"$f":"IF($C48=\"Ja\",INDEX(Grundkarakterer!R$8:R$41,$AE11),\"xx\")","v":1},{"$f":"IF($C48=\"Ja\",INDEX(Grundkarakterer!S$8:S$41,$AE11),\"xx\")","v":1},{"$f":"IF($C48=\"Ja\",INDEX(Grundkarakterer!T$8:T$41,$AE11),\"xx\")","v":1},{"$f":"IF($C48=\"Ja\",INDEX(Grundkarakterer!U$8:U$41,$AE11),\"xx\")","v":0},{"$f":"IF($C48=\"Ja\",INDEX(Grundkarakterer!V$8:V$41,$AE11),\"xx\")","v":0},{"$f":"IF($C48=\"Ja\",INDEX(Grundkarakterer!W$8:W$41,$AE11),\"xx\")","v":0},{"$f":"IF($C48=\"Ja\",INDEX(Grundkarakterer!X$8:X$41,$AE11),\"xx\")","v":3},{"$f":"IF($C48=\"Ja\",INDEX(Grundkarakterer!Y$8:Y$41,$AE11),\"xx\")","v":0},{"$f":"IF($C48=\"Ja\",INDEX(Grundkarakterer!Z$8:Z$41,$AE11),\"xx\")","v":2},{"$f":"IF($C48=\"Ja\",INDEX(Grundkarakterer!AA$8:AA$41,$AE11),\"xx\")","v":2},{"$f":"IF($C48=\"Ja\",INDEX(Grundkarakterer!AB$8:AB$41,$AE11),\"xx\")","v":3},{"$f":"IF($C48=\"Ja\",INDEX(Grundkarakterer!AC$8:AC$41,$AE11),\"xx\")","v":0},{"$f":"IF($C48=\"Ja\",INDEX(Grundkarakterer!AD$8:AD$41,$AE11),\"xx\")","v":3},{"$f":"IF($C48=\"Ja\",INDEX(Grundkarakterer!AE$8:AE$41,$AE11),\"xx\")","v":0},{"$f":"IF($C48=\"Ja\",INDEX(Grundkarakterer!AF$8:AF$41,$AE11),\"xx\")","v":0},{"$f":"IF($C48=\"Ja\",INDEX(Grundkarakterer!AG$8:AG$41,$AE11),\"xx\")","v":0},{"$f":"IF($C48=\"Ja\",INDEX(Grundkarakterer!AH$8:AH$41,$AE11),\"xx\")","v":9},{"$f":"IF($C48=\"Ja\",INDEX(Grundkarakterer!AI$8:AI$41,$AE11),\"xx\")","v":0},{"$f":"IF($C48=\"Ja\",INDEX(Grundkarakterer!M$8:M$41,$AE11),\"xx\")","v":377}]
[10,{"$f":"INDEX(Grundkarakterer!A$8:A$41,AE12)","v":10},"Ja",{"$f":"IF(C49=\"Ja\",INDEX(Grundkarakterer!B$8:B$41,AE12),\"xx\")","v":"Olieræddike"},{"$f":"IF(C49=\"Ja\",INDEX(Grundkarakterer!C$8:C$41,$AE12),\"xx\")","v":"1. Vintersæd"},{"$f":"IF(C49=\"Ja\",INDEX(Grundkarakterer!D$8:D$41,$AE12),\"xx\")","v":"1. Ved etablering af primærafgrøde"},{"$f":"IF(C49=\"Ja\",INDEX(Grundkarakterer!#REF!,$AE12),\"xx\")","v":{"$error":"#REF!"}},{"$f":"IF($C49=\"Ja\",IF($D$9=1,INDEX(Grundkarakterer!E$8:E$41,$AE12),IF(AND($D$9=2,$D$20=1),INDEX(Grundkarakterer!H$8:H$41,$AE12),IF(AND($D$9=2,$D$20<>1),INDEX(Grundkarakterer!F$8:F$41,$AE12),IF(AND($D$9=3,$D$20=1),INDEX(Grundkarakterer!I$8:I$41,$AE12),IF(AND($D$9=3,$D$20<>1),INDEX(Grundkarakterer!G$8:G$41,$AE12),IF($D$9=4,INDEX(Grundkarakterer!J$8:J$41,$AE12),IF($D$9=5,INDEX(Grundkarakterer!K$8:K$41,$AE12),\"Fejl\"))))))),\"xx\")","v":"20. august"},{"$f":"IF($C49=\"Ja\",INDEX(Grundkarakterer!L$8:L$41,$AE12),\"xx\")","v":-649},{"$f":"IF($C49=\"Ja\",INDEX(Grundkarakterer!N$8:N$41,$AE12),\"xx\")","v":1},{"$f":"IF($C49=\"Ja\",INDEX(Grundkarakterer!O$8:O$41,$AE12),\"xx\")","v":1},{"$f":"IF($C49=\"Ja\",INDEX(Grundkarakterer!P$8:P$41,$AE12),\"xx\")","v":1},{"$f":"IF($C49=\"Ja\",INDEX(Grundkarakterer!Q$8:Q$41,$AE12),\"xx\")","v":0},{"$f":"IF($C49=\"Ja\",INDEX(Grundkarakterer!R$8:R$41,$AE12),\"xx\")","v":1},{"$f":"IF($C49=\"Ja\",INDEX(Grundkarakterer!S$8:S$41,$AE12),\"xx\")","v":1},{"$f":"IF($C49=\"Ja\",INDEX(Grundkarakterer!T$8:T$41,$AE12),\"xx\")","v":1},{"$f":"IF($C49=\"Ja\",INDEX(Grundkarakterer!U$8:U$41,$AE12),\"xx\")","v":0},{"$f":"IF($C49=\"Ja\",INDEX(Grundkarakterer!V$8:V$41,$AE12),\"xx\")","v":0},{"$f":"IF($C49=\"Ja\",INDEX(Grundkarakterer!W$8:W$41,$AE12),\"xx\")","v":0},{"$f":"IF($C49=\"Ja\",INDEX(Grundkarakterer!X$8:X$41,$AE12),\"xx\")","v":3},{"$f":"IF($C49=\"Ja\",INDEX(Grundkarakterer!Y$8:Y$41,$AE12),\"xx\")","v":0},{"$f":"IF($C49=\"Ja\",INDEX(Grundkarakterer!Z$8:Z$41,$AE12),\"xx\")","v":2},{"$f":"IF($C49=\"Ja\",INDEX(Grundkarakterer!AA$8:AA$41,$AE12),\"xx\")","v":3},{"$f":"IF($C49=\"Ja\",INDEX(Grundkarakterer!AB$8:AB$41,$AE12),\"xx\")","v":3},{"$f":"IF($C49=\"Ja\",INDEX(Grundkarakterer!AC$8:AC$41,$AE12),\"xx\")","v":2},{"$f":"IF($C49=\"Ja\",INDEX(Grundkarakterer!AD$8:AD$41,$AE12),\"xx\")","v":3},{"$f":"IF($C49=\"Ja\",INDEX(Grundkarakterer!AE$8:AE$41,$AE12),\"xx\")","v":0},{"$f":"IF($C49=\"Ja\",INDEX(Grundkarakterer!AF$8:AF$41,$AE12),\"xx\")","v":0},{"$f":"IF($C49=\"Ja\",INDEX(Grundkarakterer!AG$8:AG$41,$AE12),\"xx\")","v":0},{"$f":"IF($C49=\"Ja\",INDEX(Grundkarakterer!AH$8:AH$41,$AE12),\"xx\")","v":10},{"$f":"IF($C49=\"Ja\",INDEX(Grundkarakterer!AI$8:AI$41,$AE12),\"xx\")","v":0},{"$f":"IF($C49=\"Ja\",INDEX(Grundkarakterer!M$8:M$41,$AE12),\"xx\")","v":231}]
[11,{"$f":"INDEX(Grundkarakterer!A$8:A$41,AE13)","v":11},"Nej",{"$f":"IF(C50=\"Ja\",INDEX(Grundkarakterer!B$8:B$41,AE13),\"xx\")","v":"xx"},{"$f":"IF(C50=\"Ja\",INDEX(Grundkarakterer!C$8:C$41,$AE13),\"xx\")","v":"xx"},{"$f":"IF(C50=\"Ja\",INDEX(Grundkarakterer!D$8:D$41,$AE13),\"xx\")","v":"xx"},{"$f":"IF(C50=\"Ja\",INDEX(Grundkarakterer!#REF!,$AE13),\"xx\")","v":"xx"},{"$f":"IF($C50=\"Ja\",IF($D$9=1,INDEX(Grundkarakterer!E$8:E$41,$AE13),IF(AND($D$9=2,$D$20=1),INDEX(Grundkarakterer!H$8:H$41,$AE13),IF(AND($D$9=2,$D$20<>1),INDEX(Grundkarakterer!F$8:F$41,$AE13),IF(AND($D$9=3,$D$20=1),INDEX(Grundkarakterer!I$8:I$41,$AE13),IF(AND($D$9=3,$D$20<>1),INDEX(Grundkarakterer!G$8:G$41,$AE13),IF($D$9=4,INDEX(Grundkarakterer!J$8:J$41,$AE13),IF($D$9=5,INDEX(Grundkarakterer!K$8:K$41,$AE13),\"Fejl\"))))))),\"xx\")","v":"xx"},{"$f":"IF($C50=\"Ja\",INDEX(Grundkarakterer!L$8:L$41,$AE13),\"xx\")","v":"xx"},{"$f":"IF($C50=\"Ja\",INDEX(Grundkarakterer!N$8:N$41,$AE13),\"xx\")","v":"xx"},{"$f":"IF($C50=\"Ja\",INDEX(Grundkarakterer!O$8:O$41,$AE13),\"xx\")","v":"xx"},{"$f":"IF($C50=\"Ja\",INDEX(Grundkarakterer!P$8:P$41,$AE13),\"xx\")","v":"xx"},{"$f":"IF($C50=\"Ja\",INDEX(Grundkarakterer!Q$8:Q$41,$AE13),\"xx\")","v":"xx"},{"$f":"IF($C50=\"Ja\",INDEX(Grundkarakterer!R$8:R$41,$AE13),\"xx\")","v":"xx"},{"$f":"IF($C50=\"Ja\",INDEX(Grundkarakterer!S$8:S$41,$AE13),\"xx\")","v":"xx"},{"$f":"IF($C50=\"Ja\",INDEX(Grundkarakterer!T$8:T$41,$AE13),\"xx\")","v":"xx"},{"$f":"IF($C50=\"Ja\",INDEX(Grundkarakterer!U$8:U$41,$AE13),\"xx\")","v":"xx"},{"$f":"IF($C50=\"Ja\",INDEX(Grundkarakterer!V$8:V$41,$AE13),\"xx\")","v":"xx"},{"$f":"IF($C50=\"Ja\",INDEX(Grundkarakterer!W$8:W$41,$AE13),\"xx\")","v":"xx"},{"$f":"IF($C50=\"Ja\",INDEX(Grundkarakterer!X$8:X$41,$AE13),\"xx\")","v":"xx"},{"$f":"IF($C50=\"Ja\",INDEX(Grundkarakterer!Y$8:Y$41,$AE13),\"xx\")","v":"xx"},{"$f":"IF($C50=\"Ja\",INDEX(Grundkarakterer!Z$8:Z$41,$AE13),\"xx\")","v":"xx"},{"$f":"IF($C50=\"Ja\",INDEX(Grundkarakterer!AA$8:AA$41,$AE13),\"xx\")","v":"xx"},{"$f":"IF($C50=\"Ja\",INDEX(Grundkarakterer!AB$8:AB$41,$AE13),\"xx\")","v":"xx"},{"$f":"IF($C50=\"Ja\",INDEX(Grundkarakterer!AC$8:AC$41,$AE13),\"xx\")","v":"xx"},{"$f":"IF($C50=\"Ja\",INDEX(Grundkarakterer!AD$8:AD$41,$AE13),\"xx\")","v":"xx"},{"$f":"IF($C50=\"Ja\",INDEX(Grundkarakterer!AE$8:AE$41,$AE13),\"xx\")","v":"xx"},{"$f":"IF($C50=\"Ja\",INDEX(Grundkarakterer!AF$8:AF$41,$AE13),\"xx\")","v":"xx"},{"$f":"IF($C50=\"Ja\",INDEX(Grundkarakterer!AG$8:AG$41,$AE13),\"xx\")","v":"xx"},{"$f":"IF($C50=\"Ja\",INDEX(Grundkarakterer!AH$8:AH$41,$AE13),\"xx\")","v":"xx"},{"$f":"IF($C50=\"Ja\",INDEX(Grundkarakterer!AI$8:AI$41,$AE13),\"xx\")","v":"xx"},{"$f":"IF($C50=\"Ja\",INDEX(Grundkarakterer!M$8:M$41,$AE13),\"xx\")","v":"xx"}]
[12,{"$f":"INDEX(Grundkarakterer!A$8:A$41,AE14)","v":12},"Ja",{"$f":"IF(C51=\"Ja\",INDEX(Grundkarakterer!B$8:B$41,AE14),\"xx\")","v":"Vinterraps , linie"},{"$f":"IF(C51=\"Ja\",INDEX(Grundkarakterer!C$8:C$41,$AE14),\"xx\")","v":"1. Vintersæd"},{"$f":"IF(C51=\"Ja\",INDEX(Grundkarakterer!D$8:D$41,$AE14),\"xx\")","v":"1. Ved etablering af primærafgrøde"},{"$f":"IF(C51=\"Ja\",INDEX(Grundkarakterer!#REF!,$AE14),\"xx\")","v":{"$error":"#REF!"}},{"$f":"IF($C51=\"Ja\",IF($D$9=1,INDEX(Grundkarakterer!E$8:E$41,$AE14),IF(AND($D$9=2,$D$20=1),INDEX(Grundkarakterer!H$8:H$41,$AE14),IF(AND($D$9=2,$D$20<>1),INDEX(Grundkarakterer!F$8:F$41,$AE14),IF(AND($D$9=3,$D$20=1),INDEX(Grundkarakterer!I$8:I$41,$AE14),IF(AND($D$9=3,$D$20<>1),INDEX(Grundkarakterer!G$8:G$41,$AE14),IF($D$9=4,INDEX(Grundkarakterer!J$8:J$41,$AE14),IF($D$9=5,INDEX(Grundkarakterer!K$8:K$41,$AE14),\"Fejl\"))))))),\"xx\")","v":"20. august"},{"$f":"IF($C51=\"Ja\",INDEX(Grundkarakterer!L$8:L$41,$AE14),\"xx\")","v":-1136},{"$f":"IF($C51=\"Ja\",INDEX(Grundkarakterer!N$8:N$41,$AE14),\"xx\")","v":1},{"$f":"IF($C51=\"Ja\",INDEX(Grundkarakterer!O$8:O$41,$AE14),\"xx\")","v":0},{"$f":"IF($C51=\"Ja\",INDEX(Grundkarakterer!P$8:P$41,$AE14),\"xx\")","v":1},{"$f":"IF($C51=\"Ja\",INDEX(Grundkarakterer!Q$8:Q$41,$AE14),\"xx\")","v":0},{"$f":"IF($C51=\"Ja\",INDEX(Grundkarakterer!R$8:R$41,$AE14),\"xx\")","v":1},{"$f":"IF($C51=\"Ja\",INDEX(Grundkarakterer!S$8:S$41,$AE14),\"xx\")","v":1},{"$f":"IF($C51=\"Ja\",INDEX(Grundkarakterer!T$8:T$41,$AE14),\"xx\")","v":1},{"$f":"IF($C51=\"Ja\",INDEX(Grundkarakterer!U$8:U$41,$AE14),\"xx\")","v":0},{"$f":"IF($C51=\"Ja\",INDEX(Grundkarakterer!V$8:V$41,$AE14),\"xx\")","v":0},{"$f":"IF($C51=\"Ja\",INDEX(Grundkarakterer!W$8:W$41,$AE14),\"xx\")","v":1},{"$f":"IF($C51=\"Ja\",INDEX(Grundkarakterer!X$8:X$41,$AE14),\"xx\")","v":2},{"$f":"IF($C51=\"Ja\",INDEX(Grundkarakterer!Y$8:Y$41,$AE14),\"xx\")","v":0},{"$f":"IF($C51=\"Ja\",INDEX(Grundkarakterer!Z$8:Z$41,$AE14),\"xx\")","v":2},{"$f":"IF($C51=\"Ja\",INDEX(Grundkarakterer!AA$8:AA$41,$AE14),\"xx\")","v":3},{"$f":"IF($C51=\"Ja\",INDEX(Grundkarakterer!AB$8:AB$41,$AE14),\"xx\")","v":3},{"$f":"IF($C51=\"Ja\",INDEX(Grundkarakterer!AC$8:AC$41,$AE14),\"xx\")","v":0},{"$f":"IF($C51=\"Ja\",INDEX(Grundkarakterer!AD$8:AD$41,$AE14),\"xx\")","v":0},{"$f":"IF($C51=\"Ja\",INDEX(Grundkarakterer!AE$8:AE$41,$AE14),\"xx\")","v":0},{"$f":"IF($C51=\"Ja\",INDEX(Grundkarakterer!AF$8:AF$41,$AE14),\"xx\")","v":3},{"$f":"IF($C51=\"Ja\",INDEX(Grundkarakterer!AG$8:AG$41,$AE14),\"xx\")","v":1},{"$f":"IF($C51=\"Ja\",INDEX(Grundkarakterer!AH$8:AH$41,$AE14),\"xx\")","v":12},{"$f":"IF($C51=\"Ja\",INDEX(Grundkarakterer!AI$8:AI$41,$AE14),\"xx\")","v":0},{"$f":"IF($C51=\"Ja\",INDEX(Grundkarakterer!M$8:M$41,$AE14),\"xx\")","v":-476}]
[13,{"$f":"INDEX(Grundkarakterer!A$8:A$41,AE15)","v":13},"Ja",{"$f":"IF(C52=\"Ja\",INDEX(Grundkarakterer!B$8:B$41,AE15),\"xx\")","v":"Foderradise (Strukturator)"},{"$f":"IF(C52=\"Ja\",INDEX(Grundkarakterer!C$8:C$41,$AE15),\"xx\")","v":0},{"$f":"IF(C52=\"Ja\",INDEX(Grundkarakterer!D$8:D$41,$AE15),\"xx\")","v":0},{"$f":"IF(C52=\"Ja\",INDEX(Grundkarakterer!#REF!,$AE15),\"xx\")","v":{"$error":"#REF!"}},{"$f":"IF($C52=\"Ja\",IF($D$9=1,INDEX(Grundkarakterer!E$8:E$41,$AE15),IF(AND($D$9=2,$D$20=1),INDEX(Grundkarakterer!H$8:H$41,$AE15),IF(AND($D$9=2,$D$20<>1),INDEX(Grundkarakterer!F$8:F$41,$AE15),IF(AND($D$9=3,$D$20=1),INDEX(Grundkarakterer!I$8:I$41,$AE15),IF(AND($D$9=3,$D$20<>1),INDEX(Grundkarakterer!G$8:G$41,$AE15),IF($D$9=4,INDEX(Grundkarakterer!J$8:J$41,$AE15),IF($D$9=5,INDEX(Grundkarakterer!K$8:K$41,$AE15),\"Fejl\"))))))),\"xx\")","v":"20. august"},{"$f":"IF($C52=\"Ja\",INDEX(Grundkarakterer!L$8:L$41,$AE15),\"xx\")","v":-913},{"$f":"IF($C52=\"Ja\",INDEX(Grundkarakterer!N$8:N$41,$AE15),\"xx\")","v":1},{"$f":"IF($C52=\"Ja\",INDEX(Grundkarakterer!O$8:O$41,$AE15),\"xx\")","v":0},{"$f":"IF($C52=\"Ja\",INDEX(Grundkarakterer!P$8:P$41,$AE15),\"xx\")","v":1},{"$f":"IF($C52=\"Ja\",INDEX(Grundkarakterer!Q$8:Q$41,$AE15),\"xx\")","v":0},{"$f":"IF($C52=\"Ja\",INDEX(Grundkarakterer!R$8:R$41,$AE15),\"xx\")","v":1},{"$f":"IF($C52=\"Ja\",INDEX(Grundkarakterer!S$8:S$41,$AE15),\"xx\")","v":1},{"$f":"IF($C52=\"Ja\",INDEX(Grundkarakterer!T$8:T$41,$AE15),\"xx\")","v":1},{"$f":"IF($C52=\"Ja\",INDEX(Grundkarakterer!U$8:U$41,$AE15),\"xx\")","v":0},{"$f":"IF($C52=\"Ja\",INDEX(Grundkarakterer!V$8:V$41,$AE15),\"xx\")","v":0},{"$f":"IF($C52=\"Ja\",INDEX(Grundkarakterer!W$8:W$41,$AE15),\"xx\")","v":1},{"$f":"IF($C52=\"Ja\",INDEX(Grundkarakterer!X$8:X$41,$AE15),\"xx\")","v":3},{"$f":"IF($C52=\"Ja\",INDEX(Grundkarakterer!Y$8:Y$41,$AE15),\"xx\")","v":0},{"$f":"IF($C52=\"Ja\",INDEX(Grundkarakterer!Z$8:Z$41,$AE15),\"xx\")","v":2},{"$f":"IF($C52=\"Ja\",INDEX(Grundkarakterer!AA$8:AA$41,$AE15),\"xx\")","v":3},{"$f":"IF($C52=\"Ja\",INDEX(Grundkarakterer!AB$8:AB$41,$AE15),\"xx\")","v":3},{"$f":"IF($C52=\"Ja\",INDEX(Grundkarakterer!AC$8:AC$41,$AE15),\"xx\")","v":2},{"$f":"IF($C52=\"Ja\",INDEX(Grundkarakterer!AD$8:AD$41,$AE15),\"xx\")","v":0},{"$f":"IF($C52=\"Ja\",INDEX(Grundkarakterer!AE$8:AE$41,$AE15),\"xx\")","v":0},{"$f":"IF($C52=\"Ja\",INDEX(Grundkarakterer!AF$8:AF$41,$AE15),\"xx\")","v":0},{"$f":"IF($C52=\"Ja\",INDEX(Grundkarakterer!AG$8:AG$41,$AE15),\"xx\")","v":0},{"$f":"IF($C52=\"Ja\",INDEX(Grundkarakterer!AH$8:AH$41,$AE15),\"xx\")","v":13},{"$f":"IF($C52=\"Ja\",INDEX(Grundkarakterer!AI$8:AI$41,$AE15),\"xx\")","v":0},{"$f":"IF($C52=\"Ja\",INDEX(Grundkarakterer!M$8:M$41,$AE15),\"xx\")","v":-33}]
[14,{"$f":"INDEX(Grundkarakterer!A$8:A$41,AE16)","v":14},"Ja",{"$f":"IF(C53=\"Ja\",INDEX(Grundkarakterer!B$8:B$41,AE16),\"xx\")","v":"Havre"},{"$f":"IF(C53=\"Ja\",INDEX(Grundkarakterer!C$8:C$41,$AE16),\"xx\")","v":"1. Vintersæd"},{"$f":"IF(C53=\"Ja\",INDEX(Grundkarakterer!D$8:D$41,$AE16),\"xx\")","v":"1. Ved etablering af primærafgrøde"},{"$f":"IF(C53=\"Ja\",INDEX(Grundkarakterer!#REF!,$AE16),\"xx\")","v":{"$error":"#REF!"}},{"$f":"IF($C53=\"Ja\",IF($D$9=1,INDEX(Grundkarakterer!E$8:E$41,$AE16),IF(AND($D$9=2,$D$20=1),INDEX(Grundkarakterer!H$8:H$41,$AE16),IF(AND($D$9=2,$D$20<>1),INDEX(Grundkarakterer!F$8:F$41,$AE16),IF(AND($D$9=3,$D$20=1),INDEX(Grundkarakterer!I$8:I$41,$AE16),IF(AND($D$9=3,$D$20<>1),INDEX(Grundkarakterer!G$8:G$41,$AE16),IF($D$9=4,INDEX(Grundkarakterer!J$8:J$41,$AE16),IF($D$9=5,INDEX(Grundkarakterer!K$8:K$41,$AE16),\"Fejl\"))))))),\"xx\")","v":"20. august"},{"$f":"IF($C53=\"Ja\",INDEX(Grundkarakterer!L$8:L$41,$AE16),\"xx\")","v":-877},{"$f":"IF($C53=\"Ja\",INDEX(Grundkarakterer!N$8:N$41,$AE16),\"xx\")","v":1},{"$f":"IF($C53=\"Ja\",INDEX(Grundkarakterer!O$8:O$41,$AE16),\"xx\")","v":0},{"$f":"IF($C53=\"Ja\",INDEX(Grundkarakterer!P$8:P$41,$AE16),\"xx\")","v":1},{"$f":"IF($C53=\"Ja\",INDEX(Grundkarakterer!Q$8:Q$41,$AE16),\"xx\")","v":0},{"$f":"IF($C53=\"Ja\",INDEX(Grundkarakterer!R$8:R$41,$AE16),\"xx\")","v":1},{"$f":"IF($C53=\"Ja\",INDEX(Grundkarakterer!S$8:S$41,$AE16),\"xx\")","v":1},{"$f":"IF($C53=\"Ja\",INDEX(Grundkarakterer!T$8:T$41,$AE16),\"xx\")","v":1},{"$f":"IF($C53=\"Ja\",INDEX(Grundkarakterer!U$8:U$41,$AE16),\"xx\")","v":0},{"$f":"IF($C53=\"Ja\",INDEX(Grundkarakterer!V$8:V$41,$AE16),\"xx\")","v":0},{"$f":"IF($C53=\"Ja\",INDEX(Grundkarakterer!W$8:W$41,$AE16),\"xx\")","v":1},{"$f":"IF($C53=\"Ja\",INDEX(Grundkarakterer!X$8:X$41,$AE16),\"xx\")","v":3},{"$f":"IF($C53=\"Ja\",INDEX(Grundkarakterer!Y$8:Y$41,$AE16),\"xx\")","v":0},{"$f":"IF($C53=\"Ja\",INDEX(Grundkarakterer!Z$8:Z$41,$AE16),\"xx\")","v":1},{"$f":"IF($C53=\"Ja\",INDEX(Grundkarakterer!AA$8:AA$41,$AE16),\"xx\")","v":1},{"$f":"IF($C53=\"Ja\",INDEX(Grundkarakterer!AB$8:AB$41,$AE16),\"xx\")","v":3},{"$f":"IF($C53=\"Ja\",INDEX(Grundkarakterer!AC$8:AC$41,$AE16),\"xx\")","v":3},{"$f":"IF($C53=\"Ja\",INDEX(Grundkarakterer!AD$8:AD$41,$AE16),\"xx\")","v":0},{"$f":"IF($C53=\"Ja\",INDEX(Grundkarakterer!AE$8:AE$41,$AE16),\"xx\")","v":0},{"$f":"IF($C53=\"Ja\",INDEX(Grundkarakterer!AF$8:AF$41,$AE16),\"xx\")","v":1},{"$f":"IF($C53=\"Ja\",INDEX(Grundkarakterer!AG$8:AG$41,$AE16),\"xx\")","v":1},{"$f":"IF($C53=\"Ja\",INDEX(Grundkarakterer!AH$8:AH$41,$AE16),\"xx\")","v":14},{"$f":"IF($C53=\"Ja\",INDEX(Grundkarakterer!AI$8:AI$41,$AE16),\"xx\")","v":0},{"$f":"IF($C53=\"Ja\",INDEX(Grundkarakterer!M$8:M$41,$AE16),\"xx\")","v":-657}]
[15,{"$f":"INDEX(Grundkarakterer!A$8:A$41,AE17)","v":15},"Nej",{"$f":"IF(C54=\"Ja\",INDEX(Grundkarakterer!B$8:B$41,AE17),\"xx\")","v":"xx"},{"$f":"IF(C54=\"Ja\",INDEX(Grundkarakterer!C$8:C$41,$AE17),\"xx\")","v":"xx"},{"$f":"IF(C54=\"Ja\",INDEX(Grundkarakterer!D$8:D$41,$AE17),\"xx\")","v":"xx"},{"$f":"IF(C54=\"Ja\",INDEX(Grundkarakterer!#REF!,$AE17),\"xx\")","v":"xx"},{"$f":"IF($C54=\"Ja\",IF($D$9=1,INDEX(Grundkarakterer!E$8:E$41,$AE17),IF(AND($D$9=2,$D$20=1),INDEX(Grundkarakterer!H$8:H$41,$AE17),IF(AND($D$9=2,$D$20<>1),INDEX(Grundkarakterer!F$8:F$41,$AE17),IF(AND($D$9=3,$D$20=1),INDEX(Grundkarakterer!I$8:I$41,$AE17),IF(AND($D$9=3,$D$20<>1),INDEX(Grundkarakterer!G$8:G$41,$AE17),IF($D$9=4,INDEX(Grundkarakterer!J$8:J$41,$AE17),IF($D$9=5,INDEX(Grundkarakterer!K$8:K$41,$AE17),\"Fejl\"))))))),\"xx\")","v":"xx"},{"$f":"IF($C54=\"Ja\",INDEX(Grundkarakterer!L$8:L$41,$AE17),\"xx\")","v":"xx"},{"$f":"IF($C54=\"Ja\",INDEX(Grundkarakterer!N$8:N$41,$AE17),\"xx\")","v":"xx"},{"$f":"IF($C54=\"Ja\",INDEX(Grundkarakterer!O$8:O$41,$AE17),\"xx\")","v":"xx"},{"$f":"IF($C54=\"Ja\",INDEX(Grundkarakterer!P$8:P$41,$AE17),\"xx\")","v":"xx"},{"$f":"IF($C54=\"Ja\",INDEX(Grundkarakterer!Q$8:Q$41,$AE17),\"xx\")","v":"xx"},{"$f":"IF($C54=\"Ja\",INDEX(Grundkarakterer!R$8:R$41,$AE17),\"xx\")","v":"xx"},{"$f":"IF($C54=\"Ja\",INDEX(Grundkarakterer!S$8:S$41,$AE17),\"xx\")","v":"xx"},{"$f":"IF($C54=\"Ja\",INDEX(Grundkarakterer!T$8:T$41,$AE17),\"xx\")","v":"xx"},{"$f":"IF($C54=\"Ja\",INDEX(Grundkarakterer!U$8:U$41,$AE17),\"xx\")","v":"xx"},{"$f":"IF($C54=\"Ja\",INDEX(Grundkarakterer!V$8:V$41,$AE17),\"xx\")","v":"xx"},{"$f":"IF($C54=\"Ja\",INDEX(Grundkarakterer!W$8:W$41,$AE17),\"xx\")","v":"xx"},{"$f":"IF($C54=\"Ja\",INDEX(Grundkarakterer!X$8:X$41,$AE17),\"xx\")","v":"xx"},{"$f":"IF($C54=\"Ja\",INDEX(Grundkarakterer!Y$8:Y$41,$AE17),\"xx\")","v":"xx"},{"$f":"IF($C54=\"Ja\",INDEX(Grundkarakterer!Z$8:Z$41,$AE17),\"xx\")","v":"xx"},{"$f":"IF($C54=\"Ja\",INDEX(Grundkarakterer!AA$8:AA$41,$AE17),\"xx\")","v":"xx"},{"$f":"IF($C54=\"Ja\",INDEX(Grundkarakterer!AB$8:AB$41,$AE17),\"xx\")","v":"xx"},{"$f":"IF($C54=\"Ja\",INDEX(Grundkarakterer!AC$8:AC$41,$AE17),\"xx\")","v":"xx"},{"$f":"IF($C54=\"Ja\",INDEX(Grundkarakterer!AD$8:AD$41,$AE17),\"xx\")","v":"xx"},{"$f":"IF($C54=\"Ja\",INDEX(Grundkarakterer!AE$8:AE$41,$AE17),\"xx\")","v":"xx"},{"$f":"IF($C54=\"Ja\",INDEX(Grundkarakterer!AF$8:AF$41,$AE17),\"xx\")","v":"xx"},{"$f":"IF($C54=\"Ja\",INDEX(Grundkarakterer!AG$8:AG$41,$AE17),\"xx\")","v":"xx"},{"$f":"IF($C54=\"Ja\",INDEX(Grundkarakterer!AH$8:AH$41,$AE17),\"xx\")","v":"xx"},{"$f":"IF($C54=\"Ja\",INDEX(Grundkarakterer!AI$8:AI$41,$AE17),\"xx\")","v":"xx"},{"$f":"IF($C54=\"Ja\",INDEX(Grundkarakterer!M$8:M$41,$AE17),\"xx\")","v":"xx"}]
[16,{"$f":"INDEX(Grundkarakterer!A$8:A$41,AE18)","v":16},"Ja",{"$f":"IF(C55=\"Ja\",INDEX(Grundkarakterer!B$8:B$41,AE18),\"xx\")","v":"Vinterrybs"},{"$f":"IF(C55=\"Ja\",INDEX(Grundkarakterer!C$8:C$41,$AE18),\"xx\")","v":"1. Vintersæd"},{"$f":"IF(C55=\"Ja\",INDEX(Grundkarakterer!D$8:D$41,$AE18),\"xx\")","v":"1. Ved etablering af primærafgrøde"},{"$f":"IF(C55=\"Ja\",INDEX(Grundkarakterer!#REF!,$AE18),\"xx\")","v":{"$error":"#REF!"}},{"$f":"IF($C55=\"Ja\",IF($D$9=1,INDEX(Grundkarakterer!E$8:E$41,$AE18),IF(AND($D$9=2,$D$20=1),INDEX(Grundkarakterer!H$8:H$41,$AE18),IF(AND($D$9=2,$D$20<>1),INDEX(Grundkarakterer!F$8:F$41,$AE18),IF(AND($D$9=3,$D$20=1),INDEX(Grundkarakterer!I$8:I$41,$AE18),IF(AND($D$9=3,$D$20<>1),INDEX(Grundkarakterer!G$8:G$41,$AE18),IF($D$9=4,INDEX(Grundkarakterer!J$8:J$41,$AE18),IF($D$9=5,INDEX(Grundkarakterer!K$8:K$41,$AE18),\"Fejl\"))))))),\"xx\")","v":"20. august"},{"$f":"IF($C55=\"Ja\",INDEX(Grundkarakterer!L$8:L$41,$AE18),\"xx\")","v":-1513},{"$f":"IF($C55=\"Ja\",INDEX(Grundkarakterer!N$8:N$41,$AE18),\"xx\")","v":1},{"$f":"IF($C55=\"Ja\",INDEX(Grundkarakterer!O$8:O$41,$AE18),\"xx\")","v":0},{"$f":"IF($C55=\"Ja\",INDEX(Grundkarakterer!P$8:P$41,$AE18),\"xx\")","v":1},{"$f":"IF($C55=\"Ja\",INDEX(Grundkarakterer!Q$8:Q$41,$AE18),\"xx\")","v":0},{"$f":"IF($C55=\"Ja\",INDEX(Grundkarakterer!R$8:R$41,$AE18),\"xx\")","v":1},{"$f":"IF($C55=\"Ja\",INDEX(Grundkarakterer!S$8:S$41,$AE18),\"xx\")","v":1},{"$f":"IF($C55=\"Ja\",INDEX(Grundkarakterer!T$8:T$41,$AE18),\"xx\")","v":1},{"$f":"IF($C55=\"Ja\",INDEX(Grundkarakterer!U$8:U$41,$AE18),\"xx\")","v":0},{"$f":"IF($C55=\"Ja\",INDEX(Grundkarakterer!V$8:V$41,$AE18),\"xx\")","v":0},{"$f":"IF($C55=\"Ja\",INDEX(Grundkarakterer!W$8:W$41,$AE18),\"xx\")","v":1},{"$f":"IF($C55=\"Ja\",INDEX(Grundkarakterer!X$8:X$41,$AE18),\"xx\")","v":3},{"$f":"IF($C55=\"Ja\",INDEX(Grundkarakterer!Y$8:Y$41,$AE18),\"xx\")","v":0},{"$f":"IF($C55=\"Ja\",INDEX(Grundkarakterer!Z$8:Z$41,$AE18),\"xx\")","v":1},{"$f":"IF($C55=\"Ja\",INDEX(Grundkarakterer!AA$8:AA$41,$AE18),\"xx\")","v":2},{"$f":"IF($C55=\"Ja\",INDEX(Grundkarakterer!AB$8:AB$41,$AE18),\"xx\")","v":0},{"$f":"IF($C55=\"Ja\",INDEX(Grundkarakterer!AC$8:AC$41,$AE18),\"xx\")","v":3},{"$f":"IF($C55=\"Ja\",INDEX(Grundkarakterer!AD$8:AD$41,$AE18),\"xx\")","v":0},{"$f":"IF($C55=\"Ja\",INDEX(Grundkarakterer!AE$8:AE$41,$AE18),\"xx\")","v":0},{"$f":"IF($C55=\"Ja\",INDEX(Grundkarakterer!AF$8:AF$41,$AE18),\"xx\")","v":3},{"$f":"IF($C55=\"Ja\",INDEX(Grundkarakterer!AG$8:AG$41,$AE18),\"xx\")","v":1},{"$f":"IF($C55=\"Ja\",INDEX(Grundkarakterer!AH$8:AH$41,$AE18),\"xx\")","v":16},{"$f":"IF($C55=\"Ja\",INDEX(Grundkarakterer!AI$8:AI$41,$AE18),\"xx\")","v":0},{"$f":"IF($C55=\"Ja\",INDEX(Grundkarakterer!M$8:M$41,$AE18),\"xx\")","v":-633}]
[17,{"$f":"INDEX(Grundkarakterer!A$8:A$41,AE19)","v":17},"Nej",{"$f":"IF(C56=\"Ja\",INDEX(Grundkarakterer!B$8:B$41,AE19),\"xx\")","v":"xx"},{"$f":"IF(C56=\"Ja\",INDEX(Grundkarakterer!C$8:C$41,$AE19),\"xx\")","v":"xx"},{"$f":"IF(C56=\"Ja\",INDEX(Grundkarakterer!D$8:D$41,$AE19),\"xx\")","v":"xx"},{"$f":"IF(C56=\"Ja\",INDEX(Grundkarakterer!#REF!,$AE19),\"xx\")","v":"xx"},{"$f":"IF($C56=\"Ja\",IF($D$9=1,INDEX(Grundkarakterer!E$8:E$41,$AE19),IF(AND($D$9=2,$D$20=1),INDEX(Grundkarakterer!H$8:H$41,$AE19),IF(AND($D$9=2,$D$20<>1),INDEX(Grundkarakterer!F$8:F$41,$AE19),IF(AND($D$9=3,$D$20=1),INDEX(Grundkarakterer!I$8:I$41,$AE19),IF(AND($D$9=3,$D$20<>1),INDEX(Grundkarakterer!G$8:G$41,$AE19),IF($D$9=4,INDEX(Grundkarakterer!J$8:J$41,$AE19),IF($D$9=5,INDEX(Grundkarakterer!K$8:K$41,$AE19),\"Fejl\"))))))),\"xx\")","v":"xx"},{"$f":"IF($C56=\"Ja\",INDEX(Grundkarakterer!L$8:L$41,$AE19),\"xx\")","v":"xx"},{"$f":"IF($C56=\"Ja\",INDEX(Grundkarakterer!N$8:N$41,$AE19),\"xx\")","v":"xx"},{"$f":"IF($C56=\"Ja\",INDEX(Grundkarakterer!O$8:O$41,$AE19),\"xx\")","v":"xx"},{"$f":"IF($C56=\"Ja\",INDEX(Grundkarakterer!P$8:P$41,$AE19),\"xx\")","v":"xx"},{"$f":"IF($C56=\"Ja\",INDEX(Grundkarakterer!Q$8:Q$41,$AE19),\"xx\")","v":"xx"},{"$f":"IF($C56=\"Ja\",INDEX(Grundkarakterer!R$8:R$41,$AE19),\"xx\")","v":"xx"},{"$f":"IF($C56=\"Ja\",INDEX(Grundkarakterer!S$8:S$41,$AE19),\"xx\")","v":"xx"},{"$f":"IF($C56=\"Ja\",INDEX(Grundkarakterer!T$8:T$41,$AE19),\"xx\")","v":"xx"},{"$f":"IF($C56=\"Ja\",INDEX(Grundkarakterer!U$8:U$41,$AE19),\"xx\")","v":"xx"},{"$f":"IF($C56=\"Ja\",INDEX(Grundkarakterer!V$8:V$41,$AE19),\"xx\")","v":"xx"},{"$f":"IF($C56=\"Ja\",INDEX(Grundkarakterer!W$8:W$41,$AE19),\"xx\")","v":"xx"},{"$f":"IF($C56=\"Ja\",INDEX(Grundkarakterer!X$8:X$41,$AE19),\"xx\")","v":"xx"},{"$f":"IF($C56=\"Ja\",INDEX(Grundkarakterer!Y$8:Y$41,$AE19),\"xx\")","v":"xx"},{"$f":"IF($C56=\"Ja\",INDEX(Grundkarakterer!Z$8:Z$41,$AE19),\"xx\")","v":"xx"},{"$f":"IF($C56=\"Ja\",INDEX(Grundkarakterer!AA$8:AA$41,$AE19),\"xx\")","v":"xx"},{"$f":"IF($C56=\"Ja\",INDEX(Grundkarakterer!AB$8:AB$41,$AE19),\"xx\")","v":"xx"},{"$f":"IF($C56=\"Ja\",INDEX(Grundkarakterer!AC$8:AC$41,$AE19),\"xx\")","v":"xx"},{"$f":"IF($C56=\"Ja\",INDEX(Grundkarakterer!AD$8:AD$41,$AE19),\"xx\")","v":"xx"},{"$f":"IF($C56=\"Ja\",INDEX(Grundkarakterer!AE$8:AE$41,$AE19),\"xx\")","v":"xx"},{"$f":"IF($C56=\"Ja\",INDEX(Grundkarakterer!AF$8:AF$41,$AE19),\"xx\")","v":"xx"},{"$f":"IF($C56=\"Ja\",INDEX(Grundkarakterer!AG$8:AG$41,$AE19),\"xx\")","v":"xx"},{"$f":"IF($C56=\"Ja\",INDEX(Grundkarakterer!AH$8:AH$41,$AE19),\"xx\")","v":"xx"},{"$f":"IF($C56=\"Ja\",INDEX(Grundkarakterer!AI$8:AI$41,$AE19),\"xx\")","v":"xx"},{"$f":"IF($C56=\"Ja\",INDEX(Grundkarakterer!M$8:M$41,$AE19),\"xx\")","v":"xx"}]
[18,{"$f":"INDEX(Grundkarakterer!A$8:A$41,AE20)","v":18},"Ja",{"$f":"IF(C57=\"Ja\",INDEX(Grundkarakterer!B$8:B$41,AE20),\"xx\")","v":"Vårbyg"},{"$f":"IF(C57=\"Ja\",INDEX(Grundkarakterer!C$8:C$41,$AE20),\"xx\")","v":"1. Vintersæd"},{"$f":"IF(C57=\"Ja\",INDEX(Grundkarakterer!D$8:D$41,$AE20),\"xx\")","v":"1. Ved etablering af primærafgrøde"},{"$f":"IF(C57=\"Ja\",INDEX(Grundkarakterer!#REF!,$AE20),\"xx\")","v":{"$error":"#REF!"}},{"$f":"IF($C57=\"Ja\",IF($D$9=1,INDEX(Grundkarakterer!E$8:E$41,$AE20),IF(AND($D$9=2,$D$20=1),INDEX(Grundkarakterer!H$8:H$41,$AE20),IF(AND($D$9=2,$D$20<>1),INDEX(Grundkarakterer!F$8:F$41,$AE20),IF(AND($D$9=3,$D$20=1),INDEX(Grundkarakterer!I$8:I$41,$AE20),IF(AND($D$9=3,$D$20<>1),INDEX(Grundkarakterer!G$8:G$41,$AE20),IF($D$9=4,INDEX(Grundkarakterer!J$8:J$41,$AE20),IF($D$9=5,INDEX(Grundkarakterer!K$8:K$41,$AE20),\"Fejl\"))))))),\"xx\")","v":"20. august"},{"$f":"IF($C57=\"Ja\",INDEX(Grundkarakterer!L$8:L$41,$AE20),\"xx\")","v":-877},{"$f":"IF($C57=\"Ja\",INDEX(Grundkarakterer!N$8:N$41,$AE20),\"xx\")","v":1},{"$f":"IF($C57=\"Ja\",INDEX(Grundkarakterer!O$8:O$41,$AE20),\"xx\")","v":0},{"$f":"IF($C57=\"Ja\",INDEX(Grundkarakterer!P$8:P$41,$AE20),\"xx\")","v":1},{"$f":"IF($C57=\"Ja\",INDEX(Grundkarakterer!Q$8:Q$41,$AE20),\"xx\")","v":0},{"$f":"IF($C57=\"Ja\",INDEX(Grundkarakterer!R$8:R$41,$AE20),\"xx\")","v":1},{"$f":"IF($C57=\"Ja\",INDEX(Grundkarakterer!S$8:S$41,$AE20),\"xx\")","v":1},{"$f":"IF($C57=\"Ja\",INDEX(Grundkarakterer!T$8:T$41,$AE20),\"xx\")","v":1},{"$f":"IF($C57=\"Ja\",INDEX(Grundkarakterer!U$8:U$41,$AE20),\"xx\")","v":0},{"$f":"IF($C57=\"Ja\",INDEX(Grundkarakterer!V$8:V$41,$AE20),\"xx\")","v":0},{"$f":"IF($C57=\"Ja\",INDEX(Grundkarakterer!W$8:W$41,$AE20),\"xx\")","v":0},{"$f":"IF($C57=\"Ja\",INDEX(Grundkarakterer!X$8:X$41,$AE20),\"xx\")","v":3},{"$f":"IF($C57=\"Ja\",INDEX(Grundkarakterer!Y$8:Y$41,$AE20),\"xx\")","v":0},{"$f":"IF($C57=\"Ja\",INDEX(Grundkarakterer!Z$8:Z$41,$AE20),\"xx\")","v":1},{"$f":"IF($C57=\"Ja\",INDEX(Grundkarakterer!AA$8:AA$41,$AE20),\"xx\")","v":0},{"$f":"IF($C57=\"Ja\",INDEX(Grundkarakterer!AB$8:AB$41,$AE20),\"xx\")","v":3},{"$f":"IF($C57=\"Ja\",INDEX(Grundkarakterer!AC$8:AC$41,$AE20),\"xx\")","v":3},{"$f":"IF($C57=\"Ja\",INDEX(Grundkarakterer!AD$8:AD$41,$AE20),\"xx\")","v":0},{"$f":"IF($C57=\"Ja\",INDEX(Grundkarakterer!AE$8:AE$41,$AE20),\"xx\")","v":0},{"$f":"IF($C57=\"Ja\",INDEX(Grundkarakterer!AF$8:AF$41,$AE20),\"xx\")","v":1},{"$f":"IF($C57=\"Ja\",INDEX(Grundkarakterer!AG$8:AG$41,$AE20),\"xx\")","v":1},{"$f":"IF($C57=\"Ja\",INDEX(Grundkarakterer!AH$8:AH$41,$AE20),\"xx\")","v":18},{"$f":"IF($C57=\"Ja\",INDEX(Grundkarakterer!AI$8:AI$41,$AE20),\"xx\")","v":0},{"$f":"IF($C57=\"Ja\",INDEX(Grundkarakterer!M$8:M$41,$AE20),\"xx\")","v":-657}]
[19,{"$f":"INDEX(Grundkarakterer!A$8:A$41,AE21)","v":19},"Nej",{"$f":"IF(C58=\"Ja\",INDEX(Grundkarakterer!B$8:B$41,AE21),\"xx\")","v":"xx"},{"$f":"IF(C58=\"Ja\",INDEX(Grundkarakterer!C$8:C$41,$AE21),\"xx\")","v":"xx"},{"$f":"IF(C58=\"Ja\",INDEX(Grundkarakterer!D$8:D$41,$AE21),\"xx\")","v":"xx"},{"$f":"IF(C58=\"Ja\",INDEX(Grundkarakterer!#REF!,$AE21),\"xx\")","v":"xx"},{"$f":"IF($C58=\"Ja\",IF($D$9=1,INDEX(Grundkarakterer!E$8:E$41,$AE21),IF(AND($D$9=2,$D$20=1),INDEX(Grundkarakterer!H$8:H$41,$AE21),IF(AND($D$9=2,$D$20<>1),INDEX(Grundkarakterer!F$8:F$41,$AE21),IF(AND($D$9=3,$D$20=1),INDEX(Grundkarakterer!I$8:I$41,$AE21),IF(AND($D$9=3,$D$20<>1),INDEX(Grundkarakterer!G$8:G$41,$AE21),IF($D$9=4,INDEX(Grundkarakterer!J$8:J$41,$AE21),IF($D$9=5,INDEX(Grundkarakterer!K$8:K$41,$AE21),\"Fejl\"))))))),\"xx\")","v":"xx"},{"$f":"IF($C58=\"Ja\",INDEX(Grundkarakterer!L$8:L$41,$AE21),\"xx\")","v":"xx"},{"$f":"IF($C58=\"Ja\",INDEX(Grundkarakterer!N$8:N$41,$AE21),\"xx\")","v":"xx"},{"$f":"IF($C58=\"Ja\",INDEX(Grundkarakterer!O$8:O$41,$AE21),\"xx\")","v":"xx"},{"$f":"IF($C58=\"Ja\",INDEX(Grundkarakterer!P$8:P$41,$AE21),\"xx\")","v":"xx"},{"$f":"IF($C58=\"Ja\",INDEX(Grundkarakterer!Q$8:Q$41,$AE21),\"xx\")","v":"xx"},{"$f":"IF($C58=\"Ja\",INDEX(Grundkarakterer!R$8:R$41,$AE21),\"xx\")","v":"xx"},{"$f":"IF($C58=\"Ja\",INDEX(Grundkarakterer!S$8:S$41,$AE21),\"xx\")","v":"xx"},{"$f":"IF($C58=\"Ja\",INDEX(Grundkarakterer!T$8:T$41,$AE21),\"xx\")","v":"xx"},{"$f":"IF($C58=\"Ja\",INDEX(Grundkarakterer!U$8:U$41,$AE21),\"xx\")","v":"xx"},{"$f":"IF($C58=\"Ja\",INDEX(Grundkarakterer!V$8:V$41,$AE21),\"xx\")","v":"xx"},{"$f":"IF($C58=\"Ja\",INDEX(Grundkarakterer!W$8:W$41,$AE21),\"xx\")","v":"xx"},{"$f":"IF($C58=\"Ja\",INDEX(Grundkarakterer!X$8:X$41,$AE21),\"xx\")","v":"xx"},{"$f":"IF($C58=\"Ja\",INDEX(Grundkarakterer!Y$8:Y$41,$AE21),\"xx\")","v":"xx"},{"$f":"IF($C58=\"Ja\",INDEX(Grundkarakterer!Z$8:Z$41,$AE21),\"xx\")","v":"xx"},{"$f":"IF($C58=\"Ja\",INDEX(Grundkarakterer!AA$8:AA$41,$AE21),\"xx\")","v":"xx"},{"$f":"IF($C58=\"Ja\",INDEX(Grundkarakterer!AB$8:AB$41,$AE21),\"xx\")","v":"xx"},{"$f":"IF($C58=\"Ja\",INDEX(Grundkarakterer!AC$8:AC$41,$AE21),\"xx\")","v":"xx"},{"$f":"IF($C58=\"Ja\",INDEX(Grundkarakterer!AD$8:AD$41,$AE21),\"xx\")","v":"xx"},{"$f":"IF($C58=\"Ja\",INDEX(Grundkarakterer!AE$8:AE$41,$AE21),\"xx\")","v":"xx"},{"$f":"IF($C58=\"Ja\",INDEX(Grundkarakterer!AF$8:AF$41,$AE21),\"xx\")","v":"xx"},{"$f":"IF($C58=\"Ja\",INDEX(Grundkarakterer!AG$8:AG$41,$AE21),\"xx\")","v":"xx"},{"$f":"IF($C58=\"Ja\",INDEX(Grundkarakterer!AH$8:AH$41,$AE21),\"xx\")","v":"xx"},{"$f":"IF($C58=\"Ja\",INDEX(Grundkarakterer!AI$8:AI$41,$AE21),\"xx\")","v":"xx"},{"$f":"IF($C58=\"Ja\",INDEX(Grundkarakterer!M$8:M$41,$AE21),\"xx\")","v":"xx"}]
[20,{"$f":"INDEX(Grundkarakterer!A$8:A$41,AE22)","v":20},"Ja",{"$f":"IF(C59=\"Ja\",INDEX(Grundkarakterer!B$8:B$41,AE22),\"xx\")","v":"Vinterrug "},{"$f":"IF(C59=\"Ja\",INDEX(Grundkarakterer!C$8:C$41,$AE22),\"xx\")","v":0},{"$f":"IF(C59=\"Ja\",INDEX(Grundkarakterer!D$8:D$41,$AE22),\"xx\")","v":0},{"$f":"IF(C59=\"Ja\",INDEX(Grundkarakterer!#REF!,$AE22),\"xx\")","v":{"$error":"#REF!"}},{"$f":"IF($C59=\"Ja\",IF($D$9=1,INDEX(Grundkarakterer!E$8:E$41,$AE22),IF(AND($D$9=2,$D$20=1),INDEX(Grundkarakterer!H$8:H$41,$AE22),IF(AND($D$9=2,$D$20<>1),INDEX(Grundkarakterer!F$8:F$41,$AE22),IF(AND($D$9=3,$D$20=1),INDEX(Grundkarakterer!I$8:I$41,$AE22),IF(AND($D$9=3,$D$20<>1),INDEX(Grundkarakterer!G$8:G$41,$AE22),IF($D$9=4,INDEX(Grundkarakterer!J$8:J$41,$AE22),IF($D$9=5,INDEX(Grundkarakterer!K$8:K$41,$AE22),\"Fejl\"))))))),\"xx\")","v":"20. august"},{"$f":"IF($C59=\"Ja\",INDEX(Grundkarakterer!L$8:L$41,$AE22),\"xx\")","v":-849},{"$f":"IF($C59=\"Ja\",INDEX(Grundkarakterer!N$8:N$41,$AE22),\"xx\")","v":1},{"$f":"IF($C59=\"Ja\",INDEX(Grundkarakterer!O$8:O$41,$AE22),\"xx\")","v":0},{"$f":"IF($C59=\"Ja\",INDEX(Grundkarakterer!P$8:P$41,$AE22),\"xx\")","v":1},{"$f":"IF($C59=\"Ja\",INDEX(Grundkarakterer!Q$8:Q$41,$AE22),\"xx\")","v":0},{"$f":"IF($C59=\"Ja\",INDEX(Grundkarakterer!R$8:R$41,$AE22),\"xx\")","v":1},{"$f":"IF($C59=\"Ja\",INDEX(Grundkarakterer!S$8:S$41,$AE22),\"xx\")","v":1},{"$f":"IF($C59=\"Ja\",INDEX(Grundkarakterer!T$8:T$41,$AE22),\"xx\")","v":1},{"$f":"IF($C59=\"Ja\",INDEX(Grundkarakterer!U$8:U$41,$AE22),\"xx\")","v":0},{"$f":"IF($C59=\"Ja\",INDEX(Grundkarakterer!V$8:V$41,$AE22),\"xx\")","v":0},{"$f":"IF($C59=\"Ja\",INDEX(Grundkarakterer!W$8:W$41,$AE22),\"xx\")","v":1},{"$f":"IF($C59=\"Ja\",INDEX(Grundkarakterer!X$8:X$41,$AE22),\"xx\")","v":3},{"$f":"IF($C59=\"Ja\",INDEX(Grundkarakterer!Y$8:Y$41,$AE22),\"xx\")","v":0},{"$f":"IF($C59=\"Ja\",INDEX(Grundkarakterer!Z$8:Z$41,$AE22),\"xx\")","v":1},{"$f":"IF($C59=\"Ja\",INDEX(Grundkarakterer!AA$8:AA$41,$AE22),\"xx\")","v":1},{"$f":"IF($C59=\"Ja\",INDEX(Grundkarakterer!AB$8:AB$41,$AE22),\"xx\")","v":3},{"$f":"IF($C59=\"Ja\",INDEX(Grundkarakterer!AC$8:AC$41,$AE22),\"xx\")","v":3},{"$f":"IF($C59=\"Ja\",INDEX(Grundkarakterer!AD$8:AD$41,$AE22),\"xx\")","v":0},{"$f":"IF($C59=\"Ja\",INDEX(Grundkarakterer!AE$8:AE$41,$AE22),\"xx\")","v":0},{"$f":"IF($C59=\"Ja\",INDEX(Grundkarakterer!AF$8:AF$41,$AE22),\"xx\")","v":3},{"$f":"IF($C59=\"Ja\",INDEX(Grundkarakterer!AG$8:AG$41,$AE22),\"xx\")","v":1},{"$f":"IF($C59=\"Ja\",INDEX(Grundkarakterer!AH$8:AH$41,$AE22),\"xx\")","v":20},{"$f":"IF($C59=\"Ja\",INDEX(Grundkarakterer!AI$8:AI$41,$AE22),\"xx\")","v":0},{"$f":"IF($C59=\"Ja\",INDEX(Grundkarakterer!M$8:M$41,$AE22),\"xx\")","v":-409}]
[21,{"$f":"INDEX(Grundkarakterer!A$8:A$41,AE23)","v":21},"Nej",{"$f":"IF(C60=\"Ja\",INDEX(Grundkarakterer!B$8:B$41,AE23),\"xx\")","v":"xx"},{"$f":"IF(C60=\"Ja\",INDEX(Grundkarakterer!C$8:C$41,$AE23),\"xx\")","v":"xx"},{"$f":"IF(C60=\"Ja\",INDEX(Grundkarakterer!D$8:D$41,$AE23),\"xx\")","v":"xx"},{"$f":"IF(C60=\"Ja\",INDEX(Grundkarakterer!#REF!,$AE23),\"xx\")","v":"xx"},{"$f":"IF($C60=\"Ja\",IF($D$9=1,INDEX(Grundkarakterer!E$8:E$41,$AE23),IF(AND($D$9=2,$D$20=1),INDEX(Grundkarakterer!H$8:H$41,$AE23),IF(AND($D$9=2,$D$20<>1),INDEX(Grundkarakterer!F$8:F$41,$AE23),IF(AND($D$9=3,$D$20=1),INDEX(Grundkarakterer!I$8:I$41,$AE23),IF(AND($D$9=3,$D$20<>1),INDEX(Grundkarakterer!G$8:G$41,$AE23),IF($D$9=4,INDEX(Grundkarakterer!J$8:J$41,$AE23),IF($D$9=5,INDEX(Grundkarakterer!K$8:K$41,$AE23),\"Fejl\"))))))),\"xx\")","v":"xx"},{"$f":"IF($C60=\"Ja\",INDEX(Grundkarakterer!L$8:L$41,$AE23),\"xx\")","v":"xx"},{"$f":"IF($C60=\"Ja\",INDEX(Grundkarakterer!N$8:N$41,$AE23),\"xx\")","v":"xx"},{"$f":"IF($C60=\"Ja\",INDEX(Grundkarakterer!O$8:O$41,$AE23),\"xx\")","v":"xx"},{"$f":"IF($C60=\"Ja\",INDEX(Grundkarakterer!P$8:P$41,$AE23),\"xx\")","v":"xx"},{"$f":"IF($C60=\"Ja\",INDEX(Grundkarakterer!Q$8:Q$41,$AE23),\"xx\")","v":"xx"},{"$f":"IF($C60=\"Ja\",INDEX(Grundkarakterer!R$8:R$41,$AE23),\"xx\")","v":"xx"},{"$f":"IF($C60=\"Ja\",INDEX(Grundkarakterer!S$8:S$41,$AE23),\"xx\")","v":"xx"},{"$f":"IF($C60=\"Ja\",INDEX(Grundkarakterer!T$8:T$41,$AE23),\"xx\")","v":"xx"},{"$f":"IF($C60=\"Ja\",INDEX(Grundkarakterer!U$8:U$41,$AE23),\"xx\")","v":"xx"},{"$f":"IF($C60=\"Ja\",INDEX(Grundkarakterer!V$8:V$41,$AE23),\"xx\")","v":"xx"},{"$f":"IF($C60=\"Ja\",INDEX(Grundkarakterer!W$8:W$41,$AE23),\"xx\")","v":"xx"},{"$f":"IF($C60=\"Ja\",INDEX(Grundkarakterer!X$8:X$41,$AE23),\"xx\")","v":"xx"},{"$f":"IF($C60=\"Ja\",INDEX(Grundkarakterer!Y$8:Y$41,$AE23),\"xx\")","v":"xx"},{"$f":"IF($C60=\"Ja\",INDEX(Grundkarakterer!Z$8:Z$41,$AE23),\"xx\")","v":"xx"},{"$f":"IF($C60=\"Ja\",INDEX(Grundkarakterer!AA$8:AA$41,$AE23),\"xx\")","v":"xx"},{"$f":"IF($C60=\"Ja\",INDEX(Grundkarakterer!AB$8:AB$41,$AE23),\"xx\")","v":"xx"},{"$f":"IF($C60=\"Ja\",INDEX(Grundkarakterer!AC$8:AC$41,$AE23),\"xx\")","v":"xx"},{"$f":"IF($C60=\"Ja\",INDEX(Grundkarakterer!AD$8:AD$41,$AE23),\"xx\")","v":"xx"},{"$f":"IF($C60=\"Ja\",INDEX(Grundkarakterer!AE$8:AE$41,$AE23),\"xx\")","v":"xx"},{"$f":"IF($C60=\"Ja\",INDEX(Grundkarakterer!AF$8:AF$41,$AE23),\"xx\")","v":"xx"},{"$f":"IF($C60=\"Ja\",INDEX(Grundkarakterer!AG$8:AG$41,$AE23),\"xx\")","v":"xx"},{"$f":"IF($C60=\"Ja\",INDEX(Grundkarakterer!AH$8:AH$41,$AE23),\"xx\")","v":"xx"},{"$f":"IF($C60=\"Ja\",INDEX(Grundkarakterer!AI$8:AI$41,$AE23),\"xx\")","v":"xx"},{"$f":"IF($C60=\"Ja\",INDEX(Grundkarakterer!M$8:M$41,$AE23),\"xx\")","v":"xx"}]
[22,{"$f":"INDEX(Grundkarakterer!A$8:A$41,AE24)","v":22},"Nej",{"$f":"IF(C61=\"Ja\",INDEX(Grundkarakterer!B$8:B$41,AE24),\"xx\")","v":"xx"},{"$f":"IF(C61=\"Ja\",INDEX(Grundkarakterer!C$8:C$41,$AE24),\"xx\")","v":"xx"},{"$f":"IF(C61=\"Ja\",INDEX(Grundkarakterer!D$8:D$41,$AE24),\"xx\")","v":"xx"},{"$f":"IF(C61=\"Ja\",INDEX(Grundkarakterer!#REF!,$AE24),\"xx\")","v":"xx"},{"$f":"IF($C61=\"Ja\",IF($D$9=1,INDEX(Grundkarakterer!E$8:E$41,$AE24),IF(AND($D$9=2,$D$20=1),INDEX(Grundkarakterer!H$8:H$41,$AE24),IF(AND($D$9=2,$D$20<>1),INDEX(Grundkarakterer!F$8:F$41,$AE24),IF(AND($D$9=3,$D$20=1),INDEX(Grundkarakterer!I$8:I$41,$AE24),IF(AND($D$9=3,$D$20<>1),INDEX(Grundkarakterer!G$8:G$41,$AE24),IF($D$9=4,INDEX(Grundkarakterer!J$8:J$41,$AE24),IF($D$9=5,INDEX(Grundkarakterer!K$8:K$41,$AE24),\"Fejl\"))))))),\"xx\")","v":"xx"},{"$f":"IF($C61=\"Ja\",INDEX(Grundkarakterer!L$8:L$41,$AE24),\"xx\")","v":"xx"},{"$f":"IF($C61=\"Ja\",INDEX(Grundkarakterer!N$8:N$41,$AE24),\"xx\")","v":"xx"},{"$f":"IF($C61=\"Ja\",INDEX(Grundkarakterer!O$8:O$41,$AE24),\"xx\")","v":"xx"},{"$f":"IF($C61=\"Ja\",INDEX(Grundkarakterer!P$8:P$41,$AE24),\"xx\")","v":"xx"},{"$f":"IF($C61=\"Ja\",INDEX(Grundkarakterer!Q$8:Q$41,$AE24),\"xx\")","v":"xx"},{"$f":"IF($C61=\"Ja\",INDEX(Grundkarakterer!R$8:R$41,$AE24),\"xx\")","v":"xx"},{"$f":"IF($C61=\"Ja\",INDEX(Grundkarakterer!S$8:S$41,$AE24),\"xx\")","v":"xx"},{"$f":"IF($C61=\"Ja\",INDEX(Grundkarakterer!T$8:T$41,$AE24),\"xx\")","v":"xx"},{"$f":"IF($C61=\"Ja\",INDEX(Grundkarakterer!U$8:U$41,$AE24),\"xx\")","v":"xx"},{"$f":"IF($C61=\"Ja\",INDEX(Grundkarakterer!V$8:V$41,$AE24),\"xx\")","v":"xx"},{"$f":"IF($C61=\"Ja\",INDEX(Grundkarakterer!W$8:W$41,$AE24),\"xx\")","v":"xx"},{"$f":"IF($C61=\"Ja\",INDEX(Grundkarakterer!X$8:X$41,$AE24),\"xx\")","v":"xx"},{"$f":"IF($C61=\"Ja\",INDEX(Grundkarakterer!Y$8:Y$41,$AE24),\"xx\")","v":"xx"},{"$f":"IF($C61=\"Ja\",INDEX(Grundkarakterer!Z$8:Z$41,$AE24),\"xx\")","v":"xx"},{"$f":"IF($C61=\"Ja\",INDEX(Grundkarakterer!AA$8:AA$41,$AE24),\"xx\")","v":"xx"},{"$f":"IF($C61=\"Ja\",INDEX(Grundkarakterer!AB$8:AB$41,$AE24),\"xx\")","v":"xx"},{"$f":"IF($C61=\"Ja\",INDEX(Grundkarakterer!AC$8:AC$41,$AE24),\"xx\")","v":"xx"},{"$f":"IF($C61=\"Ja\",INDEX(Grundkarakterer!AD$8:AD$41,$AE24),\"xx\")","v":"xx"},{"$f":"IF($C61=\"Ja\",INDEX(Grundkarakterer!AE$8:AE$41,$AE24),\"xx\")","v":"xx"},{"$f":"IF($C61=\"Ja\",INDEX(Grundkarakterer!AF$8:AF$41,$AE24),\"xx\")","v":"xx"},{"$f":"IF($C61=\"Ja\",INDEX(Grundkarakterer!AG$8:AG$41,$AE24),\"xx\")","v":"xx"},{"$f":"IF($C61=\"Ja\",INDEX(Grundkarakterer!AH$8:AH$41,$AE24),\"xx\")","v":"xx"},{"$f":"IF($C61=\"Ja\",INDEX(Grundkarakterer!AI$8:AI$41,$AE24),\"xx\")","v":"xx"},{"$f":"IF($C61=\"Ja\",INDEX(Grundkarakterer!M$8:M$41,$AE24),\"xx\")","v":"xx"}]
[23,{"$f":"INDEX(Grundkarakterer!A$8:A$41,AE25)","v":23},"Nej",{"$f":"IF(C62=\"Ja\",INDEX(Grundkarakterer!B$8:B$41,AE25),\"xx\")","v":"xx"},{"$f":"IF(C62=\"Ja\",INDEX(Grundkarakterer!C$8:C$41,$AE25),\"xx\")","v":"xx"},{"$f":"IF(C62=\"Ja\",INDEX(Grundkarakterer!D$8:D$41,$AE25),\"xx\")","v":"xx"},{"$f":"IF(C62=\"Ja\",INDEX(Grundkarakterer!#REF!,$AE25),\"xx\")","v":"xx"},{"$f":"IF($C62=\"Ja\",IF($D$9=1,INDEX(Grundkarakterer!E$8:E$41,$AE25),IF(AND($D$9=2,$D$20=1),INDEX(Grundkarakterer!H$8:H$41,$AE25),IF(AND($D$9=2,$D$20<>1),INDEX(Grundkarakterer!F$8:F$41,$AE25),IF(AND($D$9=3,$D$20=1),INDEX(Grundkarakterer!I$8:I$41,$AE25),IF(AND($D$9=3,$D$20<>1),INDEX(Grundkarakterer!G$8:G$41,$AE25),IF($D$9=4,INDEX(Grundkarakterer!J$8:J$41,$AE25),IF($D$9=5,INDEX(Grundkarakterer!K$8:K$41,$AE25),\"Fejl\"))))))),\"xx\")","v":"xx"},{"$f":"IF($C62=\"Ja\",INDEX(Grundkarakterer!L$8:L$41,$AE25),\"xx\")","v":"xx"},{"$f":"IF($C62=\"Ja\",INDEX(Grundkarakterer!N$8:N$41,$AE25),\"xx\")","v":"xx"},{"$f":"IF($C62=\"Ja\",INDEX(Grundkarakterer!O$8:O$41,$AE25),\"xx\")","v":"xx"},{"$f":"IF($C62=\"Ja\",INDEX(Grundkarakterer!P$8:P$41,$AE25),\"xx\")","v":"xx"},{"$f":"IF($C62=\"Ja\",INDEX(Grundkarakterer!Q$8:Q$41,$AE25),\"xx\")","v":"xx"},{"$f":"IF($C62=\"Ja\",INDEX(Grundkarakterer!R$8:R$41,$AE25),\"xx\")","v":"xx"},{"$f":"IF($C62=\"Ja\",INDEX(Grundkarakterer!S$8:S$41,$AE25),\"xx\")","v":"xx"},{"$f":"IF($C62=\"Ja\",INDEX(Grundkarakterer!T$8:T$41,$AE25),\"xx\")","v":"xx"},{"$f":"IF($C62=\"Ja\",INDEX(Grundkarakterer!U$8:U$41,$AE25),\"xx\")","v":"xx"},{"$f":"IF($C62=\"Ja\",INDEX(Grundkarakterer!V$8:V$41,$AE25),\"xx\")","v":"xx"},{"$f":"IF($C62=\"Ja\",INDEX(Grundkarakterer!W$8:W$41,$AE25),\"xx\")","v":"xx"},{"$f":"IF($C62=\"Ja\",INDEX(Grundkarakterer!X$8:X$41,$AE25),\"xx\")","v":"xx"},{"$f":"IF($C62=\"Ja\",INDEX(Grundkarakterer!Y$8:Y$41,$AE25),\"xx\")","v":"xx"},{"$f":"IF($C62=\"Ja\",INDEX(Grundkarakterer!Z$8:Z$41,$AE25),\"xx\")","v":"xx"},{"$f":"IF($C62=\"Ja\",INDEX(Grundkarakterer!AA$8:AA$41,$AE25),\"xx\")","v":"xx"},{"$f":"IF($C62=\"Ja\",INDEX(Grundkarakterer!AB$8:AB$41,$AE25),\"xx\")","v":"xx"},{"$f":"IF($C62=\"Ja\",INDEX(Grundkarakterer!AC$8:AC$41,$AE25),\"xx\")","v":"xx"},{"$f":"IF($C62=\"Ja\",INDEX(Grundkarakterer!AD$8:AD$41,$AE25),\"xx\")","v":"xx"},{"$f":"IF($C62=\"Ja\",INDEX(Grundkarakterer!AE$8:AE$41,$AE25),\"xx\")","v":"xx"},{"$f":"IF($C62=\"Ja\",INDEX(Grundkarakterer!AF$8:AF$41,$AE25),\"xx\")","v":"xx"},{"$f":"IF($C62=\"Ja\",INDEX(Grundkarakterer!AG$8:AG$41,$AE25),\"xx\")","v":"xx"},{"$f":"IF($C62=\"Ja\",INDEX(Grundkarakterer!AH$8:AH$41,$AE25),\"xx\")","v":"xx"},{"$f":"IF($C62=\"Ja\",INDEX(Grundkarakterer!AI$8:AI$41,$AE25),\"xx\")","v":"xx"},{"$f":"IF($C62=\"Ja\",INDEX(Grundkarakterer!M$8:M$41,$AE25),\"xx\")","v":"xx"}]
[24,{"$f":"INDEX(Grundkarakterer!A$8:A$41,AE26)","v":24},"Nej",{"$f":"IF(C63=\"Ja\",INDEX(Grundkarakterer!B$8:B$41,AE26),\"xx\")","v":"xx"},{"$f":"IF(C63=\"Ja\",INDEX(Grundkarakterer!C$8:C$41,$AE26),\"xx\")","v":"xx"},{"$f":"IF(C63=\"Ja\",INDEX(Grundkarakterer!D$8:D$41,$AE26),\"xx\")","v":"xx"},{"$f":"IF(C63=\"Ja\",INDEX(Grundkarakterer!#REF!,$AE26),\"xx\")","v":"xx"},{"$f":"IF($C63=\"Ja\",IF($D$9=1,INDEX(Grundkarakterer!E$8:E$41,$AE26),IF(AND($D$9=2,$D$20=1),INDEX(Grundkarakterer!H$8:H$41,$AE26),IF(AND($D$9=2,$D$20<>1),INDEX(Grundkarakterer!F$8:F$41,$AE26),IF(AND($D$9=3,$D$20=1),INDEX(Grundkarakterer!I$8:I$41,$AE26),IF(AND($D$9=3,$D$20<>1),INDEX(Grundkarakterer!G$8:G$41,$AE26),IF($D$9=4,INDEX(Grundkarakterer!J$8:J$41,$AE26),IF($D$9=5,INDEX(Grundkarakterer!K$8:K$41,$AE26),\"Fejl\"))))))),\"xx\")","v":"xx"},{"$f":"IF($C63=\"Ja\",INDEX(Grundkarakterer!L$8:L$41,$AE26),\"xx\")","v":"xx"},{"$f":"IF($C63=\"Ja\",INDEX(Grundkarakterer!N$8:N$41,$AE26),\"xx\")","v":"xx"},{"$f":"IF($C63=\"Ja\",INDEX(Grundkarakterer!O$8:O$41,$AE26),\"xx\")","v":"xx"},{"$f":"IF($C63=\"Ja\",INDEX(Grundkarakterer!P$8:P$41,$AE26),\"xx\")","v":"xx"},{"$f":"IF($C63=\"Ja\",INDEX(Grundkarakterer!Q$8:Q$41,$AE26),\"xx\")","v":"xx"},{"$f":"IF($C63=\"Ja\",INDEX(Grundkarakterer!R$8:R$41,$AE26),\"xx\")","v":"xx"},{"$f":"IF($C63=\"Ja\",INDEX(Grundkarakterer!S$8:S$41,$AE26),\"xx\")","v":"xx"},{"$f":"IF($C63=\"Ja\",INDEX(Grundkarakterer!T$8:T$41,$AE26),\"xx\")","v":"xx"},{"$f":"IF($C63=\"Ja\",INDEX(Grundkarakterer!U$8:U$41,$AE26),\"xx\")","v":"xx"},{"$f":"IF($C63=\"Ja\",INDEX(Grundkarakterer!V$8:V$41,$AE26),\"xx\")","v":"xx"},{"$f":"IF($C63=\"Ja\",INDEX(Grundkarakterer!W$8:W$41,$AE26),\"xx\")","v":"xx"},{"$f":"IF($C63=\"Ja\",INDEX(Grundkarakterer!X$8:X$41,$AE26),\"xx\")","v":"xx"},{"$f":"IF($C63=\"Ja\",INDEX(Grundkarakterer!Y$8:Y$41,$AE26),\"xx\")","v":"xx"},{"$f":"IF($C63=\"Ja\",INDEX(Grundkarakterer!Z$8:Z$41,$AE26),\"xx\")","v":"xx"},{"$f":"IF($C63=\"Ja\",INDEX(Grundkarakterer!AA$8:AA$41,$AE26),\"xx\")","v":"xx"},{"$f":"IF($C63=\"Ja\",INDEX(Grundkarakterer!AB$8:AB$41,$AE26),\"xx\")","v":"xx"},{"$f":"IF($C63=\"Ja\",INDEX(Grundkarakterer!AC$8:AC$41,$AE26),\"xx\")","v":"xx"},{"$f":"IF($C63=\"Ja\",INDEX(Grundkarakterer!AD$8:AD$41,$AE26),\"xx\")","v":"xx"},{"$f":"IF($C63=\"Ja\",INDEX(Grundkarakterer!AE$8:AE$41,$AE26),\"xx\")","v":"xx"},{"$f":"IF($C63=\"Ja\",INDEX(Grundkarakterer!AF$8:AF$41,$AE26),\"xx\")","v":"xx"},{"$f":"IF($C63=\"Ja\",INDEX(Grundkarakterer!AG$8:AG$41,$AE26),\"xx\")","v":"xx"},{"$f":"IF($C63=\"Ja\",INDEX(Grundkarakterer!AH$8:AH$41,$AE26),\"xx\")","v":"xx"},{"$f":"IF($C63=\"Ja\",INDEX(Grundkarakterer!AI$8:AI$41,$AE26),\"xx\")","v":"xx"},{"$f":"IF($C63=\"Ja\",INDEX(Grundkarakterer!M$8:M$41,$AE26),\"xx\")","v":"xx"}]
[25,{"$f":"INDEX(Grundkarakterer!A$8:A$41,AE27)","v":25},"Ja",{"$f":"IF(C64=\"Ja\",INDEX(Grundkarakterer!B$8:B$41,AE27),\"xx\")","v":"Honningurt"},{"$f":"IF(C64=\"Ja\",INDEX(Grundkarakterer!C$8:C$41,$AE27),\"xx\")","v":"1. Vintersæd"},{"$f":"IF(C64=\"Ja\",INDEX(Grundkarakterer!D$8:D$41,$AE27),\"xx\")","v":"1. Ved etablering af primærafgrøde"},{"$f":"IF(C64=\"Ja\",INDEX(Grundkarakterer!#REF!,$AE27),\"xx\")","v":{"$error":"#REF!"}},{"$f":"IF($C64=\"Ja\",IF($D$9=1,INDEX(Grundkarakterer!E$8:E$41,$AE27),IF(AND($D$9=2,$D$20=1),INDEX(Grundkarakterer!H$8:H$41,$AE27),IF(AND($D$9=2,$D$20<>1),INDEX(Grundkarakterer!F$8:F$41,$AE27),IF(AND($D$9=3,$D$20=1),INDEX(Grundkarakterer!I$8:I$41,$AE27),IF(AND($D$9=3,$D$20<>1),INDEX(Grundkarakterer!G$8:G$41,$AE27),IF($D$9=4,INDEX(Grundkarakterer!J$8:J$41,$AE27),IF($D$9=5,INDEX(Grundkarakterer!K$8:K$41,$AE27),\"Fejl\"))))))),\"xx\")","v":"20. august"},{"$f":"IF($C64=\"Ja\",INDEX(Grundkarakterer!L$8:L$41,$AE27),\"xx\")","v":-2302},{"$f":"IF($C64=\"Ja\",INDEX(Grundkarakterer!N$8:N$41,$AE27),\"xx\")","v":1},{"$f":"IF($C64=\"Ja\",INDEX(Grundkarakterer!O$8:O$41,$AE27),\"xx\")","v":0},{"$f":"IF($C64=\"Ja\",INDEX(Grundkarakterer!P$8:P$41,$AE27),\"xx\")","v":1},{"$f":"IF($C64=\"Ja\",INDEX(Grundkarakterer!Q$8:Q$41,$AE27),\"xx\")","v":0},{"$f":"IF($C64=\"Ja\",INDEX(Grundkarakterer!R$8:R$41,$AE27),\"xx\")","v":1},{"$f":"IF($C64=\"Ja\",INDEX(Grundkarakterer!S$8:S$41,$AE27),\"xx\")","v":1},{"$f":"IF($C64=\"Ja\",INDEX(Grundkarakterer!T$8:T$41,$AE27),\"xx\")","v":1},{"$f":"IF($C64=\"Ja\",INDEX(Grundkarakterer!U$8:U$41,$AE27),\"xx\")","v":0},{"$f":"IF($C64=\"Ja\",INDEX(Grundkarakterer!V$8:V$41,$AE27),\"xx\")","v":0},{"$f":"IF($C64=\"Ja\",INDEX(Grundkarakterer!W$8:W$41,$AE27),\"xx\")","v":0},{"$f":"IF($C64=\"Ja\",INDEX(Grundkarakterer!X$8:X$41,$AE27),\"xx\")","v":3},{"$f":"IF($C64=\"Ja\",INDEX(Grundkarakterer!Y$8:Y$41,$AE27),\"xx\")","v":0},{"$f":"IF($C64=\"Ja\",INDEX(Grundkarakterer!Z$8:Z$41,$AE27),\"xx\")","v":2},{"$f":"IF($C64=\"Ja\",INDEX(Grundkarakterer!AA$8:AA$41,$AE27),\"xx\")","v":3},{"$f":"IF($C64=\"Ja\",INDEX(Grundkarakterer!AB$8:AB$41,$AE27),\"xx\")","v":3},{"$f":"IF($C64=\"Ja\",INDEX(Grundkarakterer!AC$8:AC$41,$AE27),\"xx\")","v":3},{"$f":"IF($C64=\"Ja\",INDEX(Grundkarakterer!AD$8:AD$41,$AE27),\"xx\")","v":0},{"$f":"IF($C64=\"Ja\",INDEX(Grundkarakterer!AE$8:AE$41,$AE27),\"xx\")","v":0},{"$f":"IF($C64=\"Ja\",INDEX(Grundkarakterer!AF$8:AF$41,$AE27),\"xx\")","v":0},{"$f":"IF($C64=\"Ja\",INDEX(Grundkarakterer!AG$8:AG$41,$AE27),\"xx\")","v":0},{"$f":"IF($C64=\"Ja\",INDEX(Grundkarakterer!AH$8:AH$41,$AE27),\"xx\")","v":25},{"$f":"IF($C64=\"Ja\",INDEX(Grundkarakterer!AI$8:AI$41,$AE27),\"xx\")","v":0},{"$f":"IF($C64=\"Ja\",INDEX(Grundkarakterer!M$8:M$41,$AE27),\"xx\")","v":-2082}]
[26,{"$f":"INDEX(Grundkarakterer!A$8:A$41,AE28)","v":26},"Nej",{"$f":"IF(C65=\"Ja\",INDEX(Grundkarakterer!B$8:B$41,AE28),\"xx\")","v":"xx"},{"$f":"IF(C65=\"Ja\",INDEX(Grundkarakterer!C$8:C$41,$AE28),\"xx\")","v":"xx"},{"$f":"IF(C65=\"Ja\",INDEX(Grundkarakterer!D$8:D$41,$AE28),\"xx\")","v":"xx"},{"$f":"IF(C65=\"Ja\",INDEX(Grundkarakterer!#REF!,$AE28),\"xx\")","v":"xx"},{"$f":"IF($C65=\"Ja\",IF($D$9=1,INDEX(Grundkarakterer!E$8:E$41,$AE28),IF(AND($D$9=2,$D$20=1),INDEX(Grundkarakterer!H$8:H$41,$AE28),IF(AND($D$9=2,$D$20<>1),INDEX(Grundkarakterer!F$8:F$41,$AE28),IF(AND($D$9=3,$D$20=1),INDEX(Grundkarakterer!I$8:I$41,$AE28),IF(AND($D$9=3,$D$20<>1),INDEX(Grundkarakterer!G$8:G$41,$AE28),IF($D$9=4,INDEX(Grundkarakterer!J$8:J$41,$AE28),IF($D$9=5,INDEX(Grundkarakterer!K$8:K$41,$AE28),\"Fejl\"))))))),\"xx\")","v":"xx"},{"$f":"IF($C65=\"Ja\",INDEX(Grundkarakterer!L$8:L$41,$AE28),\"xx\")","v":"xx"},{"$f":"IF($C65=\"Ja\",INDEX(Grundkarakterer!N$8:N$41,$AE28),\"xx\")","v":"xx"},{"$f":"IF($C65=\"Ja\",INDEX(Grundkarakterer!O$8:O$41,$AE28),\"xx\")","v":"xx"},{"$f":"IF($C65=\"Ja\",INDEX(Grundkarakterer!P$8:P$41,$AE28),\"xx\")","v":"xx"},{"$f":"IF($C65=\"Ja\",INDEX(Grundkarakterer!Q$8:Q$41,$AE28),\"xx\")","v":"xx"},{"$f":"IF($C65=\"Ja\",INDEX(Grundkarakterer!R$8:R$41,$AE28),\"xx\")","v":"xx"},{"$f":"IF($C65=\"Ja\",INDEX(Grundkarakterer!S$8:S$41,$AE28),\"xx\")","v":"xx"},{"$f":"IF($C65=\"Ja\",INDEX(Grundkarakterer!T$8:T$41,$AE28),\"xx\")","v":"xx"},{"$f":"IF($C65=\"Ja\",INDEX(Grundkarakterer!U$8:U$41,$AE28),\"xx\")","v":"xx"},{"$f":"IF($C65=\"Ja\",INDEX(Grundkarakterer!V$8:V$41,$AE28),\"xx\")","v":"xx"},{"$f":"IF($C65=\"Ja\",INDEX(Grundkarakterer!W$8:W$41,$AE28),\"xx\")","v":"xx"},{"$f":"IF($C65=\"Ja\",INDEX(Grundkarakterer!X$8:X$41,$AE28),\"xx\")","v":"xx"},{"$f":"IF($C65=\"Ja\",INDEX(Grundkarakterer!Y$8:Y$41,$AE28),\"xx\")","v":"xx"},{"$f":"IF($C65=\"Ja\",INDEX(Grundkarakterer!Z$8:Z$41,$AE28),\"xx\")","v":"xx"},{"$f":"IF($C65=\"Ja\",INDEX(Grundkarakterer!AA$8:AA$41,$AE28),\"xx\")","v":"xx"},{"$f":"IF($C65=\"Ja\",INDEX(Grundkarakterer!AB$8:AB$41,$AE28),\"xx\")","v":"xx"},{"$f":"IF($C65=\"Ja\",INDEX(Grundkarakterer!AC$8:AC$41,$AE28),\"xx\")","v":"xx"},{"$f":"IF($C65=\"Ja\",INDEX(Grundkarakterer!AD$8:AD$41,$AE28),\"xx\")","v":"xx"},{"$f":"IF($C65=\"Ja\",INDEX(Grundkarakterer!AE$8:AE$41,$AE28),\"xx\")","v":"xx"},{"$f":"IF($C65=\"Ja\",INDEX(Grundkarakterer!AF$8:AF$41,$AE28),\"xx\")","v":"xx"},{"$f":"IF($C65=\"Ja\",INDEX(Grundkarakterer!AG$8:AG$41,$AE28),\"xx\")","v":"xx"},{"$f":"IF($C65=\"Ja\",INDEX(Grundkarakterer!AH$8:AH$41,$AE28),\"xx\")","v":"xx"},{"$f":"IF($C65=\"Ja\",INDEX(Grundkarakterer!AI$8:AI$41,$AE28),\"xx\")","v":"xx"},{"$f":"IF($C65=\"Ja\",INDEX(Grundkarakterer!M$8:M$41,$AE28),\"xx\")","v":"xx"}]
[27,{"$f":"INDEX(Grundkarakterer!A$8:A$41,AE29)","v":27},"Nej",{"$f":"IF(C66=\"Ja\",INDEX(Grundkarakterer!B$8:B$41,AE29),\"xx\")","v":"xx"},{"$f":"IF(C66=\"Ja\",INDEX(Grundkarakterer!C$8:C$41,$AE29),\"xx\")","v":"xx"},{"$f":"IF(C66=\"Ja\",INDEX(Grundkarakterer!D$8:D$41,$AE29),\"xx\")","v":"xx"},{"$f":"IF(C66=\"Ja\",INDEX(Grundkarakterer!#REF!,$AE29),\"xx\")","v":"xx"},{"$f":"IF($C66=\"Ja\",IF($D$9=1,INDEX(Grundkarakterer!E$8:E$41,$AE29),IF(AND($D$9=2,$D$20=1),INDEX(Grundkarakterer!H$8:H$41,$AE29),IF(AND($D$9=2,$D$20<>1),INDEX(Grundkarakterer!F$8:F$41,$AE29),IF(AND($D$9=3,$D$20=1),INDEX(Grundkarakterer!I$8:I$41,$AE29),IF(AND($D$9=3,$D$20<>1),INDEX(Grundkarakterer!G$8:G$41,$AE29),IF($D$9=4,INDEX(Grundkarakterer!J$8:J$41,$AE29),IF($D$9=5,INDEX(Grundkarakterer!K$8:K$41,$AE29),\"Fejl\"))))))),\"xx\")","v":"xx"},{"$f":"IF($C66=\"Ja\",INDEX(Grundkarakterer!L$8:L$41,$AE29),\"xx\")","v":"xx"},{"$f":"IF($C66=\"Ja\",INDEX(Grundkarakterer!N$8:N$41,$AE29),\"xx\")","v":"xx"},{"$f":"IF($C66=\"Ja\",INDEX(Grundkarakterer!O$8:O$41,$AE29),\"xx\")","v":"xx"},{"$f":"IF($C66=\"Ja\",INDEX(Grundkarakterer!P$8:P$41,$AE29),\"xx\")","v":"xx"},{"$f":"IF($C66=\"Ja\",INDEX(Grundkarakterer!Q$8:Q$41,$AE29),\"xx\")","v":"xx"},{"$f":"IF($C66=\"Ja\",INDEX(Grundkarakterer!R$8:R$41,$AE29),\"xx\")","v":"xx"},{"$f":"IF($C66=\"Ja\",INDEX(Grundkarakterer!S$8:S$41,$AE29),\"xx\")","v":"xx"},{"$f":"IF($C66=\"Ja\",INDEX(Grundkarakterer!T$8:T$41,$AE29),\"xx\")","v":"xx"},{"$f":"IF($C66=\"Ja\",INDEX(Grundkarakterer!U$8:U$41,$AE29),\"xx\")","v":"xx"},{"$f":"IF($C66=\"Ja\",INDEX(Grundkarakterer!V$8:V$41,$AE29),\"xx\")","v":"xx"},{"$f":"IF($C66=\"Ja\",INDEX(Grundkarakterer!W$8:W$41,$AE29),\"xx\")","v":"xx"},{"$f":"IF($C66=\"Ja\",INDEX(Grundkarakterer!X$8:X$41,$AE29),\"xx\")","v":"xx"},{"$f":"IF($C66=\"Ja\",INDEX(Grundkarakterer!Y$8:Y$41,$AE29),\"xx\")","v":"xx"},{"$f":"IF($C66=\"Ja\",INDEX(Grundkarakterer!Z$8:Z$41,$AE29),\"xx\")","v":"xx"},{"$f":"IF($C66=\"Ja\",INDEX(Grundkarakterer!AA$8:AA$41,$AE29),\"xx\")","v":"xx"},{"$f":"IF($C66=\"Ja\",INDEX(Grundkarakterer!AB$8:AB$41,$AE29),\"xx\")","v":"xx"},{"$f":"IF($C66=\"Ja\",INDEX(Grundkarakterer!AC$8:AC$41,$AE29),\"xx\")","v":"xx"},{"$f":"IF($C66=\"Ja\",INDEX(Grundkarakterer!AD$8:AD$41,$AE29),\"xx\")","v":"xx"},{"$f":"IF($C66=\"Ja\",INDEX(Grundkarakterer!AE$8:AE$41,$AE29),\"xx\")","v":"xx"},{"$f":"IF($C66=\"Ja\",INDEX(Grundkarakterer!AF$8:AF$41,$AE29),\"xx\")","v":"xx"},{"$f":"IF($C66=\"Ja\",INDEX(Grundkarakterer!AG$8:AG$41,$AE29),\"xx\")","v":"xx"},{"$f":"IF($C66=\"Ja\",INDEX(Grundkarakterer!AH$8:AH$41,$AE29),\"xx\")","v":"xx"},{"$f":"IF($C66=\"Ja\",INDEX(Grundkarakterer!AI$8:AI$41,$AE29),\"xx\")","v":"xx"},{"$f":"IF($C66=\"Ja\",INDEX(Grundkarakterer!M$8:M$41,$AE29),\"xx\")","v":"xx"}]
[28,{"$f":"INDEX(Grundkarakterer!A$8:A$41,AE30)","v":28},"Nej",{"$f":"IF(C67=\"Ja\",INDEX(Grundkarakterer!B$8:B$41,AE30),\"xx\")","v":"xx"},{"$f":"IF(C67=\"Ja\",INDEX(Grundkarakterer!C$8:C$41,$AE30),\"xx\")","v":"xx"},{"$f":"IF(C67=\"Ja\",INDEX(Grundkarakterer!D$8:D$41,$AE30),\"xx\")","v":"xx"},{"$f":"IF(C67=\"Ja\",INDEX(Grundkarakterer!#REF!,$AE30),\"xx\")","v":"xx"},{"$f":"IF($C67=\"Ja\",IF($D$9=1,INDEX(Grundkarakterer!E$8:E$41,$AE30),IF(AND($D$9=2,$D$20=1),INDEX(Grundkarakterer!H$8:H$41,$AE30),IF(AND($D$9=2,$D$20<>1),INDEX(Grundkarakterer!F$8:F$41,$AE30),IF(AND($D$9=3,$D$20=1),INDEX(Grundkarakterer!I$8:I$41,$AE30),IF(AND($D$9=3,$D$20<>1),INDEX(Grundkarakterer!G$8:G$41,$AE30),IF($D$9=4,INDEX(Grundkarakterer!J$8:J$41,$AE30),IF($D$9=5,INDEX(Grundkarakterer!K$8:K$41,$AE30),\"Fejl\"))))))),\"xx\")","v":"xx"},{"$f":"IF($C67=\"Ja\",INDEX(Grundkarakterer!L$8:L$41,$AE30),\"xx\")","v":"xx"},{"$f":"IF($C67=\"Ja\",INDEX(Grundkarakterer!N$8:N$41,$AE30),\"xx\")","v":"xx"},{"$f":"IF($C67=\"Ja\",INDEX(Grundkarakterer!O$8:O$41,$AE30),\"xx\")","v":"xx"},{"$f":"IF($C67=\"Ja\",INDEX(Grundkarakterer!P$8:P$41,$AE30),\"xx\")","v":"xx"},{"$f":"IF($C67=\"Ja\",INDEX(Grundkarakterer!Q$8:Q$41,$AE30),\"xx\")","v":"xx"},{"$f":"IF($C67=\"Ja\",INDEX(Grundkarakterer!R$8:R$41,$AE30),\"xx\")","v":"xx"},{"$f":"IF($C67=\"Ja\",INDEX(Grundkarakterer!S$8:S$41,$AE30),\"xx\")","v":"xx"},{"$f":"IF($C67=\"Ja\",INDEX(Grundkarakterer!T$8:T$41,$AE30),\"xx\")","v":"xx"},{"$f":"IF($C67=\"Ja\",INDEX(Grundkarakterer!U$8:U$41,$AE30),\"xx\")","v":"xx"},{"$f":"IF($C67=\"Ja\",INDEX(Grundkarakterer!V$8:V$41,$AE30),\"xx\")","v":"xx"},{"$f":"IF($C67=\"Ja\",INDEX(Grundkarakterer!W$8:W$41,$AE30),\"xx\")","v":"xx"},{"$f":"IF($C67=\"Ja\",INDEX(Grundkarakterer!X$8:X$41,$AE30),\"xx\")","v":"xx"},{"$f":"IF($C67=\"Ja\",INDEX(Grundkarakterer!Y$8:Y$41,$AE30),\"xx\")","v":"xx"},{"$f":"IF($C67=\"Ja\",INDEX(Grundkarakterer!Z$8:Z$41,$AE30),\"xx\")","v":"xx"},{"$f":"IF($C67=\"Ja\",INDEX(Grundkarakterer!AA$8:AA$41,$AE30),\"xx\")","v":"xx"},{"$f":"IF($C67=\"Ja\",INDEX(Grundkarakterer!AB$8:AB$41,$AE30),\"xx\")","v":"xx"},{"$f":"IF($C67=\"Ja\",INDEX(Grundkarakterer!AC$8:AC$41,$AE30),\"xx\")","v":"xx"},{"$f":"IF($C67=\"Ja\",INDEX(Grundkarakterer!AD$8:AD$41,$AE30),\"xx\")","v":"xx"},{"$f":"IF($C67=\"Ja\",INDEX(Grundkarakterer!AE$8:AE$41,$AE30),\"xx\")","v":"xx"},{"$f":"IF($C67=\"Ja\",INDEX(Grundkarakterer!AF$8:AF$41,$AE30),\"xx\")","v":"xx"},{"$f":"IF($C67=\"Ja\",INDEX(Grundkarakterer!AG$8:AG$41,$AE30),\"xx\")","v":"xx"},{"$f":"IF($C67=\"Ja\",INDEX(Grundkarakterer!AH$8:AH$41,$AE30),\"xx\")","v":"xx"},{"$f":"IF($C67=\"Ja\",INDEX(Grundkarakterer!AI$8:AI$41,$AE30),\"xx\")","v":"xx"},{"$f":"IF($C67=\"Ja\",INDEX(Grundkarakterer!M$8:M$41,$AE30),\"xx\")","v":"xx"}]
[29,{"$f":"INDEX(Grundkarakterer!A$8:A$41,AE31)","v":29},"Nej",{"$f":"IF(C68=\"Ja\",INDEX(Grundkarakterer!B$8:B$41,AE31),\"xx\")","v":"xx"},{"$f":"IF(C68=\"Ja\",INDEX(Grundkarakterer!C$8:C$41,$AE31),\"xx\")","v":"xx"},{"$f":"IF(C68=\"Ja\",INDEX(Grundkarakterer!D$8:D$41,$AE31),\"xx\")","v":"xx"},{"$f":"IF(C68=\"Ja\",INDEX(Grundkarakterer!#REF!,$AE31),\"xx\")","v":"xx"},{"$f":"IF($C68=\"Ja\",IF($D$9=1,INDEX(Grundkarakterer!E$8:E$41,$AE31),IF(AND($D$9=2,$D$20=1),INDEX(Grundkarakterer!H$8:H$41,$AE31),IF(AND($D$9=2,$D$20<>1),INDEX(Grundkarakterer!F$8:F$41,$AE31),IF(AND($D$9=3,$D$20=1),INDEX(Grundkarakterer!I$8:I$41,$AE31),IF(AND($D$9=3,$D$20<>1),INDEX(Grundkarakterer!G$8:G$41,$AE31),IF($D$9=4,INDEX(Grundkarakterer!J$8:J$41,$AE31),IF($D$9=5,INDEX(Grundkarakterer!K$8:K$41,$AE31),\"Fejl\"))))))),\"xx\")","v":"xx"},{"$f":"IF($C68=\"Ja\",INDEX(Grundkarakterer!L$8:L$41,$AE31),\"xx\")","v":"xx"},{"$f":"IF($C68=\"Ja\",INDEX(Grundkarakterer!N$8:N$41,$AE31),\"xx\")","v":"xx"},{"$f":"IF($C68=\"Ja\",INDEX(Grundkarakterer!O$8:O$41,$AE31),\"xx\")","v":"xx"},{"$f":"IF($C68=\"Ja\",INDEX(Grundkarakterer!P$8:P$41,$AE31),\"xx\")","v":"xx"},{"$f":"IF($C68=\"Ja\",INDEX(Grundkarakterer!Q$8:Q$41,$AE31),\"xx\")","v":"xx"},{"$f":"IF($C68=\"Ja\",INDEX(Grundkarakterer!R$8:R$41,$AE31),\"xx\")","v":"xx"},{"$f":"IF($C68=\"Ja\",INDEX(Grundkarakterer!S$8:S$41,$AE31),\"xx\")","v":"xx"},{"$f":"IF($C68=\"Ja\",INDEX(Grundkarakterer!T$8:T$41,$AE31),\"xx\")","v":"xx"},{"$f":"IF($C68=\"Ja\",INDEX(Grundkarakterer!U$8:U$41,$AE31),\"xx\")","v":"xx"},{"$f":"IF($C68=\"Ja\",INDEX(Grundkarakterer!V$8:V$41,$AE31),\"xx\")","v":"xx"},{"$f":"IF($C68=\"Ja\",INDEX(Grundkarakterer!W$8:W$41,$AE31),\"xx\")","v":"xx"},{"$f":"IF($C68=\"Ja\",INDEX(Grundkarakterer!X$8:X$41,$AE31),\"xx\")","v":"xx"},{"$f":"IF($C68=\"Ja\",INDEX(Grundkarakterer!Y$8:Y$41,$AE31),\"xx\")","v":"xx"},{"$f":"IF($C68=\"Ja\",INDEX(Grundkarakterer!Z$8:Z$41,$AE31),\"xx\")","v":"xx"},{"$f":"IF($C68=\"Ja\",INDEX(Grundkarakterer!AA$8:AA$41,$AE31),\"xx\")","v":"xx"},{"$f":"IF($C68=\"Ja\",INDEX(Grundkarakterer!AB$8:AB$41,$AE31),\"xx\")","v":"xx"},{"$f":"IF($C68=\"Ja\",INDEX(Grundkarakterer!AC$8:AC$41,$AE31),\"xx\")","v":"xx"},{"$f":"IF($C68=\"Ja\",INDEX(Grundkarakterer!AD$8:AD$41,$AE31),\"xx\")","v":"xx"},{"$f":"IF($C68=\"Ja\",INDEX(Grundkarakterer!AE$8:AE$41,$AE31),\"xx\")","v":"xx"},{"$f":"IF($C68=\"Ja\",INDEX(Grundkarakterer!AF$8:AF$41,$AE31),\"xx\")","v":"xx"},{"$f":"IF($C68=\"Ja\",INDEX(Grundkarakterer!AG$8:AG$41,$AE31),\"xx\")","v":"xx"},{"$f":"IF($C68=\"Ja\",INDEX(Grundkarakterer!AH$8:AH$41,$AE31),\"xx\")","v":"xx"},{"$f":"IF($C68=\"Ja\",INDEX(Grundkarakterer!AI$8:AI$41,$AE31),\"xx\")","v":"xx"},{"$f":"IF($C68=\"Ja\",INDEX(Grundkarakterer!M$8:M$41,$AE31),\"xx\")","v":"xx"}]
[30,{"$f":"INDEX(Grundkarakterer!A$8:A$41,AE32)","v":30},"Ja",{"$f":"IF(C69=\"Ja\",INDEX(Grundkarakterer!B$8:B$41,AE32),\"xx\")","v":"Olieræddike og vintervikke"},{"$f":"IF(C69=\"Ja\",INDEX(Grundkarakterer!C$8:C$41,$AE32),\"xx\")","v":"1. Vintersæd"},{"$f":"IF(C69=\"Ja\",INDEX(Grundkarakterer!D$8:D$41,$AE32),\"xx\")","v":"1. Ved etablering af primærafgrøde"},{"$f":"IF(C69=\"Ja\",INDEX(Grundkarakterer!#REF!,$AE32),\"xx\")","v":{"$error":"#REF!"}},{"$f":"IF($C69=\"Ja\",IF($D$9=1,INDEX(Grundkarakterer!E$8:E$41,$AE32),IF(AND($D$9=2,$D$20=1),INDEX(Grundkarakterer!H$8:H$41,$AE32),IF(AND($D$9=2,$D$20<>1),INDEX(Grundkarakterer!F$8:F$41,$AE32),IF(AND($D$9=3,$D$20=1),INDEX(Grundkarakterer!I$8:I$41,$AE32),IF(AND($D$9=3,$D$20<>1),INDEX(Grundkarakterer!G$8:G$41,$AE32),IF($D$9=4,INDEX(Grundkarakterer!J$8:J$41,$AE32),IF($D$9=5,INDEX(Grundkarakterer!K$8:K$41,$AE32),\"Fejl\"))))))),\"xx\")","v":"20. august"},{"$f":"IF($C69=\"Ja\",INDEX(Grundkarakterer!L$8:L$41,$AE32),\"xx\")","v":-828},{"$f":"IF($C69=\"Ja\",INDEX(Grundkarakterer!N$8:N$41,$AE32),\"xx\")","v":1},{"$f":"IF($C69=\"Ja\",INDEX(Grundkarakterer!O$8:O$41,$AE32),\"xx\")","v":0},{"$f":"IF($C69=\"Ja\",INDEX(Grundkarakterer!P$8:P$41,$AE32),\"xx\")","v":0},{"$f":"IF($C69=\"Ja\",INDEX(Grundkarakterer!Q$8:Q$41,$AE32),\"xx\")","v":0},{"$f":"IF($C69=\"Ja\",INDEX(Grundkarakterer!R$8:R$41,$AE32),\"xx\")","v":1},{"$f":"IF($C69=\"Ja\",INDEX(Grundkarakterer!S$8:S$41,$AE32),\"xx\")","v":1},{"$f":"IF($C69=\"Ja\",INDEX(Grundkarakterer!T$8:T$41,$AE32),\"xx\")","v":1},{"$f":"IF($C69=\"Ja\",INDEX(Grundkarakterer!U$8:U$41,$AE32),\"xx\")","v":0},{"$f":"IF($C69=\"Ja\",INDEX(Grundkarakterer!V$8:V$41,$AE32),\"xx\")","v":0},{"$f":"IF($C69=\"Ja\",INDEX(Grundkarakterer!W$8:W$41,$AE32),\"xx\")","v":0},{"$f":"IF($C69=\"Ja\",INDEX(Grundkarakterer!X$8:X$41,$AE32),\"xx\")","v":3},{"$f":"IF($C69=\"Ja\",INDEX(Grundkarakterer!Y$8:Y$41,$AE32),\"xx\")","v":1},{"$f":"IF($C69=\"Ja\",INDEX(Grundkarakterer!Z$8:Z$41,$AE32),\"xx\")","v":3},{"$f":"IF($C69=\"Ja\",INDEX(Grundkarakterer!AA$8:AA$41,$AE32),\"xx\")","v":3},{"$f":"IF($C69=\"Ja\",INDEX(Grundkarakterer!AB$8:AB$41,$AE32),\"xx\")","v":3},{"$f":"IF($C69=\"Ja\",INDEX(Grundkarakterer!AC$8:AC$41,$AE32),\"xx\")","v":2},{"$f":"IF($C69=\"Ja\",INDEX(Grundkarakterer!AD$8:AD$41,$AE32),\"xx\")","v":0},{"$f":"IF($C69=\"Ja\",INDEX(Grundkarakterer!AE$8:AE$41,$AE32),\"xx\")","v":0},{"$f":"IF($C69=\"Ja\",INDEX(Grundkarakterer!AF$8:AF$41,$AE32),\"xx\")","v":0},{"$f":"IF($C69=\"Ja\",INDEX(Grundkarakterer!AG$8:AG$41,$AE32),\"xx\")","v":0},{"$f":"IF($C69=\"Ja\",INDEX(Grundkarakterer!AH$8:AH$41,$AE32),\"xx\")","v":30},{"$f":"IF($C69=\"Ja\",INDEX(Grundkarakterer!AI$8:AI$41,$AE32),\"xx\")","v":0},{"$f":"IF($C69=\"Ja\",INDEX(Grundkarakterer!M$8:M$41,$AE32),\"xx\")","v":52}]
[31,{"$f":"INDEX(Grundkarakterer!A$8:A$41,AE33)","v":31},"Ja",{"$f":"IF(C70=\"Ja\",INDEX(Grundkarakterer!B$8:B$41,AE33),\"xx\")","v":"Hvidkløver/alm. rajgræs"},{"$f":"IF(C70=\"Ja\",INDEX(Grundkarakterer!C$8:C$41,$AE33),\"xx\")","v":"1. Vintersæd"},{"$f":"IF(C70=\"Ja\",INDEX(Grundkarakterer!D$8:D$41,$AE33),\"xx\")","v":"1. Ved etablering af primærafgrøde"},{"$f":"IF(C70=\"Ja\",INDEX(Grundkarakterer!#REF!,$AE33),\"xx\")","v":{"$error":"#REF!"}},{"$f":"IF($C70=\"Ja\",IF($D$9=1,INDEX(Grundkarakterer!E$8:E$41,$AE33),IF(AND($D$9=2,$D$20=1),INDEX(Grundkarakterer!H$8:H$41,$AE33),IF(AND($D$9=2,$D$20<>1),INDEX(Grundkarakterer!F$8:F$41,$AE33),IF(AND($D$9=3,$D$20=1),INDEX(Grundkarakterer!I$8:I$41,$AE33),IF(AND($D$9=3,$D$20<>1),INDEX(Grundkarakterer!G$8:G$41,$AE33),IF($D$9=4,INDEX(Grundkarakterer!J$8:J$41,$AE33),IF($D$9=5,INDEX(Grundkarakterer!K$8:K$41,$AE33),\"Fejl\"))))))),\"xx\")","v":"1. august"},{"$f":"IF($C70=\"Ja\",INDEX(Grundkarakterer!L$8:L$41,$AE33),\"xx\")","v":-185},{"$f":"IF($C70=\"Ja\",INDEX(Grundkarakterer!N$8:N$41,$AE33),\"xx\")","v":1},{"$f":"IF($C70=\"Ja\",INDEX(Grundkarakterer!O$8:O$41,$AE33),\"xx\")","v":0},{"$f":"IF($C70=\"Ja\",INDEX(Grundkarakterer!P$8:P$41,$AE33),\"xx\")","v":0},{"$f":"IF($C70=\"Ja\",INDEX(Grundkarakterer!Q$8:Q$41,$AE33),\"xx\")","v":1},{"$f":"IF($C70=\"Ja\",INDEX(Grundkarakterer!R$8:R$41,$AE33),\"xx\")","v":1},{"$f":"IF($C70=\"Ja\",INDEX(Grundkarakterer!S$8:S$41,$AE33),\"xx\")","v":1},{"$f":"IF($C70=\"Ja\",INDEX(Grundkarakterer!T$8:T$41,$AE33),\"xx\")","v":1},{"$f":"IF($C70=\"Ja\",INDEX(Grundkarakterer!U$8:U$41,$AE33),\"xx\")","v":0},{"$f":"IF($C70=\"Ja\",INDEX(Grundkarakterer!V$8:V$41,$AE33),\"xx\")","v":3},{"$f":"IF($C70=\"Ja\",INDEX(Grundkarakterer!W$8:W$41,$AE33),\"xx\")","v":3},{"$f":"IF($C70=\"Ja\",INDEX(Grundkarakterer!X$8:X$41,$AE33),\"xx\")","v":2},{"$f":"IF($C70=\"Ja\",INDEX(Grundkarakterer!Y$8:Y$41,$AE33),\"xx\")","v":1},{"$f":"IF($C70=\"Ja\",INDEX(Grundkarakterer!Z$8:Z$41,$AE33),\"xx\")","v":3},{"$f":"IF($C70=\"Ja\",INDEX(Grundkarakterer!AA$8:AA$41,$AE33),\"xx\")","v":0},{"$f":"IF($C70=\"Ja\",INDEX(Grundkarakterer!AB$8:AB$41,$AE33),\"xx\")","v":1},{"$f":"IF($C70=\"Ja\",INDEX(Grundkarakterer!AC$8:AC$41,$AE33),\"xx\")","v":3},{"$f":"IF($C70=\"Ja\",INDEX(Grundkarakterer!AD$8:AD$41,$AE33),\"xx\")","v":0},{"$f":"IF($C70=\"Ja\",INDEX(Grundkarakterer!AE$8:AE$41,$AE33),\"xx\")","v":0},{"$f":"IF($C70=\"Ja\",INDEX(Grundkarakterer!AF$8:AF$41,$AE33),\"xx\")","v":3},{"$f":"IF($C70=\"Ja\",INDEX(Grundkarakterer!AG$8:AG$41,$AE33),\"xx\")","v":0},{"$f":"IF($C70=\"Ja\",INDEX(Grundkarakterer!AH$8:AH$41,$AE33),\"xx\")","v":31},{"$f":"IF($C70=\"Ja\",INDEX(Grundkarakterer!AI$8:AI$41,$AE33),\"xx\")","v":0},{"$f":"IF($C70=\"Ja\",INDEX(Grundkarakterer!M$8:M$41,$AE33),\"xx\")","v":"-"}]
[32,{"$f":"INDEX(Grundkarakterer!A$8:A$41,AE34)","v":32},"Ja",{"$f":"IF(C71=\"Ja\",INDEX(Grundkarakterer!B$8:B$41,AE34),\"xx\")","v":"Rødkløver/strandsvingel"},{"$f":"IF(C71=\"Ja\",INDEX(Grundkarakterer!C$8:C$41,$AE34),\"xx\")","v":"1. Vintersæd"},{"$f":"IF(C71=\"Ja\",INDEX(Grundkarakterer!D$8:D$41,$AE34),\"xx\")","v":"1. Ved etablering af primærafgrøde"},{"$f":"IF(C71=\"Ja\",INDEX(Grundkarakterer!#REF!,$AE34),\"xx\")","v":{"$error":"#REF!"}},{"$f":"IF($C71=\"Ja\",IF($D$9=1,INDEX(Grundkarakterer!E$8:E$41,$AE34),IF(AND($D$9=2,$D$20=1),INDEX(Grundkarakterer!H$8:H$41,$AE34),IF(AND($D$9=2,$D$20<>1),INDEX(Grundkarakterer!F$8:F$41,$AE34),IF(AND($D$9=3,$D$20=1),INDEX(Grundkarakterer!I$8:I$41,$AE34),IF(AND($D$9=3,$D$20<>1),INDEX(Grundkarakterer!G$8:G$41,$AE34),IF($D$9=4,INDEX(Grundkarakterer!J$8:J$41,$AE34),IF($D$9=5,INDEX(Grundkarakterer!K$8:K$41,$AE34),\"Fejl\"))))))),\"xx\")","v":"1. august"},{"$f":"IF($C71=\"Ja\",INDEX(Grundkarakterer!L$8:L$41,$AE34),\"xx\")","v":-1355},{"$f":"IF($C71=\"Ja\",INDEX(Grundkarakterer!N$8:N$41,$AE34),\"xx\")","v":1},{"$f":"IF($C71=\"Ja\",INDEX(Grundkarakterer!O$8:O$41,$AE34),\"xx\")","v":0},{"$f":"IF($C71=\"Ja\",INDEX(Grundkarakterer!P$8:P$41,$AE34),\"xx\")","v":0},{"$f":"IF($C71=\"Ja\",INDEX(Grundkarakterer!Q$8:Q$41,$AE34),\"xx\")","v":1},{"$f":"IF($C71=\"Ja\",INDEX(Grundkarakterer!R$8:R$41,$AE34),\"xx\")","v":1},{"$f":"IF($C71=\"Ja\",INDEX(Grundkarakterer!S$8:S$41,$AE34),\"xx\")","v":1},{"$f":"IF($C71=\"Ja\",INDEX(Grundkarakterer!T$8:T$41,$AE34),\"xx\")","v":1},{"$f":"IF($C71=\"Ja\",INDEX(Grundkarakterer!U$8:U$41,$AE34),\"xx\")","v":0},{"$f":"IF($C71=\"Ja\",INDEX(Grundkarakterer!V$8:V$41,$AE34),\"xx\")","v":1},{"$f":"IF($C71=\"Ja\",INDEX(Grundkarakterer!W$8:W$41,$AE34),\"xx\")","v":3},{"$f":"IF($C71=\"Ja\",INDEX(Grundkarakterer!X$8:X$41,$AE34),\"xx\")","v":1},{"$f":"IF($C71=\"Ja\",INDEX(Grundkarakterer!Y$8:Y$41,$AE34),\"xx\")","v":1},{"$f":"IF($C71=\"Ja\",INDEX(Grundkarakterer!Z$8:Z$41,$AE34),\"xx\")","v":3},{"$f":"IF($C71=\"Ja\",INDEX(Grundkarakterer!AA$8:AA$41,$AE34),\"xx\")","v":0},{"$f":"IF($C71=\"Ja\",INDEX(Grundkarakterer!AB$8:AB$41,$AE34),\"xx\")","v":1},{"$f":"IF($C71=\"Ja\",INDEX(Grundkarakterer!AC$8:AC$41,$AE34),\"xx\")","v":3},{"$f":"IF($C71=\"Ja\",INDEX(Grundkarakterer!AD$8:AD$41,$AE34),\"xx\")","v":0},{"$f":"IF($C71=\"Ja\",INDEX(Grundkarakterer!AE$8:AE$41,$AE34),\"xx\")","v":0},{"$f":"IF($C71=\"Ja\",INDEX(Grundkarakterer!AF$8:AF$41,$AE34),\"xx\")","v":3},{"$f":"IF($C71=\"Ja\",INDEX(Grundkarakterer!AG$8:AG$41,$AE34),\"xx\")","v":0},{"$f":"IF($C71=\"Ja\",INDEX(Grundkarakterer!AH$8:AH$41,$AE34),\"xx\")","v":32},{"$f":"IF($C71=\"Ja\",INDEX(Grundkarakterer!AI$8:AI$41,$AE34),\"xx\")","v":0},{"$f":"IF($C71=\"Ja\",INDEX(Grundkarakterer!M$8:M$41,$AE34),\"xx\")","v":"-"}]
[33,{"$f":"INDEX(Grundkarakterer!A$8:A$41,AE35)","v":33},"Ja",{"$f":"IF(C72=\"Ja\",INDEX(Grundkarakterer!B$8:B$41,AE35),\"xx\")","v":"Vintervikke/vinterrug"},{"$f":"IF(C72=\"Ja\",INDEX(Grundkarakterer!C$8:C$41,$AE35),\"xx\")","v":"1. Vintersæd"},{"$f":"IF(C72=\"Ja\",INDEX(Grundkarakterer!D$8:D$41,$AE35),\"xx\")","v":"1. Ved etablering af primærafgrøde"},{"$f":"IF(C72=\"Ja\",INDEX(Grundkarakterer!#REF!,$AE35),\"xx\")","v":{"$error":"#REF!"}},{"$f":"IF($C72=\"Ja\",IF($D$9=1,INDEX(Grundkarakterer!E$8:E$41,$AE35),IF(AND($D$9=2,$D$20=1),INDEX(Grundkarakterer!H$8:H$41,$AE35),IF(AND($D$9=2,$D$20<>1),INDEX(Grundkarakterer!F$8:F$41,$AE35),IF(AND($D$9=3,$D$20=1),INDEX(Grundkarakterer!I$8:I$41,$AE35),IF(AND($D$9=3,$D$20<>1),INDEX(Grundkarakterer!G$8:G$41,$AE35),IF($D$9=4,INDEX(Grundkarakterer!J$8:J$41,$AE35),IF($D$9=5,INDEX(Grundkarakterer!K$8:K$41,$AE35),\"Fejl\"))))))),\"xx\")","v":"20. august"},{"$f":"IF($C72=\"Ja\",INDEX(Grundkarakterer!L$8:L$41,$AE35),\"xx\")","v":-969},{"$f":"IF($C72=\"Ja\",INDEX(Grundkarakterer!N$8:N$41,$AE35),\"xx\")","v":1},{"$f":"IF($C72=\"Ja\",INDEX(Grundkarakterer!O$8:O$41,$AE35),\"xx\")","v":0},{"$f":"IF($C72=\"Ja\",INDEX(Grundkarakterer!P$8:P$41,$AE35),\"xx\")","v":0},{"$f":"IF($C72=\"Ja\",INDEX(Grundkarakterer!Q$8:Q$41,$AE35),\"xx\")","v":1},{"$f":"IF($C72=\"Ja\",INDEX(Grundkarakterer!R$8:R$41,$AE35),\"xx\")","v":1},{"$f":"IF($C72=\"Ja\",INDEX(Grundkarakterer!S$8:S$41,$AE35),\"xx\")","v":1},{"$f":"IF($C72=\"Ja\",INDEX(Grundkarakterer!T$8:T$41,$AE35),\"xx\")","v":1},{"$f":"IF($C72=\"Ja\",INDEX(Grundkarakterer!U$8:U$41,$AE35),\"xx\")","v":0},{"$f":"IF($C72=\"Ja\",INDEX(Grundkarakterer!V$8:V$41,$AE35),\"xx\")","v":0},{"$f":"IF($C72=\"Ja\",INDEX(Grundkarakterer!W$8:W$41,$AE35),\"xx\")","v":0},{"$f":"IF($C72=\"Ja\",INDEX(Grundkarakterer!X$8:X$41,$AE35),\"xx\")","v":3},{"$f":"IF($C72=\"Ja\",INDEX(Grundkarakterer!Y$8:Y$41,$AE35),\"xx\")","v":1},{"$f":"IF($C72=\"Ja\",INDEX(Grundkarakterer!Z$8:Z$41,$AE35),\"xx\")","v":3},{"$f":"IF($C72=\"Ja\",INDEX(Grundkarakterer!AA$8:AA$41,$AE35),\"xx\")","v":0},{"$f":"IF($C72=\"Ja\",INDEX(Grundkarakterer!AB$8:AB$41,$AE35),\"xx\")","v":3},{"$f":"IF($C72=\"Ja\",INDEX(Grundkarakterer!AC$8:AC$41,$AE35),\"xx\")","v":3},{"$f":"IF($C72=\"Ja\",INDEX(Grundkarakterer!AD$8:AD$41,$AE35),\"xx\")","v":0},{"$f":"IF($C72=\"Ja\",INDEX(Grundkarakterer!AE$8:AE$41,$AE35),\"xx\")","v":0},{"$f":"IF($C72=\"Ja\",INDEX(Grundkarakterer!AF$8:AF$41,$AE35),\"xx\")","v":3},{"$f":"IF($C72=\"Ja\",INDEX(Grundkarakterer!AG$8:AG$41,$AE35),\"xx\")","v":0},{"$f":"IF($C72=\"Ja\",INDEX(Grundkarakterer!AH$8:AH$41,$AE35),\"xx\")","v":33},{"$f":"IF($C72=\"Ja\",INDEX(Grundkarakterer!AI$8:AI$41,$AE35),\"xx\")","v":0},{"$f":"IF($C72=\"Ja\",INDEX(Grundkarakterer!M$8:M$41,$AE35),\"xx\")","v":-529}]
[34,{"$f":"INDEX(Grundkarakterer!A$8:A$41,AE36)","v":34},"Ja",{"$f":"IF(C73=\"Ja\",INDEX(Grundkarakterer!B$8:B$41,AE36),\"xx\")","v":"Kløvergræs (blanding)"},{"$f":"IF(C73=\"Ja\",INDEX(Grundkarakterer!C$8:C$41,$AE36),\"xx\")","v":"1. Vintersæd"},{"$f":"IF(C73=\"Ja\",INDEX(Grundkarakterer!D$8:D$41,$AE36),\"xx\")","v":"1. Ved etablering af primærafgrøde"},{"$f":"IF(C73=\"Ja\",INDEX(Grundkarakterer!#REF!,$AE36),\"xx\")","v":{"$error":"#REF!"}},{"$f":"IF($C73=\"Ja\",IF($D$9=1,INDEX(Grundkarakterer!E$8:E$41,$AE36),IF(AND($D$9=2,$D$20=1),INDEX(Grundkarakterer!H$8:H$41,$AE36),IF(AND($D$9=2,$D$20<>1),INDEX(Grundkarakterer!F$8:F$41,$AE36),IF(AND($D$9=3,$D$20=1),INDEX(Grundkarakterer!I$8:I$41,$AE36),IF(AND($D$9=3,$D$20<>1),INDEX(Grundkarakterer!G$8:G$41,$AE36),IF($D$9=4,INDEX(Grundkarakterer!J$8:J$41,$AE36),IF($D$9=5,INDEX(Grundkarakterer!K$8:K$41,$AE36),\"Fejl\"))))))),\"xx\")","v":"1. august"},{"$f":"IF($C73=\"Ja\",INDEX(Grundkarakterer!L$8:L$41,$AE36),\"xx\")","v":-2145},{"$f":"IF($C73=\"Ja\",INDEX(Grundkarakterer!N$8:N$41,$AE36),\"xx\")","v":1},{"$f":"IF($C73=\"Ja\",INDEX(Grundkarakterer!O$8:O$41,$AE36),\"xx\")","v":0},{"$f":"IF($C73=\"Ja\",INDEX(Grundkarakterer!P$8:P$41,$AE36),\"xx\")","v":0},{"$f":"IF($C73=\"Ja\",INDEX(Grundkarakterer!Q$8:Q$41,$AE36),\"xx\")","v":1},{"$f":"IF($C73=\"Ja\",INDEX(Grundkarakterer!R$8:R$41,$AE36),\"xx\")","v":1},{"$f":"IF($C73=\"Ja\",INDEX(Grundkarakterer!S$8:S$41,$AE36),\"xx\")","v":1},{"$f":"IF($C73=\"Ja\",INDEX(Grundkarakterer!T$8:T$41,$AE36),\"xx\")","v":1},{"$f":"IF($C73=\"Ja\",INDEX(Grundkarakterer!U$8:U$41,$AE36),\"xx\")","v":0},{"$f":"IF($C73=\"Ja\",INDEX(Grundkarakterer!V$8:V$41,$AE36),\"xx\")","v":3},{"$f":"IF($C73=\"Ja\",INDEX(Grundkarakterer!W$8:W$41,$AE36),\"xx\")","v":3},{"$f":"IF($C73=\"Ja\",INDEX(Grundkarakterer!X$8:X$41,$AE36),\"xx\")","v":3},{"$f":"IF($C73=\"Ja\",INDEX(Grundkarakterer!Y$8:Y$41,$AE36),\"xx\")","v":1},{"$f":"IF($C73=\"Ja\",INDEX(Grundkarakterer!Z$8:Z$41,$AE36),\"xx\")","v":3},{"$f":"IF($C73=\"Ja\",INDEX(Grundkarakterer!AA$8:AA$41,$AE36),\"xx\")","v":0},{"$f":"IF($C73=\"Ja\",INDEX(Grundkarakterer!AB$8:AB$41,$AE36),\"xx\")","v":1},{"$f":"IF($C73=\"Ja\",INDEX(Grundkarakterer!AC$8:AC$41,$AE36),\"xx\")","v":3},{"$f":"IF($C73=\"Ja\",INDEX(Grundkarakterer!AD$8:AD$41,$AE36),\"xx\")","v":0},{"$f":"IF($C73=\"Ja\",INDEX(Grundkarakterer!AE$8:AE$41,$AE36),\"xx\")","v":0},{"$f":"IF($C73=\"Ja\",INDEX(Grundkarakterer!AF$8:AF$41,$AE36),\"xx\")","v":3},{"$f":"IF($C73=\"Ja\",INDEX(Grundkarakterer!AG$8:AG$41,$AE36),\"xx\")","v":0},{"$f":"IF($C73=\"Ja\",INDEX(Grundkarakterer!AH$8:AH$41,$AE36),\"xx\")","v":34},{"$f":"IF($C73=\"Ja\",INDEX(Grundkarakterer!AI$8:AI$41,$AE36),\"xx\")","v":0},{"$f":"IF($C73=\"Ja\",INDEX(Grundkarakterer!M$8:M$41,$AE36),\"xx\")","v":"-"}]

{"sheet":"Grundkarakterer","index":5,"n_rows":41,"n_cols":34,"rows_kept":41,"cut":false,"hidden":true,"merged":[]}
["Såtidspunkt",null,"1=sammen med"]
[null,null,"2=før høst"]
[null,null,"3=efter høst"]
[]
[]
[null,null,null,null,"Seneste såtidspunkt Pligtige efterafgrøder","Seneste såtidspunkt Pligtige efterafgrøder og MFO ","Seneste såtidspunkt MFO blanding","Seneste såtidspunkt Pligtige efterafgrøder og MFO som græsudlæg i renbestand","Seneste såtidspunkt MFO græsudlæg i renbestand","Seneste såtidspunkt Mellemafgrøder","Seneste såtidspunkt Frivillige","Omkostninger","Nettoomkostninger","Pligtig efterafgrøde","Pligtig mellemafgrøde","MFO-efterafgrøde i blanding","MFO-udlæg","Miljø-efterafgrøder","Frivillige efterafgrøder","Grønne marker (2,3 DE-brug)","Egnet til udlæg efterår i vinterkorn","Egnet til udlæg forår","Egnet til udsåning 2-3 uger før høst","Egnet til udsåning efter tidlig høst (10. august)","Kvælstof-fikserende","Stor kvælstof-eftervirkning","Hurtig og dyb rodvækst på lerjord","Er afgrøden robust mod ukrudtsmidler?","Der findes sorter, der ikke opformerer kålbrok","Der findes sorter, der er sanerende for roecystenematoder"]
[null,null,null,null,"Seneste såtidspunkt Pligtige efterafgrøder","Seneste såtidspunkt Pligtige efterafgrøder og MFO ","Seneste såtidspunkt MFO blanding","Seneste såtidspunkt Pligtige efterafgrøder og MFO som græsudlæg i renbestand","Seneste såtidspunkt MFO græsudlæg i renbestand","Seneste såtidspunkt Mellemafgrøder","Seneste såtidspunkt Frivillige","Omkostninger","Nettoomkostninger","Pligtig efterafgrøde","Pligtig mellemafgrøde","MFO-efterafgrøde i blanding","MFO-udlæg","Miljø-efterafgrøder","Frivillige efterafgrøder","Grønne marker (2,3 DE-brug)","Egnet til udlæg efterår i vinterkorn","Egnet til udlæg forår","Egnet til udsåning ved sidste radrensning","Egnet til udsåning efter tidlig høst (10. august)","Kvælstof-fikserende","Stor kvælstof-eftervirkning","Hurtig og dyb rodvækst på lerjord","Er afgrøden robust mod ukrudtsmidler?","Der findes sorter, der ikke opformerer kålbrok","Der findes sorter, der er sanerende for roecystenematoder",null,"Vinterfasthed","Anvendelse af egen udsæd","Tiebreak"]
[1,"Alm. rajgræs, dipl.","1. Vintersæd","1. Ved etablering af primærafgrøde","1.august","1.august","1. august","31. maj","31. maj",null,"20.aug",{"$f":"'Hjælpe beregning'!AB12*-1","v":-185},{"$f":"'Hjælpe beregning'!AC12","v":"-"},1,0,1,1,1,1,1,0,3,3,2,0,1,0,2,3,0,null,3,0,1]
[2,"Blanding uden bælgsæd overvintrene","1. Vintersæd","1. Ved etablering af primærafgrøde","Ikke relevant","Ikke relevant","Ikke relevant","Ikke relevant","31. maj",null,"10. aug",{"$f":"'Hjælpe beregning'!AB13*-1","v":-1018.5},{"$f":"'Hjælpe beregning'!AC13","v":-908.5},0,0,0,1,1,1,1,0,0,2,2,0,1,2,0,3,0,null,3,0,2]
[3,"Vårbyg /Vikke /Gul Sennep",null,null,"20. august","20. august","Ikke relevant","Ikke relevant","Ikke relevant",null,"10. aug",{"$f":"'Hjælpe beregning'!AB14*-1","v":-788.5},{"$f":"'Hjælpe beregning'!AC14","v":-348.5},1,0,0,0,1,1,1,0,0,0,3,1,2,1,0,3,0,null,1,0,3]
[4,"Rajgræs/Cichorie/hvidkløver","1. Vintersæd","1. Ved etablering af primærafgrøde","Ikke relevant","Ikke relevant","Ikke relevant","Ikke relevant","31. maj",null,"30. maj",{"$f":"'Hjælpe beregning'!AB15*-1","v":-185},{"$f":"'Hjælpe beregning'!AC15","v":"-"},0,0,0,1,1,1,1,1,3,2,0,1,1,2,0,3,0,null,3,0,4]
[5,"Rødkløver","1. Vintersæd","1. Ved etablering af primærafgrøde","Ikke relevant","Ikke relevant","Ikke relevant","Ikke relevant","31. maj",null,"30. maj",{"$f":"'Hjælpe beregning'!AB16*-1","v":-185},{"$f":"'Hjælpe beregning'!AC16","v":"-"},0,0,0,1,1,1,1,1,3,2,0,1,1,0,0,3,0,null,3,0,5]
[6,"Vinterrug/fodervikke/olieræddike","1. Vintersæd","1. Ved etablering af primærafgrøde","Ikke relevant","Ikke relevant","Ikke relevant","Ikke relevant","Ikke relevant",null,"10. aug",{"$f":"'Hjælpe beregning'!AB17*-1","v":-879},{"$f":"'Hjælpe beregning'!AC17","v":-439},0,0,0,0,1,1,1,0,2,2,0,1,1,3,0,3,0,null,1,0,6]
[7,"Triticale/Gul Sennep","1. Vintersæd","1. Ved etablering af primærafgrøde","1. august","1. august","1. august","Ikke relevant","Ikke relevant",null,"10. aug",{"$f":"'Hjælpe beregning'!AB18*-1","v":-647},{"$f":"'Hjælpe beregning'!AC18","v":"-"},1,0,0,0,1,1,1,0,3,1,1,0,1,0,0,3,0,null,0,0,7]
[8,"Frøgræs, udtjent","1. Vintersæd","1. Ved etablering af primærafgrøde","relevant","ikke relevant","Ikke relevant","Ikke relevant","Ikke relevant","Ikke relevant","Valgfrit",{"$f":"'Hjælpe beregning'!AB19*-1","v":-185},{"$f":"'Hjælpe beregning'!AC19","v":"-"},1,1,0,0,1,1,1,0,0,0,0,0,1,0,3,3,0,null,3,0,8]
[9,"Gul sennep","1. Vintersæd","1. Ved etablering af primærafgrøde","20. august","20. august","20. august","Ikke relevant","Ikke relevant","20. juli","10. aug",{"$f":"'Hjælpe beregning'!AB20*-1","v":-503},{"$f":"'Hjælpe beregning'!AC20","v":377},1,1,1,0,1,1,1,0,0,0,3,0,2,2,3,0,3,null,0,0,9]
[10,"Olieræddike","1. Vintersæd","1. Ved etablering af primærafgrøde","20. august","20. august","20. august","Ikke relevant","Ikke relevant","20. juli","10. aug",{"$f":"'Hjælpe beregning'!AB21*-1","v":-649},{"$f":"'Hjælpe beregning'!AC21","v":231},1,1,1,0,1,1,1,0,0,0,3,0,2,3,3,2,3,null,0,0,10]
[11,"Blanding med bælsæd udvintrene",null,null,"Ikke relevant","Ikke relevant","Ikke relevant","Ikke relevant","31. maj",null,"10. aug",{"$f":"'Hjælpe beregning'!AB22*-1","v":-3517},{"$f":"'Hjælpe beregning'!AC22","v":-2637},0,0,0,1,1,1,1,0,0,1,2,1,2,3,0,0,0,null,0,0,11]
[12,"Vinterraps , linie","1. Vintersæd","1. Ved etablering af primærafgrøde","20. august","20. august","20. august","Ikke relevant","Ikke relevant",null,"10. aug",{"$f":"'Hjælpe beregning'!AB23*-1","v":-1136},{"$f":"'Hjælpe beregning'!AC23","v":-476},1,0,1,0,1,1,1,0,0,1,2,0,2,3,3,0,0,null,3,1,12]
[13,"Foderradise (Strukturator)",null,null,"20. august","20. august","20. august","Ikke relevant","Ikke relevant",null,"10. aug",{"$f":"'Hjælpe beregning'!AB24*-1","v":-913},{"$f":"'Hjælpe beregning'!AC24","v":-33},1,0,1,0,1,1,1,0,0,1,3,0,2,3,3,2,0,null,0,0,13]
[14,"Havre","1. Vintersæd","1. Ved etablering af primærafgrøde","20. august","20. august","20. august","Ikke relevant","Ikke relevant",null,"20. aug",{"$f":"'Hjælpe beregning'!AB25*-1","v":-877},{"$f":"'Hjælpe beregning'!AC25","v":-657},1,0,1,0,1,1,1,0,0,1,3,0,1,1,3,3,0,null,1,1,14]
[15,"Boghvede",null,null,"Ikke relevant","Ikke relevant","Ikke relevant","Ikke relevant","Ikke relevant",null,"10. aug",{"$f":"'Hjælpe beregning'!AB26*-1","v":-1952},{"$f":"'Hjælpe beregning'!AC26","v":-1732},0,0,0,0,0,0,0,0,0,0,0,0,0,0,0,0,0,null,0,0,0]
[16,"Vinterrybs","1. Vintersæd","1. Ved etablering af primærafgrøde","20. august","20. august","20. august","Ikke relevant","Ikke relevant",null,"10. aug",{"$f":"'Hjælpe beregning'!AB27*-1","v":-1513},{"$f":"'Hjælpe beregning'!AC27","v":-633},1,0,1,0,1,1,1,0,0,1,3,0,1,2,0,3,0,null,3,1,16]
[17,"Gul Lupin",null,null,"Ikke relevant","Ikke relevant","Ikke relevant","Ikke relevant","Ikke relevant",null,"10. aug",{"$f":"'Hjælpe beregning'!AB28*-1","v":-716},{"$f":"'Hjælpe beregning'!AC28","v":-56},0,0,0,0,0,0,0,0,0,0,0,1,0,1,0,0,0,null,0,0,0]
[18,"Vårbyg","1. Vintersæd","1. Ved etablering af primærafgrøde","20. august","20. august","20.august","ikke relevant","Ikke relevant",null,"10. aug",{"$f":"'Hjælpe beregning'!AB29*-1","v":-877},{"$f":"'Hjælpe beregning'!AC29","v":-657},1,0,1,0,1,1,1,0,0,0,3,0,1,0,3,3,0,null,1,1,18]
[19,"vårbyg/fodervikke",null,null,"Ikke relevant","Ikke relevant","Ikke relevant","Ikke relevant","Ikke relevant",null,"10. aug",{"$f":"'Hjælpe beregning'!AB30*-1","v":-1519},{"$f":"'Hjælpe beregning'!AC30","v":-1079},0,0,0,0,0,0,0,0,0,0,0,1,0,0,0,0,0,null,0,1,0]
[20,"Vinterrug ",null,null,"20. august","20. august","20. august","Ikke relevant","Ikke relevant",null,"20. aug",{"$f":"'Hjælpe beregning'!AB31*-1","v":-849},{"$f":"'Hjælpe beregning'!AC31","v":-409},1,0,1,0,1,1,1,0,0,1,3,0,1,1,3,3,0,null,3,1,20]
[21,"Olierædikke/gul sennep ",null,null,"20. august","20. august","20. august","Ikke relevant","Ikke relevant",null,"10. aug",{"$f":"'Hjælpe beregning'!AB32*-1","v":-395},{"$f":"'Hjælpe beregning'!AC32","v":45},1,0,1,0,0,0,0,0,0,0,0,0,0,0,0,0,0,null,0,0,0]
[22,"Blanding med bælsæd overvintrene","1. Vintersæd","1. Ved etablering af primærafgrøde","Ikke relevant","Ikke relevant","Ikke relevant","Ikke relevant","31. maj",null,"10. aug",{"$f":"'Hjælpe beregning'!AB33*-1","v":-1759},{"$f":"'Hjælpe beregning'!AC33","v":-1319},0,0,0,1,1,1,1,0,0,1,2,1,1,1,0,3,0,null,3,0,22]
[23,"Blanding uden bælgsæd udvintrene",null,null,"Ikke relevant","Ikke relevant","Ikke relevant","Ikke relevant","31. maj",null,"10. aug",{"$f":"'Hjælpe beregning'!AB34*-1","v":-1269},{"$f":"'Hjælpe beregning'!AC34","v":-829},0,0,0,1,0,0,0,0,0,0,1,0,1,1,0,3,0,null,0,0,23]
[24,"Cikorie","1. Vintersæd","1. Ved etablering af primærafgrøde","1. august","1. august","1. august","1. august","31. maj",null,"1. maj",{"$f":"'Hjælpe beregning'!AB35*-1","v":-185},{"$f":"'Hjælpe beregning'!AC35","v":"-"},1,0,1,1,1,1,1,0,3,2,0,0,2,3,0,3,0,null,2,0,24]
[25,"Honningurt","1. Vintersæd","1. Ved etablering af primærafgrøde","20. august","20. august","20. august","Ikke relevant","Ikke relevant",null,"10. aug",{"$f":"'Hjælpe beregning'!AB36*-1","v":-2302},{"$f":"'Hjælpe beregning'!AC36","v":-2082},1,0,1,0,1,1,1,0,0,0,3,0,2,3,3,3,0,null,0,0,25]
[26,"Fodervikke ","1. Vintersæd","1. Ved etablering af primærafgrøde","Ikke relevant","Ikke relevant","Ikke relevant","Ikke relevant","31. maj",null,"10. aug",{"$f":"'Hjælpe beregning'!AB37*-1","v":-2413},{"$f":"'Hjælpe beregning'!AC37","v":-1533},0,0,0,1,1,1,1,0,0,0,3,1,3,0,3,3,0,null,0,1,26]
[27,"Vintervikke","1. Vintersæd","1. Ved etablering af primærafgrøde","Ikke relevant","Ikke relevant","Ikke relevant","Ikke relevant","31. maj",null,"10. aug",{"$f":"'Hjælpe beregning'!AB38*-1","v":-1202},{"$f":"'Hjælpe beregning'!AC38","v":-982},0,0,0,1,1,1,1,0,0,0,3,1,3,0,3,3,0,null,3,0,27]
[28,"Alexandrinekløver","1. Vintersæd","1. Ved etablering af primærafgrøde","Ikke relevant","Ikke relevant","Ikke relevant","Ikke relevant","31. maj",null,"10. aug",{"$f":"'Hjælpe beregning'!AB39*-1","v":-2002},{"$f":"'Hjælpe beregning'!AC39","v":-1782},0,0,0,1,1,1,1,0,2,1,2,1,3,0,3,3,0,null,0,1,28]
[29,"Hvidkløver","1. Vintersæd","1. Ved etablering af primærafgrøde","Ikke relevant","Ikke relevant","Ikke relevant","Ikke relevant","31. maj",null,"30. maj",{"$f":"'Hjælpe beregning'!AB40*-1","v":-185},{"$f":"'Hjælpe beregning'!AC40","v":"-"},0,0,0,1,1,1,1,0,3,3,1,1,3,0,1,3,0,null,3,0,29]
[30,"Olieræddike og vintervikke","1. Vintersæd","1. Ved etablering af primærafgrøde","20. august","20. august","Ikke relevant","Ikke relevant","Ikke relevant",null,"10.aug",{"$f":"'Hjælpe beregning'!AB41*-1","v":-828},{"$f":"'Hjælpe beregning'!AC41","v":52},1,0,0,0,1,1,1,0,0,0,3,1,3,3,3,2,0,null,0,0,30]
[31,"Hvidkløver/alm. rajgræs","1. Vintersæd","1. Ved etablering af primærafgrøde","1. august","1. august","Ikke relevant","Ikke relevant","31. maj",null,"30. maj",{"$f":"'Hjælpe beregning'!AB42*-1","v":-185},{"$f":"'Hjælpe beregning'!AC42","v":"-"},1,0,0,1,1,1,1,0,3,3,2,1,3,0,1,3,0,null,3,0,31]
[32,"Rødkløver/strandsvingel","1. Vintersæd","1. Ved etablering af primærafgrøde","1. august","1. august","Ikke relevant","Ikke relevant","31. maj",null,"30. maj",{"$f":"'Hjælpe beregning'!AB43*-1","v":-1355},{"$f":"'Hjælpe beregning'!AC43","v":"-"},1,0,0,1,1,1,1,0,1,3,1,1,3,0,1,3,0,null,3,0,32]
[33,"Vintervikke/vinterrug","1. Vintersæd","1. Ved etablering af primærafgrøde","20. august","20. august","Ikke relevant","Ikke relevant","31. maj",null,"10. aug",{"$f":"'Hjælpe beregning'!AB44*-1","v":-969},{"$f":"'Hjælpe beregning'!AC44","v":-529},1,0,0,1,1,1,1,0,0,0,3,1,3,0,3,3,0,null,3,0,33]
[34,"Kløvergræs (blanding)","1. Vintersæd","1. Ved etablering af primærafgrøde","1. august","1. august","Ikke relevant","Ikke relevant","31. maj",null,"30. maj",{"$f":"'Hjælpe beregning'!AB45*-1","v":-2145},{"$f":"'Hjælpe beregning'!AC45","v":"-"},1,0,0,1,1,1,1,0,3,3,3,1,3,0,1,3,0,null,3,0,34]

{"sheet":"1. Anders","index":6,"n_rows":65,"n_cols":5,"rows_kept":65,"cut":false,"hidden":true,"merged":[]}
["Return"]
[null,"Dyrkningsvejledning for efterafgrøde Anders"]
[]
[null,null,"I Vintersæd"]
[]
[null,null,null,"Etablering ved tidlig udlæg"]
[null,null,null,null,"dgsdfh dfghdfhdfhdfghjdfgjfgjfghjfghdfhsdh dfh df hdfgh dfgh d"]
[null,null,null,null,"dfh dfgh dfghjdfklghj fjhlkæsdfjhskldjg sdgj sdkfgj klsdjfgklsdj fgsd gkl"]
[null,null,null,null,"fh dfh dfh fhdfgh dfghdfgh dfhdfghd fgh"]
[]
[null,null,null,null,"dfhdfghdfghfgh dfgh dfgh d"]
[]
[null,null,null,"Etablering før høst"]
[null,null,null,null,"dgsdfh dfghdfhdfhdfghjdfgjfgjfghjfghdfhsdh dfh df hdfgh dfgh d"]
[null,null,null,null,"dfh dfgh dfghjdfklghj fjhlkæsdfjhskldjg sdgj sdkfgj klsdjfgklsdj fgsd gkl"]
[null,null,null,null,"fh dfh dfh fhdfgh dfghdfgh dfhdfghd fgh"]
[]
[null,null,null,null,"dfhdfghdfghfgh dfgh dfgh d"]
[]
[null,null,null,"Etablering efter høst"]
[null,null,null,null,"dgsdfh dfghdfhdfhdfghjdfgjfgjfghjfghdfhsdh dfh df hdfgh dfgh d"]
[null,null,null,null,"dfh dfgh dfghjdfklghj fjhlkæsdfjhskldjg sdgj sdkfgj klsdjfgklsdj fgsd gkl"]
[null,null,null,null,"fh dfh dfh fhdfgh dfghdfgh dfhdfghd fgh"]
[]
[null,null,null,null,"dfhdfghdfghfgh dfgh dfgh d"]
[]
[null,null,"I Vårsæd"]
[]
[null,null,null,"Etablering ved tidlig udlæg"]
[null,null,null,null,"dgsdfh dfghdfhdfhdfghjdfgjfgjfghjfghdfhsdh dfh df hdfgh dfgh d"]
[null,null,null,null,"dfh dfgh dfghjdfklghj fjhlkæsdfjhskldjg sdgj sdkfgj klsdjfgklsdj fgsd gkl"]
[null,null,null,null,"fh dfh dfh fhdfgh dfghdfgh dfhdfghd fgh"]
[]
[null,null,null,null,"dfhdfghdfghfgh dfgh dfgh d"]
[]
[]
[null,null,null,"Etablering før høst"]
[null,null,null,null,"dgsdfh dfghdfhdfhdfghjdfgjfgjfghjfghdfhsdh dfh df hdfgh dfgh d"]
[null,null,null,null,"dfh dfgh dfghjdfklghj fjhlkæsdfjhskldjg sdgj sdkfgj klsdjfgklsdj fgsd gkl"]
[null,null,null,null,"fh dfh dfh fhdfgh dfghdfgh dfhdfghd fgh"]
[]
[null,null,null,null,"dfhdfghdfghfgh dfgh dfgh d"]
[]
[null,null,null,"Etablering efter høst"]
[null,null,null,null,"dgsdfh dfghdfhdfhdfghjdfgjfgjfghjfghdfhsdh dfh df hdfgh dfgh d"]
[null,null,null,null,"dfh dfgh dfghjdfklghj fjhlkæsdfjhskldjg sdgj sdkfgj klsdjfgklsdj fgsd gkl"]
[null,null,null,null,"fh dfh dfh fhdfgh dfghdfgh dfhdfghd fgh"]
[]
[null,null,null,null,"dfhdfghdfghfgh dfgh dfgh d"]
[]
[null,null,"I Majs"]
[]
[null,null,null,"Etablering ved tidlig udlæg"]
[null,null,null,null,"dgsdfh dfghdfhdfhdfghjdfgjfgjfghjfghdfhsdh dfh df hdfgh dfgh d"]
[null,null,null,null,"dfh dfgh dfghjdfklghj fjhlkæsdfjhskldjg sdgj sdkfgj klsdjfgklsdj fgsd gkl"]
[null,null,null,null,"fh dfh dfh fhdfgh dfghdfgh dfhdfghd fgh"]
[]
[null,null,null,null,"dfhdfghdfghfgh dfgh dfgh d"]
[]
[null,null,null,"Etablering efter høst"]
[null,null,null,null,"dgsdfh dfghdfhdfhdfghjdfgjfgjfghjfghdfhsdh dfh df hdfgh dfgh d"]
[null,null,null,null,"dfh dfgh dfghjdfklghj fjhlkæsdfjhskldjg sdgj sdkfgj klsdjfgklsdj fgsd gkl"]
[null,null,null,null,"fh dfh dfh fhdfgh dfghdfgh dfhdfghd fgh"]
[]
[null,null,null,null,"dfhdfghdfghfgh dfgh dfgh d"]

{"sheet":"99. Andre efterafgrøder","index":7,"n_rows":65,"n_cols":5,"rows_kept":65,"cut":false,"hidden":true,"merged":[]}
["Return"]
[null,"Dyrkningsvejledning for øvrige efterafgrøde"]
[]
[null,null,"I Vintersæd"]
[]
[null,null,null,"Etablering ved tidlig udlæg"]
[null,null,null,null,"dgsdfh dfghdfhdfhdfghjdfgjfgjfghjfghdfhsdh dfh df hdfgh dfgh d"]
[null,null,null,null,"dfh dfgh dfghjdfklghj fjhlkæsdfjhskldjg sdgj sdkfgj klsdjfgklsdj fgsd gkl"]
[null,null,null,null,"fh dfh dfh fhdfgh dfghdfgh dfhdfghd fgh"]
[]
[null,null,null,null,"dfhdfghdfghfgh dfgh dfgh d"]
[]
[null,null,null,"Etablering før høst"]
[null,null,null,null,"dgsdfh dfghdfhdfhdfghjdfgjfgjfghjfghdfhsdh dfh df hdfgh dfgh d"]
[null,null,null,null,"dfh dfgh dfghjdfklghj fjhlkæsdfjhskldjg sdgj sdkfgj klsdjfgklsdj fgsd gkl"]
[null,null,null,null,"fh dfh dfh fhdfgh dfghdfgh dfhdfghd fgh"]
[]
[null,null,null,null,"dfhdfghdfghfgh dfgh dfgh d"]
[]
[null,null,null,"Etablering efter høst"]
[null,null,null,null,"dgsdfh dfghdfhdfhdfghjdfgjfgjfghjfghdfhsdh dfh df hdfgh dfgh d"]
[null,null,null,null,"dfh dfgh dfghjdfklghj fjhlkæsdfjhskldjg sdgj sdkfgj klsdjfgklsdj fgsd gkl"]
[null,null,null,null,"fh dfh dfh fhdfgh dfghdfgh dfhdfghd fgh"]
[]
[null,null,null,null,"dfhdfghdfghfgh dfgh dfgh d"]
[]
[null,null,"I Vårsæd"]
[]
[null,null,null,"Etablering ved tidlig udlæg"]
[null,null,null,null,"dgsdfh dfghdfhdfhdfghjdfgjfgjfghjfghdfhsdh dfh df hdfgh dfgh d"]
[null,null,null,null,"dfh dfgh dfghjdfklghj fjhlkæsdfjhskldjg sdgj sdkfgj klsdjfgklsdj fgsd gkl"]
[null,null,null,null,"fh dfh dfh fhdfgh dfghdfgh dfhdfghd fgh"]
[]
[null,null,null,null,"dfhdfghdfghfgh dfgh dfgh d"]
[]
[]
[null,null,null,"Etablering før høst"]
[null,null,null,null,"dgsdfh dfghdfhdfhdfghjdfgjfgjfghjfghdfhsdh dfh df hdfgh dfgh d"]
[null,null,null,null,"dfh dfgh dfghjdfklghj fjhlkæsdfjhskldjg sdgj sdkfgj klsdjfgklsdj fgsd gkl"]
[null,null,null,null,"fh dfh dfh fhdfgh dfghdfgh dfhdfghd fgh"]
[]
[null,null,null,null,"dfhdfghdfghfgh dfgh dfgh d"]
[]
[null,null,null,"Etablering efter høst"]
[null,null,null,null,"dgsdfh dfghdfhdfhdfghjdfgjfgjfghjfghdfhsdh dfh df hdfgh dfgh d"]
[null,null,null,null,"dfh dfgh dfghjdfklghj fjhlkæsdfjhskldjg sdgj sdkfgj klsdjfgklsdj fgsd gkl"]
[null,null,null,null,"fh dfh dfh fhdfgh dfghdfgh dfhdfghd fgh"]
[]
[null,null,null,null,"dfhdfghdfghfgh dfgh dfgh d"]
[]
[null,null,"I Majs"]
[]
[null,null,null,"Etablering ved tidlig udlæg"]
[null,null,null,null,"dgsdfh dfghdfhdfhdfghjdfgjfgjfghjfghdfhsdh dfh df hdfgh dfgh d"]
[null,null,null,null,"dfh dfgh dfghjdfklghj fjhlkæsdfjhskldjg sdgj sdkfgj klsdjfgklsdj fgsd gkl"]
[null,null,null,null,"fh dfh dfh fhdfgh dfghdfgh dfhdfghd fgh"]
[]
[null,null,null,null,"dfhdfghdfghfgh dfgh dfgh d"]
[]
[null,null,null,"Etablering efter høst"]
[null,null,null,null,"dgsdfh dfghdfhdfhdfghjdfgjfgjfghjfghdfhsdh dfh df hdfgh dfgh d"]
[null,null,null,null,"dfh dfgh dfghjdfklghj fjhlkæsdfjhskldjg sdgj sdkfgj klsdjfgklsdj fgsd gkl"]
[null,null,null,null,"fh dfh dfh fhdfgh dfghdfgh dfhdfghd fgh"]
[]
[null,null,null,null,"dfhdfghdfghfgh dfgh dfgh d"]

{"sheet":"Lister","index":8,"n_rows":34,"n_cols":17,"rows_kept":34,"cut":false,"hidden":false,"merged":[]}
[]
[]
["Efterafgrødens funktion"]
["Vælg hvad afgrøden skal bruges som",null,null,null,null,"Karakterliste",null,null,null,null,"Basisvalg",null,null,null,null,"Afgrøde"]
["Pligtig efterafgrøde"]
["Pligtig efterafgrøde og MFO afgrøde",null,null,null,null,"Pris","Ikke vigtigt","Vigtigt","Meget vigtigt",null,"Ja","Nej",null,null,null,"Vælg afgrøde"]
["Kun MFO afgrøde",null,null,null,null,"Dyrkningssikkerhed","Ikke vigtigt","Vigtigt","Meget vigtigt",null,null,null,null,null,null,"1. Vintersæd"]
["Frivillig efterafgrøde (ingen statslig ordning)",null,null,null,null,"Stor eftervirkning","Ikke vigtigt","Vigtigt","Meget vigtigt",null,null,null,null,null,null,"2. Vårsæd"]
[null,null,null,null,null,"Lovpligtig","Ikke vigtigt","Vigtigt","Meget vigtigt"]
[null,null,null,null,null,"Sygdomme","Ikke vigtigt","Nematoder","Kålbrok","Begge"]
[null,null,null,null,null,"Tiebreak","Ikke vigtigt","Vigtigt","Meget vigtigt",null,null,null,null,null,null,"Etableringstidspunkt"]
[null,null,null,null,null,null,null,null,null,null,null,null,null,null,null,"Vælg tidspunkt","."]
["Afgrøde type",null,null,null,null,null,null,null,null,null,null,null,null,null,null,"Ikke vigtigt",0]
["Vælg hovedafgrøde",null,null,null,null,null,null,null,null,null,null,null,null,null,null,"1. Ved etablering af primærafgrøde",500000]
["Vintersæd",null,null,null,null,"Basis valg",null,null,null,null,null,null,null,null,null,"2. Før høst",500000]
["Vårsæd",null,null,null,null,"Ja",1,null,null,null,null,null,null,null,null,"3. Efter høst",500000]
[null,null,null,null,null,"Nej",0]
["Etableringstidspunkt",null,null,null,null,0,0]
["Vælg etableringstidspunkt"]
["Ved såning af primærafgrøde",null,null,null,null,"Standard karaktere"]
["Egnet til udsåning ved sidste radrensning",null,null,null,null,"Ikke vigtigt",0]
["Efter høst af primærafgrøde",null,null,null,null,"Vigtigt",2]
[null,null,null,null,null,"Meget vigtigt",6]
["Jordtype"]
["Vælg jordtype",null,null,null,null,"Ikke vigtigt",0]
["Sand",null,null,null,null,"Foretrækkes",3]
["Ler",null,null,null,null,"Der må ikke opformeres kålbrok",9]
[]
[null,null,null,null,null,"Ikke vigtigt",0]
["Efterfølgende afgrøde",null,null,null,null,"Helst",3]
[null,null,null,null,null,"Egen udsæd skal anvendes ",9]
["Vårsæd"]
[{"$f":"IF(OR('Efterafgrøde beslutningsstøtte'!A7=\"Pligtig mellemafgrøde\"),\"Vintersæd\",IF('Efterafgrøde beslutningsstøtte'!A7=\"Kun MFO afgrøde\",\"Fortsætter som græs - Kun MFO\",\"\"))","v":""}]
[{"$f":"IF(OR('Efterafgrøde beslutningsstøtte'!A7=\"Pligtig mellemafgrøde\"),\"Vintersæd\",\"\")","v":""}]

{"sheet":"Hjælpe beregning","index":9,"n_rows":45,"n_cols":29,"rows_kept":45,"cut":false,"hidden":false,"merged":[[9,11,9,15],[9,16,9,26],[9,27,9,28],[9,8,9,10]]}
[]
[]
[null,"Søjle A= Løbenr"]
[null,"I søjle B, =1 så er der forsøgsresultater mv ellers ikke",null,null,"Forsøgsresultat",null,null,"0=findes ikke, 1=der er forsøgsresultater",null,null,"1=Vintersæd"]
[null,"Søjle C - nr. på afgrøden 1-34",null,null,"Afgrøde efter efterafgrøde",null,null,"1=vintersæd, 2=vårsæd el. fortsætter som græs"]
[null,"Søjle E - kode for om den afgrøde der følger efter er vår- eller vintersæd",null,null,"Såtidspunkt",null,null,"1=sammen med afgrøde, 2=før høst, 3=efter høst"]
[null,"Søjle F - kode for såtidspunkt - med foregående afrøder, før eller efter høst",null,null,"Jordbund",null,null,"1=sandjord, 2= lerjord"]
[null,"Søjel G - kode for jordbund"]
[null,"Søjle H - kode for hvor værdier skal findes i normer",null,null,"Efterfølgende afgrøde",null,{"$f":"'Efterafgrøde beslutningsstøtte'!A19","v":"Vårsæd"}]
[null,null,null,null,null,null,null,null,"Udbytte",null,null,"Stykomkostninger",null,null,null,null,"Maskin- og arbejdsomkostninger",null,null,null,null,null,null,null,null,null,null,"Resultat"]
["Lbnr","Forsøgsresultater","Afgrødenr",null,"Afgrøde efter efterafgrøde","Såtidspunkt","Jordbund","Kode for valg af tabel","Merudbytte, hkg. pr. ha","Pris merudbytte","Værdi merudbytte","Kg udsæd","Pris udsæd","Andre omk.","Pris andre omk.","I alt stykomkostninger","Såning antal","Pris såning","Høst, hkg.","Pris mejetærskning","Tørring","Pris tørring","Nedmuldning","Pris nedmuldning","Andre kapa omk.","Pris andre kapa","I alt maskiner og arbejde","I alt omkostninger","Resultat"]
[1,0,1,"Alm. rajgræs, dipl.",{"$f":"IF('Efterafgrøde beslutningsstøtte'!A$19=\"Vintersæd\",1,IF(OR('Efterafgrøde beslutningsstøtte'!A$19=\"Vårsæd\",'Efterafgrøde beslutningsstøtte'!A$19=\"Fortsætter som græs - Kun MFO\"),2,\"Fejl\"))","v":2},{"$f":"IF('Efterafgrøde beslutningsstøtte'!A$13=\"Ved såning af primærafgrøde\",1,IF('Efterafgrøde beslutningsstøtte'!A$13=\"Egnet til udsåning ved sidste radrensning\",2,IF('Efterafgrøde beslutningsstøtte'!A$13=\"Efter høst af primærafgrøde\",3,\"Fejl\")))","v":3},{"$f":"IF('Efterafgrøde beslutningsstøtte'!A$16=\"Sand\",1,IF('Efterafgrøde beslutningsstøtte'!A$16=\"Ler\",2,\"Fejl\"))","v":2},{"$f":"(G12-1)*6+(E12-1)*3+F12+2","v":14},{"$f":"IF($G$9<>\"Fortsætter som græs - Kun MFO\",VLOOKUP(C12,Norm!$B$19:$Y$52,H12,FALSE),0)","v":0},{"$f":"IF(E12=1,Norm!$D$9,Norm!$D$10)","v":220},{"$f":"I12*J12","v":0},{"$f":"VLOOKUP(C12,Norm!$B$19:$Y$52,14+F12,FALSE)","v":"0"},{"$f":"VLOOKUP($C12,Norm!$B$19:$Y$52,18)","v":60},{"$f":"VLOOKUP($C12,Norm!$B$19:$Y$52,19)","v":0},{"$f":"VLOOKUP($C12,Norm!$B$19:$Y$52,20)","v":0},{"$f":"L12*M12+N12*O12","v":0},1,{"$f":"IF(F12=1,Norm!$D$3,IF(F12=2,Norm!$D$4,IF(F12=3,Norm!$D$5)))","v":185},{"$f":"I12","v":0},{"$f":"Norm!$D$12","v":7},{"$f":"S12","v":0},{"$f":"Norm!$D$7","v":10},{"$f":"VLOOKUP($C12,Norm!$B$19:$Y$52,23)","v":0},{"$f":"VLOOKUP($C12,Norm!$B$19:$Y$52,24)","v":0},{"$f":"VLOOKUP($C12,Norm!$B$19:$Y$52,21)","v":0},{"$f":"VLOOKUP($C12,Norm!$B$19:$Y$52,22)","v":0},{"$f":"Q12*R12+S12*T12+U12*V12+W12*X12+Y12*Z12","v":185},{"$f":"P12+AA12","v":185},{"$f":"IF(K12>0,K12-AB12,\"-\")","v":"-"}]
[2,0,2,"Blanding uden bælgsæd overvintrene",{"$f":"IF('Efterafgrøde beslutningsstøtte'!A$19=\"Vintersæd\",1,IF(OR('Efterafgrøde beslutningsstøtte'!A$19=\"Vårsæd\",'Efterafgrøde beslutningsstøtte'!A$19=\"Fortsætter som græs - Kun MFO\"),2,\"Fejl\"))","v":2},{"$f":"IF('Efterafgrøde beslutningsstøtte'!A$13=\"Ved såning af primærafgrøde\",1,IF('Efterafgrøde beslutningsstøtte'!A$13=\"Egnet til udsåning ved sidste radrensning\",2,IF('Efterafgrøde beslutningsstøtte'!A$13=\"Efter høst af primærafgrøde\",3,\"Fejl\")))","v":3},{"$f":"IF('Efterafgrøde beslutningsstøtte'!A$16=\"Sand\",1,IF('Efterafgrøde beslutningsstøtte'!A$16=\"Ler\",2,\"Fejl\"))","v":2},{"$f":"(G13-1)*6+(E13-1)*3+F13+2","v":14},{"$f":"IF($G$9<>\"Fortsætter som græs - Kun MFO\",VLOOKUP(C13,Norm!$B$19:$Y$52,H13,FALSE),0)","v":0.5},{"$f":"IF(E13=1,Norm!$D$9,Norm!$D$10)","v":220},{"$f":"I13*J13","v":110},{"$f":"VLOOKUP(C13,Norm!$B$19:$Y$52,14+F13,FALSE)","v":"55"},{"$f":"VLOOKUP($C13,Norm!$B$19:$Y$52,18)","v":15},{"$f":"VLOOKUP($C13,Norm!$B$19:$Y$52,19)","v":0},{"$f":"VLOOKUP($C13,Norm!$B$19:$Y$52,20)","v":0},{"$f":"L13*M13+N13*O13","v":825},1,{"$f":"IF(F13=1,Norm!$D$3,IF(F13=2,Norm!$D$4,IF(F13=3,Norm!$D$5)))","v":185},{"$f":"I13","v":0.5},{"$f":"Norm!$D$12","v":7},{"$f":"S13","v":0.5},{"$f":"Norm!$D$7","v":10},{"$f":"VLOOKUP($C13,Norm!$B$19:$Y$52,23)","v":0},{"$f":"VLOOKUP($C13,Norm!$B$19:$Y$52,24)","v":0},{"$f":"VLOOKUP($C13,Norm!$B$19:$Y$52,21)","v":0},{"$f":"VLOOKUP($C13,Norm!$B$19:$Y$52,22)","v":0},{"$f":"Q13*R13+S13*T13+U13*V13+W13*X13+Y13*Z13","v":193.5},{"$f":"P13+AA13","v":1018.5},{"$f":"IF(K13>0,K13-AB13,\"-\")","v":-908.5}]
[3,0,3,"Vårbyg /Vikke /Gul Sennep",{"$f":"IF('Efterafgrøde beslutningsstøtte'!A$19=\"Vintersæd\",1,IF(OR('Efterafgrøde beslutningsstøtte'!A$19=\"Vårsæd\",'Efterafgrøde beslutningsstøtte'!A$19=\"Fortsætter som græs - Kun MFO\"),2,\"Fejl\"))","v":2},{"$f":"IF('Efterafgrøde beslutningsstøtte'!A$13=\"Ved såning af primærafgrøde\",1,IF('Efterafgrøde beslutningsstøtte'!A$13=\"Egnet til udsåning ved sidste radrensning\",2,IF('Efterafgrøde beslutningsstøtte'!A$13=\"Efter høst af primærafgrøde\",3,\"Fejl\")))","v":3},{"$f":"IF('Efterafgrøde beslutningsstøtte'!A$16=\"Sand\",1,IF('Efterafgrøde beslutningsstøtte'!A$16=\"Ler\",2,\"Fejl\"))","v":2},14,{"$f":"IF($G$9<>\"Fortsætter som græs - Kun MFO\",VLOOKUP(C14,Norm!$B$19:$Y$52,H14,FALSE),0)","v":2},{"$f":"IF(E14=1,Norm!$D$9,Norm!$D$10)","v":220},440,{"$f":"VLOOKUP(C14,Norm!$B$19:$Y$52,14+F14,FALSE)","v":67},{"$f":"VLOOKUP($C14,Norm!$B$19:$Y$52,18)","v":8.5},{"$f":"VLOOKUP($C14,Norm!$B$19:$Y$52,19)","v":0},{"$f":"VLOOKUP($C14,Norm!$B$19:$Y$52,20)","v":0},{"$f":"L14*M14+N14*O14","v":569.5},1,{"$f":"IF(F14=1,Norm!$D$3,IF(F14=2,Norm!$D$4,IF(F14=3,Norm!$D$5)))","v":185},2,{"$f":"Norm!$D$12","v":7},2,{"$f":"Norm!$D$7","v":10},{"$f":"VLOOKUP($C14,Norm!$B$19:$Y$52,23)","v":0},{"$f":"VLOOKUP($C14,Norm!$B$19:$Y$52,24)","v":0},{"$f":"VLOOKUP($C14,Norm!$B$19:$Y$52,21)","v":0},{"$f":"VLOOKUP($C14,Norm!$B$19:$Y$52,22)","v":0},219,788.5,-348.5]
[4,0,4,"Rajgræs/Cichorie/hvidkløver",{"$f":"IF('Efterafgrøde beslutningsstøtte'!A$19=\"Vintersæd\",1,IF(OR('Efterafgrøde beslutningsstøtte'!A$19=\"Vårsæd\",'Efterafgrøde beslutningsstøtte'!A$19=\"Fortsætter som græs - Kun MFO\"),2,\"Fejl\"))","v":2},{"$f":"IF('Efterafgrøde beslutningsstøtte'!A$13=\"Ved såning af primærafgrøde\",1,IF('Efterafgrøde beslutningsstøtte'!A$13=\"Egnet til udsåning ved sidste radrensning\",2,IF('Efterafgrøde beslutningsstøtte'!A$13=\"Efter høst af primærafgrøde\",3,\"Fejl\")))","v":3},{"$f":"IF('Efterafgrøde beslutningsstøtte'!A$16=\"Sand\",1,IF('Efterafgrøde beslutningsstøtte'!A$16=\"Ler\",2,\"Fejl\"))","v":2},14,{"$f":"IF($G$9<>\"Fortsætter som græs - Kun MFO\",VLOOKUP(C15,Norm!$B$19:$Y$52,H15,FALSE),0)","v":0},{"$f":"IF(E15=1,Norm!$D$9,Norm!$D$10)","v":220},0,{"$f":"VLOOKUP(C15,Norm!$B$19:$Y$52,14+F15,FALSE)","v":0},{"$f":"VLOOKUP($C15,Norm!$B$19:$Y$52,18)","v":100},{"$f":"VLOOKUP($C15,Norm!$B$19:$Y$52,19)","v":0},{"$f":"VLOOKUP($C15,Norm!$B$19:$Y$52,20)","v":0},0,1,{"$f":"IF(F15=1,Norm!$D$3,IF(F15=2,Norm!$D$4,IF(F15=3,Norm!$D$5)))","v":185},0,{"$f":"Norm!$D$12","v":7},0,{"$f":"Norm!$D$7","v":10},{"$f":"VLOOKUP($C15,Norm!$B$19:$Y$52,23)","v":0},{"$f":"VLOOKUP($C15,Norm!$B$19:$Y$52,24)","v":0},{"$f":"VLOOKUP($C15,Norm!$B$19:$Y$52,21)","v":0},{"$f":"VLOOKUP($C15,Norm!$B$19:$Y$52,22)","v":0},185,185,"-"]
[5,0,5,"Rødkløver",{"$f":"IF('Efterafgrøde beslutningsstøtte'!A$19=\"Vintersæd\",1,IF(OR('Efterafgrøde beslutningsstøtte'!A$19=\"Vårsæd\",'Efterafgrøde beslutningsstøtte'!A$19=\"Fortsætter som græs - Kun MFO\"),2,\"Fejl\"))","v":2},{"$f":"IF('Efterafgrøde beslutningsstøtte'!A$13=\"Ved såning af primærafgrøde\",1,IF('Efterafgrøde beslutningsstøtte'!A$13=\"Egnet til udsåning ved sidste radrensning\",2,IF('Efterafgrøde beslutningsstøtte'!A$13=\"Efter høst af primærafgrøde\",3,\"Fejl\")))","v":3},{"$f":"IF('Efterafgrøde beslutningsstøtte'!A$16=\"Sand\",1,IF('Efterafgrøde beslutningsstøtte'!A$16=\"Ler\",2,\"Fejl\"))","v":2},{"$f":"(G16-1)*6+(E16-1)*3+F16+2","v":14},{"$f":"IF($G$9<>\"Fortsætter som græs - Kun MFO\",VLOOKUP(C16,Norm!$B$19:$Y$52,H16,FALSE),0)","v":0},{"$f":"IF(E16=1,Norm!$D$9,Norm!$D$10)","v":220},{"$f":"I16*J16","v":0},{"$f":"VLOOKUP(C16,Norm!$B$19:$Y$52,14+F16,FALSE)","v":0},{"$f":"VLOOKUP($C16,Norm!$B$19:$Y$52,18)","v":150},{"$f":"VLOOKUP($C16,Norm!$B$19:$Y$52,19)","v":0},{"$f":"VLOOKUP($C16,Norm!$B$19:$Y$52,20)","v":0},0,1,{"$f":"IF(F16=1,Norm!$D$3,IF(F16=2,Norm!$D$4,IF(F16=3,Norm!$D$5)))","v":185},0,{"$f":"Norm!$D$12","v":7},0,{"$f":"Norm!$D$7","v":10},{"$f":"VLOOKUP($C16,Norm!$B$19:$Y$52,23)","v":0},{"$f":"VLOOKUP($C16,Norm!$B$19:$Y$52,24)","v":0},{"$f":"VLOOKUP($C16,Norm!$B$19:$Y$52,21)","v":0},{"$f":"VLOOKUP($C16,Norm!$B$19:$Y$52,22)","v":0},185,185,"-"]
[6,0,6,"Vinterrug/fodervikke/olieræddike",{"$f":"IF('Efterafgrøde beslutningsstøtte'!A$19=\"Vintersæd\",1,IF(OR('Efterafgrøde beslutningsstøtte'!A$19=\"Vårsæd\",'Efterafgrøde beslutningsstøtte'!A$19=\"Fortsætter som græs - Kun MFO\"),2,\"Fejl\"))","v":2},{"$f":"IF('Efterafgrøde beslutningsstøtte'!A$13=\"Ved såning af primærafgrøde\",1,IF('Efterafgrøde beslutningsstøtte'!A$13=\"Egnet til udsåning ved sidste radrensning\",2,IF('Efterafgrøde beslutningsstøtte'!A$13=\"Efter høst af primærafgrøde\",3,\"Fejl\")))","v":3},{"$f":"IF('Efterafgrøde beslutningsstøtte'!A$16=\"Sand\",1,IF('Efterafgrøde beslutningsstøtte'!A$16=\"Ler\",2,\"Fejl\"))","v":2},14,{"$f":"IF($G$9<>\"Fortsætter som græs - Kun MFO\",VLOOKUP(C17,Norm!$B$19:$Y$52,H17,FALSE),0)","v":2},{"$f":"IF(E17=1,Norm!$D$9,Norm!$D$10)","v":220},440,{"$f":"VLOOKUP(C17,Norm!$B$19:$Y$52,14+F17,FALSE)","v":44},{"$f":"VLOOKUP($C17,Norm!$B$19:$Y$52,18)","v":15},{"$f":"VLOOKUP($C17,Norm!$B$19:$Y$52,19)","v":0},{"$f":"VLOOKUP($C17,Norm!$B$19:$Y$52,20)","v":0},660,1,{"$f":"IF(F17=1,Norm!$D$3,IF(F17=2,Norm!$D$4,IF(F17=3,Norm!$D$5)))","v":185},2,{"$f":"Norm!$D$12","v":7},2,{"$f":"Norm!$D$7","v":10},{"$f":"VLOOKUP($C17,Norm!$B$19:$Y$52,23)","v":0},{"$f":"VLOOKUP($C17,Norm!$B$19:$Y$52,24)","v":0},{"$f":"VLOOKUP($C17,Norm!$B$19:$Y$52,21)","v":0},{"$f":"VLOOKUP($C17,Norm!$B$19:$Y$52,22)","v":0},219,879,-439]
[7,0,7,"Triticale/Gul Sennep",{"$f":"IF('Efterafgrøde beslutningsstøtte'!A$19=\"Vintersæd\",1,IF(OR('Efterafgrøde beslutningsstøtte'!A$19=\"Vårsæd\",'Efterafgrøde beslutningsstøtte'!A$19=\"Fortsætter som græs - Kun MFO\"),2,\"Fejl\"))","v":2},{"$f":"IF('Efterafgrøde beslutningsstøtte'!A$13=\"Ved såning af primærafgrøde\",1,IF('Efterafgrøde beslutningsstøtte'!A$13=\"Egnet til udsåning ved sidste radrensning\",2,IF('Efterafgrøde beslutningsstøtte'!A$13=\"Efter høst af primærafgrøde\",3,\"Fejl\")))","v":3},{"$f":"IF('Efterafgrøde beslutningsstøtte'!A$16=\"Sand\",1,IF('Efterafgrøde beslutningsstøtte'!A$16=\"Ler\",2,\"Fejl\"))","v":2},14,{"$f":"IF($G$9<>\"Fortsætter som græs - Kun MFO\",VLOOKUP(C18,Norm!$B$19:$Y$52,H18,FALSE),0)","v":0},{"$f":"IF(E18=1,Norm!$D$9,Norm!$D$10)","v":220},{"$f":"I18*J18","v":0},{"$f":"VLOOKUP(C18,Norm!$B$19:$Y$52,14+F18,FALSE)","v":66},{"$f":"VLOOKUP($C18,Norm!$B$19:$Y$52,18)","v":7},{"$f":"VLOOKUP($C18,Norm!$B$19:$Y$52,19)","v":0},{"$f":"VLOOKUP($C18,Norm!$B$19:$Y$52,20)","v":0},462,1,{"$f":"IF(F18=1,Norm!$D$3,IF(F18=2,Norm!$D$4,IF(F18=3,Norm!$D$5)))","v":185},{"$f":"I18","v":0},{"$f":"Norm!$D$12","v":7},{"$f":"S18","v":0},{"$f":"Norm!$D$7","v":10},{"$f":"VLOOKUP($C18,Norm!$B$19:$Y$52,23)","v":0},{"$f":"VLOOKUP($C18,Norm!$B$19:$Y$52,24)","v":0},{"$f":"VLOOKUP($C18,Norm!$B$19:$Y$52,21)","v":0},{"$f":"VLOOKUP($C18,Norm!$B$19:$Y$52,22)","v":0},185,647,"-"]
[8,0,8,"Frøgræs, udtjent",{"$f":"IF('Efterafgrøde beslutningsstøtte'!A$19=\"Vintersæd\",1,IF(OR('Efterafgrøde beslutningsstøtte'!A$19=\"Vårsæd\",'Efterafgrøde beslutningsstøtte'!A$19=\"Fortsætter som græs - Kun MFO\"),2,\"Fejl\"))","v":2},{"$f":"IF('Efterafgrøde beslutningsstøtte'!A$13=\"Ved såning af primærafgrøde\",1,IF('Efterafgrøde beslutningsstøtte'!A$13=\"Egnet til udsåning ved sidste radrensning\",2,IF('Efterafgrøde beslutningsstøtte'!A$13=\"Efter høst af primærafgrøde\",3,\"Fejl\")))","v":3},{"$f":"IF('Efterafgrøde beslutningsstøtte'!A$16=\"Sand\",1,IF('Efterafgrøde beslutningsstøtte'!A$16=\"Ler\",2,\"Fejl\"))","v":2},14,{"$f":"IF($G$9<>\"Fortsætter som græs - Kun MFO\",VLOOKUP(C19,Norm!$B$19:$Y$52,H19,FALSE),0)","v":0},{"$f":"IF(E19=1,Norm!$D$9,Norm!$D$10)","v":220},{"$f":"I19*J19","v":0},{"$f":"VLOOKUP(C19,Norm!$B$19:$Y$52,14+F19,FALSE)","v":0},{"$f":"VLOOKUP($C19,Norm!$B$19:$Y$52,18)","v":0},{"$f":"VLOOKUP($C19,Norm!$B$19:$Y$52,19)","v":0},{"$f":"VLOOKUP($C19,Norm!$B$19:$Y$52,20)","v":0},{"$f":"L19*M19+N19*O19","v":0},1,{"$f":"IF(F19=1,Norm!$D$3,IF(F19=2,Norm!$D$4,IF(F19=3,Norm!$D$5)))","v":185},0,{"$f":"Norm!$D$12","v":7},0,{"$f":"Norm!$D$7","v":10},{"$f":"VLOOKUP($C19,Norm!$B$19:$Y$52,23)","v":0},{"$f":"VLOOKUP($C19,Norm!$B$19:$Y$52,24)","v":0},{"$f":"VLOOKUP($C19,Norm!$B$19:$Y$52,21)","v":0},{"$f":"VLOOKUP($C19,Norm!$B$19:$Y$52,22)","v":0},185,185,"-"]
[9,0,9,"Gul sennep",{"$f":"IF('Efterafgrøde beslutningsstøtte'!A$19=\"Vintersæd\",1,IF(OR('Efterafgrøde beslutningsstøtte'!A$19=\"Vårsæd\",'Efterafgrøde beslutningsstøtte'!A$19=\"Fortsætter som græs - Kun MFO\"),2,\"Fejl\"))","v":2},{"$f":"IF('Efterafgrøde beslutningsstøtte'!A$13=\"Ved såning af primærafgrøde\",1,IF('Efterafgrøde beslutningsstøtte'!A$13=\"Egnet til udsåning ved sidste radrensning\",2,IF('Efterafgrøde beslutningsstøtte'!A$13=\"Efter høst af primærafgrøde\",3,\"Fejl\")))","v":3},{"$f":"IF('Efterafgrøde beslutningsstøtte'!A$16=\"Sand\",1,IF('Efterafgrøde beslutningsstøtte'!A$16=\"Ler\",2,\"Fejl\"))","v":2},14,{"$f":"IF($G$9<>\"Fortsætter som græs - Kun MFO\",VLOOKUP(C20,Norm!$B$19:$Y$52,H20,FALSE),0)","v":4},{"$f":"IF(E20=1,Norm!$D$9,Norm!$D$10)","v":220},880,{"$f":"VLOOKUP(C20,Norm!$B$19:$Y$52,14+F20,FALSE)","v":10},{"$f":"VLOOKUP($C20,Norm!$B$19:$Y$52,18)","v":25},{"$f":"VLOOKUP($C20,Norm!$B$19:$Y$52,19)","v":0},{"$f":"VLOOKUP($C20,Norm!$B$19:$Y$52,20)","v":0},250,1,{"$f":"IF(F20=1,Norm!$D$3,IF(F20=2,Norm!$D$4,IF(F20=3,Norm!$D$5)))","v":185},4,{"$f":"Norm!$D$12","v":7},4,{"$f":"Norm!$D$7","v":10},{"$f":"VLOOKUP($C20,Norm!$B$19:$Y$52,23)","v":0},{"$f":"VLOOKUP($C20,Norm!$B$19:$Y$52,24)","v":0},{"$f":"VLOOKUP($C20,Norm!$B$19:$Y$52,21)","v":0},{"$f":"VLOOKUP($C20,Norm!$B$19:$Y$52,22)","v":0},253,503,377]
[10,0,10,"Olieræddike",{"$f":"IF('Efterafgrøde beslutningsstøtte'!A$19=\"Vintersæd\",1,IF(OR('Efterafgrøde beslutningsstøtte'!A$19=\"Vårsæd\",'Efterafgrøde beslutningsstøtte'!A$19=\"Fortsætter som græs - Kun MFO\"),2,\"Fejl\"))","v":2},{"$f":"IF('Efterafgrøde beslutningsstøtte'!A$13=\"Ved såning af primærafgrøde\",1,IF('Efterafgrøde beslutningsstøtte'!A$13=\"Egnet til udsåning ved sidste radrensning\",2,IF('Efterafgrøde beslutningsstøtte'!A$13=\"Efter høst af primærafgrøde\",3,\"Fejl\")))","v":3},{"$f":"IF('Efterafgrøde beslutningsstøtte'!A$16=\"Sand\",1,IF('Efterafgrøde beslutningsstøtte'!A$16=\"Ler\",2,\"Fejl\"))","v":2},14,{"$f":"IF($G$9<>\"Fortsætter som græs - Kun MFO\",VLOOKUP(C21,Norm!$B$19:$Y$52,H21,FALSE),0)","v":4},{"$f":"IF(E21=1,Norm!$D$9,Norm!$D$10)","v":220},880,{"$f":"VLOOKUP(C21,Norm!$B$19:$Y$52,14+F21,FALSE)","v":12},{"$f":"VLOOKUP($C21,Norm!$B$19:$Y$52,18)","v":33},{"$f":"VLOOKUP($C21,Norm!$B$19:$Y$52,19)","v":0},{"$f":"VLOOKUP($C21,Norm!$B$19:$Y$52,20)","v":0},396,1,{"$f":"IF(F21=1,Norm!$D$3,IF(F21=2,Norm!$D$4,IF(F21=3,Norm!$D$5)))","v":185},4,{"$f":"Norm!$D$12","v":7},4,{"$f":"Norm!$D$7","v":10},{"$f":"VLOOKUP($C21,Norm!$B$19:$Y$52,23)","v":0},{"$f":"VLOOKUP($C21,Norm!$B$19:$Y$52,24)","v":0},{"$f":"VLOOKUP($C21,Norm!$B$19:$Y$52,21)","v":0},{"$f":"VLOOKUP($C21,Norm!$B$19:$Y$52,22)","v":0},253,649,231]
[11,0,11,"Blanding med bælsæd udvintrene",{"$f":"IF('Efterafgrøde beslutningsstøtte'!A$19=\"Vintersæd\",1,IF(OR('Efterafgrøde beslutningsstøtte'!A$19=\"Vårsæd\",'Efterafgrøde beslutningsstøtte'!A$19=\"Fortsætter som græs - Kun MFO\"),2,\"Fejl\"))","v":2},{"$f":"IF('Efterafgrøde beslutningsstøtte'!A$13=\"Ved såning af primærafgrøde\",1,IF('Efterafgrøde beslutningsstøtte'!A$13=\"Egnet til udsåning ved sidste radrensning\",2,IF('Efterafgrøde beslutningsstøtte'!A$13=\"Efter høst af primærafgrøde\",3,\"Fejl\")))","v":3},{"$f":"IF('Efterafgrøde beslutningsstøtte'!A$16=\"Sand\",1,IF('Efterafgrøde beslutningsstøtte'!A$16=\"Ler\",2,\"Fejl\"))","v":2},14,{"$f":"IF($G$9<>\"Fortsætter som græs - Kun MFO\",VLOOKUP(C22,Norm!$B$19:$Y$52,H22,FALSE),0)","v":4},{"$f":"IF(E22=1,Norm!$D$9,Norm!$D$10)","v":220},880,{"$f":"VLOOKUP(C22,Norm!$B$19:$Y$52,14+F22,FALSE)","v":102},{"$f":"VLOOKUP($C22,Norm!$B$19:$Y$52,18)","v":32},{"$f":"VLOOKUP($C22,Norm!$B$19:$Y$52,19)","v":0},{"$f":"VLOOKUP($C22,Norm!$B$19:$Y$52,20)","v":0},3264,1,{"$f":"IF(F22=1,Norm!$D$3,IF(F22=2,Norm!$D$4,IF(F22=3,Norm!$D$5)))","v":185},4,{"$f":"Norm!$D$12","v":7},4,{"$f":"Norm!$D$7","v":10},{"$f":"VLOOKUP($C22,Norm!$B$19:$Y$52,23)","v":0},{"$f":"VLOOKUP($C22,Norm!$B$19:$Y$52,24)","v":0},{"$f":"VLOOKUP($C22,Norm!$B$19:$Y$52,21)","v":0},{"$f":"VLOOKUP($C22,Norm!$B$19:$Y$52,22)","v":0},253,3517,-2637]
[12,0,12,"Vinterraps , linie",{"$f":"IF('Efterafgrøde beslutningsstøtte'!A$19=\"Vintersæd\",1,IF(OR('Efterafgrøde beslutningsstøtte'!A$19=\"Vårsæd\",'Efterafgrøde beslutningsstøtte'!A$19=\"Fortsætter som græs - Kun MFO\"),2,\"Fejl\"))","v":2},{"$f":"IF('Efterafgrøde beslutningsstøtte'!A$13=\"Ved såning af primærafgrøde\",1,IF('Efterafgrøde beslutningsstøtte'!A$13=\"Egnet til udsåning ved sidste radrensning\",2,IF('Efterafgrøde beslutningsstøtte'!A$13=\"Efter høst af primærafgrøde\",3,\"Fejl\")))","v":3},{"$f":"IF('Efterafgrøde beslutningsstøtte'!A$16=\"Sand\",1,IF('Efterafgrøde beslutningsstøtte'!A$16=\"Ler\",2,\"Fejl\"))","v":2},14,{"$f":"IF($G$9<>\"Fortsætter som græs - Kun MFO\",VLOOKUP(C23,Norm!$B$19:$Y$52,H23,FALSE),0)","v":3},{"$f":"IF(E23=1,Norm!$D$9,Norm!$D$10)","v":220},660,{"$f":"VLOOKUP(C23,Norm!$B$19:$Y$52,14+F23,FALSE)","v":5},{"$f":"VLOOKUP($C23,Norm!$B$19:$Y$52,18)","v":180},{"$f":"VLOOKUP($C23,Norm!$B$19:$Y$52,19)","v":0},{"$f":"VLOOKUP($C23,Norm!$B$19:$Y$52,20)","v":0},900,1,{"$f":"IF(F23=1,Norm!$D$3,IF(F23=2,Norm!$D$4,IF(F23=3,Norm!$D$5)))","v":185},3,{"$f":"Norm!$D$12","v":7},3,{"$f":"Norm!$D$7","v":10},{"$f":"VLOOKUP($C23,Norm!$B$19:$Y$52,23)","v":0},{"$f":"VLOOKUP($C23,Norm!$B$19:$Y$52,24)","v":0},{"$f":"VLOOKUP($C23,Norm!$B$19:$Y$52,21)","v":0},{"$f":"VLOOKUP($C23,Norm!$B$19:$Y$52,22)","v":0},236,1136,-476]
[13,0,13,"Foderradise (Strukturator)",{"$f":"IF('Efterafgrøde beslutningsstøtte'!A$19=\"Vintersæd\",1,IF(OR('Efterafgrøde beslutningsstøtte'!A$19=\"Vårsæd\",'Efterafgrøde beslutningsstøtte'!A$19=\"Fortsætter som græs - Kun MFO\"),2,\"Fejl\"))","v":2},{"$f":"IF('Efterafgrøde beslutningsstøtte'!A$13=\"Ved såning af primærafgrøde\",1,IF('Efterafgrøde beslutningsstøtte'!A$13=\"Egnet til udsåning ved sidste radrensning\",2,IF('Efterafgrøde beslutningsstøtte'!A$13=\"Efter høst af primærafgrøde\",3,\"Fejl\")))","v":3},{"$f":"IF('Efterafgrøde beslutningsstøtte'!A$16=\"Sand\",1,IF('Efterafgrøde beslutningsstøtte'!A$16=\"Ler\",2,\"Fejl\"))","v":2},14,{"$f":"IF($G$9<>\"Fortsætter som græs - Kun MFO\",VLOOKUP(C24,Norm!$B$19:$Y$52,H24,FALSE),0)","v":4},{"$f":"IF(E24=1,Norm!$D$9,Norm!$D$10)","v":220},880,{"$f":"VLOOKUP(C24,Norm!$B$19:$Y$52,14+F24,FALSE)","v":12},{"$f":"VLOOKUP($C24,Norm!$B$19:$Y$52,18)","v":55},{"$f":"VLOOKUP($C24,Norm!$B$19:$Y$52,19)","v":0},{"$f":"VLOOKUP($C24,Norm!$B$19:$Y$52,20)","v":0},660,1,{"$f":"IF(F24=1,Norm!$D$3,IF(F24=2,Norm!$D$4,IF(F24=3,Norm!$D$5)))","v":185},4,{"$f":"Norm!$D$12","v":7},4,{"$f":"Norm!$D$7","v":10},{"$f":"VLOOKUP($C24,Norm!$B$19:$Y$52,23)","v":0},{"$f":"VLOOKUP($C24,Norm!$B$19:$Y$52,24)","v":0},{"$f":"VLOOKUP($C24,Norm!$B$19:$Y$52,21)","v":0},{"$f":"VLOOKUP($C24,Norm!$B$19:$Y$52,22)","v":0},253,913,-33]
[14,0,14,"Havre",{"$f":"IF('Efterafgrøde beslutningsstøtte'!A$19=\"Vintersæd\",1,IF(OR('Efterafgrøde beslutningsstøtte'!A$19=\"Vårsæd\",'Efterafgrøde beslutningsstøtte'!A$19=\"Fortsætter som græs - Kun MFO\"),2,\"Fejl\"))","v":2},{"$f":"IF('Efterafgrøde beslutningsstøtte'!A$13=\"Ved såning af primærafgrøde\",1,IF('Efterafgrøde beslutningsstøtte'!A$13=\"Egnet til udsåning ved sidste radrensning\",2,IF('Efterafgrøde beslutningsstøtte'!A$13=\"Efter høst af primærafgrøde\",3,\"Fejl\")))","v":3},{"$f":"IF('Efterafgrøde beslutningsstøtte'!A$16=\"Sand\",1,IF('Efterafgrøde beslutningsstøtte'!A$16=\"Ler\",2,\"Fejl\"))","v":2},14,{"$f":"IF($G$9<>\"Fortsætter som græs - Kun MFO\",VLOOKUP(C25,Norm!$B$19:$Y$52,H25,FALSE),0)","v":1},{"$f":"IF(E25=1,Norm!$D$9,Norm!$D$10)","v":220},220,{"$f":"VLOOKUP(C25,Norm!$B$19:$Y$52,14+F25,FALSE)","v":150},{"$f":"VLOOKUP($C25,Norm!$B$19:$Y$52,18)","v":4.5},{"$f":"VLOOKUP($C25,Norm!$B$19:$Y$52,19)","v":0},{"$f":"VLOOKUP($C25,Norm!$B$19:$Y$52,20)","v":0},675,1,{"$f":"IF(F25=1,Norm!$D$3,IF(F25=2,Norm!$D$4,IF(F25=3,Norm!$D$5)))","v":185},1,{"$f":"Norm!$D$12","v":7},1,{"$f":"Norm!$D$7","v":10},{"$f":"VLOOKUP($C25,Norm!$B$19:$Y$52,23)","v":0},{"$f":"VLOOKUP($C25,Norm!$B$19:$Y$52,24)","v":0},{"$f":"VLOOKUP($C25,Norm!$B$19:$Y$52,21)","v":0},{"$f":"VLOOKUP($C25,Norm!$B$19:$Y$52,22)","v":0},202,877,-657]
[15,0,15,"Boghvede",{"$f":"IF('Efterafgrøde beslutningsstøtte'!A$19=\"Vintersæd\",1,IF(OR('Efterafgrøde beslutningsstøtte'!A$19=\"Vårsæd\",'Efterafgrøde beslutningsstøtte'!A$19=\"Fortsætter som græs - Kun MFO\"),2,\"Fejl\"))","v":2},{"$f":"IF('Efterafgrøde beslutningsstøtte'!A$13=\"Ved såning af primærafgrøde\",1,IF('Efterafgrøde beslutningsstøtte'!A$13=\"Egnet til udsåning ved sidste radrensning\",2,IF('Efterafgrøde beslutningsstøtte'!A$13=\"Efter høst af primærafgrøde\",3,\"Fejl\")))","v":3},{"$f":"IF('Efterafgrøde beslutningsstøtte'!A$16=\"Sand\",1,IF('Efterafgrøde beslutningsstøtte'!A$16=\"Ler\",2,\"Fejl\"))","v":2},14,{"$f":"IF($G$9<>\"Fortsætter som græs - Kun MFO\",VLOOKUP(C26,Norm!$B$19:$Y$52,H26,FALSE),0)","v":1},{"$f":"IF(E26=1,Norm!$D$9,Norm!$D$10)","v":220},220,{"$f":"VLOOKUP(C26,Norm!$B$19:$Y$52,14+F26,FALSE)","v":50},{"$f":"VLOOKUP($C26,Norm!$B$19:$Y$52,18)","v":35},{"$f":"VLOOKUP($C26,Norm!$B$19:$Y$52,19)","v":0},{"$f":"VLOOKUP($C26,Norm!$B$19:$Y$52,20)","v":0},1750,1,{"$f":"IF(F26=1,Norm!$D$3,IF(F26=2,Norm!$D$4,IF(F26=3,Norm!$D$5)))","v":185},1,{"$f":"Norm!$D$12","v":7},1,{"$f":"Norm!$D$7","v":10},{"$f":"VLOOKUP($C26,Norm!$B$19:$Y$52,23)","v":0},{"$f":"VLOOKUP($C26,Norm!$B$19:$Y$52,24)","v":0},{"$f":"VLOOKUP($C26,Norm!$B$19:$Y$52,21)","v":0},{"$f":"VLOOKUP($C26,Norm!$B$19:$Y$52,22)","v":0},202,1952,-1732]
[16,0,16,"Vinterrybs",{"$f":"IF('Efterafgrøde beslutningsstøtte'!A$19=\"Vintersæd\",1,IF(OR('Efterafgrøde beslutningsstøtte'!A$19=\"Vårsæd\",'Efterafgrøde beslutningsstøtte'!A$19=\"Fortsætter som græs - Kun MFO\"),2,\"Fejl\"))","v":2},{"$f":"IF('Efterafgrøde beslutningsstøtte'!A$13=\"Ved såning af primærafgrøde\",1,IF('Efterafgrøde beslutningsstøtte'!A$13=\"Egnet til udsåning ved sidste radrensning\",2,IF('Efterafgrøde beslutningsstøtte'!A$13=\"Efter høst af primærafgrøde\",3,\"Fejl\")))","v":3},{"$f":"IF('Efterafgrøde beslutningsstøtte'!A$16=\"Sand\",1,IF('Efterafgrøde beslutningsstøtte'!A$16=\"Ler\",2,\"Fejl\"))","v":2},14,{"$f":"IF($G$9<>\"Fortsætter som græs - Kun MFO\",VLOOKUP(C27,Norm!$B$19:$Y$52,H27,FALSE),0)","v":4},{"$f":"IF(E27=1,Norm!$D$9,Norm!$D$10)","v":220},880,{"$f":"VLOOKUP(C27,Norm!$B$19:$Y$52,14+F27,FALSE)","v":7},{"$f":"VLOOKUP($C27,Norm!$B$19:$Y$52,18)","v":180},{"$f":"VLOOKUP($C27,Norm!$B$19:$Y$52,19)","v":0},{"$f":"VLOOKUP($C27,Norm!$B$19:$Y$52,20)","v":0},1260,1,{"$f":"IF(F27=1,Norm!$D$3,IF(F27=2,Norm!$D$4,IF(F27=3,Norm!$D$5)))","v":185},4,{"$f":"Norm!$D$12","v":7},4,{"$f":"Norm!$D$7","v":10},{"$f":"VLOOKUP($C27,Norm!$B$19:$Y$52,23)","v":0},{"$f":"VLOOKUP($C27,Norm!$B$19:$Y$52,24)","v":0},{"$f":"VLOOKUP($C27,Norm!$B$19:$Y$52,21)","v":0},{"$f":"VLOOKUP($C27,Norm!$B$19:$Y$52,22)","v":0},253,1513,-633]
[17,0,17,"Gul Lupin",{"$f":"IF('Efterafgrøde beslutningsstøtte'!A$19=\"Vintersæd\",1,IF(OR('Efterafgrøde beslutningsstøtte'!A$19=\"Vårsæd\",'Efterafgrøde beslutningsstøtte'!A$19=\"Fortsætter som græs - Kun MFO\"),2,\"Fejl\"))","v":2},{"$f":"IF('Efterafgrøde beslutningsstøtte'!A$13=\"Ved såning af primærafgrøde\",1,IF('Efterafgrøde beslutningsstøtte'!A$13=\"Egnet til udsåning ved sidste radrensning\",2,IF('Efterafgrøde beslutningsstøtte'!A$13=\"Efter høst af primærafgrøde\",3,\"Fejl\")))","v":3},{"$f":"IF('Efterafgrøde beslutningsstøtte'!A$16=\"Sand\",1,IF('Efterafgrøde beslutningsstøtte'!A$16=\"Ler\",2,\"Fejl\"))","v":2},14,{"$f":"IF($G$9<>\"Fortsætter som græs - Kun MFO\",VLOOKUP(C28,Norm!$B$19:$Y$52,H28,FALSE),0)","v":3},{"$f":"IF(E28=1,Norm!$D$9,Norm!$D$10)","v":220},660,{"$f":"VLOOKUP(C28,Norm!$B$19:$Y$52,14+F28,FALSE)","v":60},{"$f":"VLOOKUP($C28,Norm!$B$19:$Y$52,18)","v":8},{"$f":"VLOOKUP($C28,Norm!$B$19:$Y$52,19)","v":0},{"$f":"VLOOKUP($C28,Norm!$B$19:$Y$52,20)","v":0},480,1,{"$f":"IF(F28=1,Norm!$D$3,IF(F28=2,Norm!$D$4,IF(F28=3,Norm!$D$5)))","v":185},3,{"$f":"Norm!$D$12","v":7},3,{"$f":"Norm!$D$7","v":10},{"$f":"VLOOKUP($C28,Norm!$B$19:$Y$52,23)","v":0},{"$f":"VLOOKUP($C28,Norm!$B$19:$Y$52,24)","v":0},{"$f":"VLOOKUP($C28,Norm!$B$19:$Y$52,21)","v":0},{"$f":"VLOOKUP($C28,Norm!$B$19:$Y$52,22)","v":0},236,716,-56]
[18,0,18,"Vårbyg",{"$f":"IF('Efterafgrøde beslutningsstøtte'!A$19=\"Vintersæd\",1,IF(OR('Efterafgrøde beslutningsstøtte'!A$19=\"Vårsæd\",'Efterafgrøde beslutningsstøtte'!A$19=\"Fortsætter som græs - Kun MFO\"),2,\"Fejl\"))","v":2},{"$f":"IF('Efterafgrøde beslutningsstøtte'!A$13=\"Ved såning af primærafgrøde\",1,IF('Efterafgrøde beslutningsstøtte'!A$13=\"Egnet til udsåning ved sidste radrensning\",2,IF('Efterafgrøde beslutningsstøtte'!A$13=\"Efter høst af primærafgrøde\",3,\"Fejl\")))","v":3},{"$f":"IF('Efterafgrøde beslutningsstøtte'!A$16=\"Sand\",1,IF('Efterafgrøde beslutningsstøtte'!A$16=\"Ler\",2,\"Fejl\"))","v":2},14,{"$f":"IF($G$9<>\"Fortsætter som græs - Kun MFO\",VLOOKUP(C29,Norm!$B$19:$Y$52,H29,FALSE),0)","v":1},{"$f":"IF(E29=1,Norm!$D$9,Norm!$D$10)","v":220},220,{"$f":"VLOOKUP(C29,Norm!$B$19:$Y$52,14+F29,FALSE)","v":150},{"$f":"VLOOKUP($C29,Norm!$B$19:$Y$52,18)","v":4.5},{"$f":"VLOOKUP($C29,Norm!$B$19:$Y$52,19)","v":0},{"$f":"VLOOKUP($C29,Norm!$B$19:$Y$52,20)","v":0},675,1,{"$f":"IF(F29=1,Norm!$D$3,IF(F29=2,Norm!$D$4,IF(F29=3,Norm!$D$5)))","v":185},1,{"$f":"Norm!$D$12","v":7},1,{"$f":"Norm!$D$7","v":10},{"$f":"VLOOKUP($C29,Norm!$B$19:$Y$52,23)","v":0},{"$f":"VLOOKUP($C29,Norm!$B$19:$Y$52,24)","v":0},{"$f":"VLOOKUP($C29,Norm!$B$19:$Y$52,21)","v":0},{"$f":"VLOOKUP($C29,Norm!$B$19:$Y$52,22)","v":0},202,877,-657]
[19,0,19,"vårbyg/fodervikke",{"$f":"IF('Efterafgrøde beslutningsstøtte'!A$19=\"Vintersæd\",1,IF(OR('Efterafgrøde beslutningsstøtte'!A$19=\"Vårsæd\",'Efterafgrøde beslutningsstøtte'!A$19=\"Fortsætter som græs - Kun MFO\"),2,\"Fejl\"))","v":2},{"$f":"IF('Efterafgrøde beslutningsstøtte'!A$13=\"Ved såning af primærafgrøde\",1,IF('Efterafgrøde beslutningsstøtte'!A$13=\"Egnet til udsåning ved sidste radrensning\",2,IF('Efterafgrøde beslutningsstøtte'!A$13=\"Efter høst af primærafgrøde\",3,\"Fejl\")))","v":3},{"$f":"IF('Efterafgrøde beslutningsstøtte'!A$16=\"Sand\",1,IF('Efterafgrøde beslutningsstøtte'!A$16=\"Ler\",2,\"Fejl\"))","v":2},14,{"$f":"IF($G$9<>\"Fortsætter som græs - Kun MFO\",VLOOKUP(C30,Norm!$B$19:$Y$52,H30,FALSE),0)","v":2},{"$f":"IF(E30=1,Norm!$D$9,Norm!$D$10)","v":220},440,{"$f":"VLOOKUP(C30,Norm!$B$19:$Y$52,14+F30,FALSE)","v":130},{"$f":"VLOOKUP($C30,Norm!$B$19:$Y$52,18)","v":10},{"$f":"VLOOKUP($C30,Norm!$B$19:$Y$52,19)","v":0},{"$f":"VLOOKUP($C30,Norm!$B$19:$Y$52,20)","v":0},1300,1,{"$f":"IF(F30=1,Norm!$D$3,IF(F30=2,Norm!$D$4,IF(F30=3,Norm!$D$5)))","v":185},2,{"$f":"Norm!$D$12","v":7},2,{"$f":"Norm!$D$7","v":10},{"$f":"VLOOKUP($C30,Norm!$B$19:$Y$52,23)","v":0},{"$f":"VLOOKUP($C30,Norm!$B$19:$Y$52,24)","v":0},{"$f":"VLOOKUP($C30,Norm!$B$19:$Y$52,21)","v":0},{"$f":"VLOOKUP($C30,Norm!$B$19:$Y$52,22)","v":0},219,1519,-1079]
[20,0,20,"Vinterrug ",{"$f":"IF('Efterafgrøde beslutningsstøtte'!A$19=\"Vintersæd\",1,IF(OR('Efterafgrøde beslutningsstøtte'!A$19=\"Vårsæd\",'Efterafgrøde beslutningsstøtte'!A$19=\"Fortsætter som græs - Kun MFO\"),2,\"Fejl\"))","v":2},{"$f":"IF('Efterafgrøde beslutningsstøtte'!A$13=\"Ved såning af primærafgrøde\",1,IF('Efterafgrøde beslutningsstøtte'!A$13=\"Egnet til udsåning ved sidste radrensning\",2,IF('Efterafgrøde beslutningsstøtte'!A$13=\"Efter høst af primærafgrøde\",3,\"Fejl\")))","v":3},{"$f":"IF('Efterafgrøde beslutningsstøtte'!A$16=\"Sand\",1,IF('Efterafgrøde beslutningsstøtte'!A$16=\"Ler\",2,\"Fejl\"))","v":2},14,{"$f":"IF($G$9<>\"Fortsætter som græs - Kun MFO\",VLOOKUP(C31,Norm!$B$19:$Y$52,H31,FALSE),0)","v":2},{"$f":"IF(E31=1,Norm!$D$9,Norm!$D$10)","v":220},440,{"$f":"VLOOKUP(C31,Norm!$B$19:$Y$52,14+F31,FALSE)","v":140},{"$f":"VLOOKUP($C31,Norm!$B$19:$Y$52,18)","v":4.5},{"$f":"VLOOKUP($C31,Norm!$B$19:$Y$52,19)","v":0},{"$f":"VLOOKUP($C31,Norm!$B$19:$Y$52,20)","v":0},630,1,{"$f":"IF(F31=1,Norm!$D$3,IF(F31=2,Norm!$D$4,IF(F31=3,Norm!$D$5)))","v":185},2,{"$f":"Norm!$D$12","v":7},2,{"$f":"Norm!$D$7","v":10},{"$f":"VLOOKUP($C31,Norm!$B$19:$Y$52,23)","v":0},{"$f":"VLOOKUP($C31,Norm!$B$19:$Y$52,24)","v":0},{"$f":"VLOOKUP($C31,Norm!$B$19:$Y$52,21)","v":0},{"$f":"VLOOKUP($C31,Norm!$B$19:$Y$52,22)","v":0},219,849,-409]
[21,0,21,"Olierædikke/gul sennep ",{"$f":"IF('Efterafgrøde beslutningsstøtte'!A$19=\"Vintersæd\",1,IF(OR('Efterafgrøde beslutningsstøtte'!A$19=\"Vårsæd\",'Efterafgrøde beslutningsstøtte'!A$19=\"Fortsætter som græs - Kun MFO\"),2,\"Fejl\"))","v":2},{"$f":"IF('Efterafgrøde beslutningsstøtte'!A$13=\"Ved såning af primærafgrøde\",1,IF('Efterafgrøde beslutningsstøtte'!A$13=\"Egnet til udsåning ved sidste radrensning\",2,IF('Efterafgrøde beslutningsstøtte'!A$13=\"Efter høst af primærafgrøde\",3,\"Fejl\")))","v":3},{"$f":"IF('Efterafgrøde beslutningsstøtte'!A$16=\"Sand\",1,IF('Efterafgrøde beslutningsstøtte'!A$16=\"Ler\",2,\"Fejl\"))","v":2},14,{"$f":"IF($G$9<>\"Fortsætter som græs - Kun MFO\",VLOOKUP(C32,Norm!$B$19:$Y$52,H32,FALSE),0)","v":2},{"$f":"IF(E32=1,Norm!$D$9,Norm!$D$10)","v":220},440,{"$f":"VLOOKUP(C32,Norm!$B$19:$Y$52,14+F32,FALSE)","v":11},{"$f":"VLOOKUP($C32,Norm!$B$19:$Y$52,18)","v":16},{"$f":"VLOOKUP($C32,Norm!$B$19:$Y$52,19)","v":0},{"$f":"VLOOKUP($C32,Norm!$B$19:$Y$52,20)","v":0},176,1,{"$f":"IF(F32=1,Norm!$D$3,IF(F32=2,Norm!$D$4,IF(F32=3,Norm!$D$5)))","v":185},2,{"$f":"Norm!$D$12","v":7},2,{"$f":"Norm!$D$7","v":10},{"$f":"VLOOKUP($C32,Norm!$B$19:$Y$52,23)","v":0},{"$f":"VLOOKUP($C32,Norm!$B$19:$Y$52,24)","v":0},{"$f":"VLOOKUP($C32,Norm!$B$19:$Y$52,21)","v":0},{"$f":"VLOOKUP($C32,Norm!$B$19:$Y$52,22)","v":0},219,395,45]
[22,0,22,"Blanding med bælsæd overvintrene",{"$f":"IF('Efterafgrøde beslutningsstøtte'!A$19=\"Vintersæd\",1,IF(OR('Efterafgrøde beslutningsstøtte'!A$19=\"Vårsæd\",'Efterafgrøde beslutningsstøtte'!A$19=\"Fortsætter som græs - Kun MFO\"),2,\"Fejl\"))","v":2},{"$f":"IF('Efterafgrøde beslutningsstøtte'!A$13=\"Ved såning af primærafgrøde\",1,IF('Efterafgrøde beslutningsstøtte'!A$13=\"Egnet til udsåning ved sidste radrensning\",2,IF('Efterafgrøde beslutningsstøtte'!A$13=\"Efter høst af primærafgrøde\",3,\"Fejl\")))","v":3},{"$f":"IF('Efterafgrøde beslutningsstøtte'!A$16=\"Sand\",1,IF('Efterafgrøde beslutningsstøtte'!A$16=\"Ler\",2,\"Fejl\"))","v":2},14,{"$f":"IF($G$9<>\"Fortsætter som græs - Kun MFO\",VLOOKUP(C33,Norm!$B$19:$Y$52,H33,FALSE),0)","v":2},{"$f":"IF(E33=1,Norm!$D$9,Norm!$D$10)","v":220},440,{"$f":"VLOOKUP(C33,Norm!$B$19:$Y$52,14+F33,FALSE)","v":22},{"$f":"VLOOKUP($C33,Norm!$B$19:$Y$52,18)","v":70},{"$f":"VLOOKUP($C33,Norm!$B$19:$Y$52,19)","v":0},{"$f":"VLOOKUP($C33,Norm!$B$19:$Y$52,20)","v":0},1540,1,{"$f":"IF(F33=1,Norm!$D$3,IF(F33=2,Norm!$D$4,IF(F33=3,Norm!$D$5)))","v":185},2,{"$f":"Norm!$D$12","v":7},2,{"$f":"Norm!$D$7","v":10},{"$f":"VLOOKUP($C33,Norm!$B$19:$Y$52,23)","v":0},{"$f":"VLOOKUP($C33,Norm!$B$19:$Y$52,24)","v":0},{"$f":"VLOOKUP($C33,Norm!$B$19:$Y$52,21)","v":0},{"$f":"VLOOKUP($C33,Norm!$B$19:$Y$52,22)","v":0},219,1759,-1319]
[23,0,23,"Blanding uden bælgsæd udvintrene",{"$f":"IF('Efterafgrøde beslutningsstøtte'!A$19=\"Vintersæd\",1,IF(OR('Efterafgrøde beslutningsstøtte'!A$19=\"Vårsæd\",'Efterafgrøde beslutningsstøtte'!A$19=\"Fortsætter som græs - Kun MFO\"),2,\"Fejl\"))","v":2},{"$f":"IF('Efterafgrøde beslutningsstøtte'!A$13=\"Ved såning af primærafgrøde\",1,IF('Efterafgrøde beslutningsstøtte'!A$13=\"Egnet til udsåning ved sidste radrensning\",2,IF('Efterafgrøde beslutningsstøtte'!A$13=\"Efter høst af primærafgrøde\",3,\"Fejl\")))","v":3},{"$f":"IF('Efterafgrøde beslutningsstøtte'!A$16=\"Sand\",1,IF('Efterafgrøde beslutningsstøtte'!A$16=\"Ler\",2,\"Fejl\"))","v":2},14,{"$f":"IF($G$9<>\"Fortsætter som græs - Kun MFO\",VLOOKUP(C34,Norm!$B$19:$Y$52,H34,FALSE),0)","v":2},{"$f":"IF(E34=1,Norm!$D$9,Norm!$D$10)","v":220},440,{"$f":"VLOOKUP(C34,Norm!$B$19:$Y$52,14+F34,FALSE)","v":30},{"$f":"VLOOKUP($C34,Norm!$B$19:$Y$52,18)","v":35},{"$f":"VLOOKUP($C34,Norm!$B$19:$Y$52,19)","v":0},{"$f":"VLOOKUP($C34,Norm!$B$19:$Y$52,20)","v":0},1050,1,{"$f":"IF(F34=1,Norm!$D$3,IF(F34=2,Norm!$D$4,IF(F34=3,Norm!$D$5)))","v":185},2,{"$f":"Norm!$D$12","v":7},2,{"$f":"Norm!$D$7","v":10},{"$f":"VLOOKUP($C34,Norm!$B$19:$Y$52,23)","v":0},{"$f":"VLOOKUP($C34,Norm!$B$19:$Y$52,24)","v":0},{"$f":"VLOOKUP($C34,Norm!$B$19:$Y$52,21)","v":0},{"$f":"VLOOKUP($C34,Norm!$B$19:$Y$52,22)","v":0},219,1269,-829]
[24,0,24,"Cikorie",{"$f":"IF('Efterafgrøde beslutningsstøtte'!A$19=\"Vintersæd\",1,IF(OR('Efterafgrøde beslutningsstøtte'!A$19=\"Vårsæd\",'Efterafgrøde beslutningsstøtte'!A$19=\"Fortsætter som græs - Kun MFO\"),2,\"Fejl\"))","v":2},{"$f":"IF('Efterafgrøde beslutningsstøtte'!A$13=\"Ved såning af primærafgrøde\",1,IF('Efterafgrøde beslutningsstøtte'!A$13=\"Egnet til udsåning ved sidste radrensning\",2,IF('Efterafgrøde beslutningsstøtte'!A$13=\"Efter høst af primærafgrøde\",3,\"Fejl\")))","v":3},{"$f":"IF('Efterafgrøde beslutningsstøtte'!A$16=\"Sand\",1,IF('Efterafgrøde beslutningsstøtte'!A$16=\"Ler\",2,\"Fejl\"))","v":2},14,{"$f":"IF($G$9<>\"Fortsætter som græs - Kun MFO\",VLOOKUP(C35,Norm!$B$19:$Y$52,H35,FALSE),0)","v":0},{"$f":"IF(E35=1,Norm!$D$9,Norm!$D$10)","v":220},0,{"$f":"VLOOKUP(C35,Norm!$B$19:$Y$52,14+F35,FALSE)","v":0},{"$f":"VLOOKUP($C35,Norm!$B$19:$Y$52,18)","v":167},{"$f":"VLOOKUP($C35,Norm!$B$19:$Y$52,19)","v":0},{"$f":"VLOOKUP($C35,Norm!$B$19:$Y$52,20)","v":0},0,1,{"$f":"IF(F35=1,Norm!$D$3,IF(F35=2,Norm!$D$4,IF(F35=3,Norm!$D$5)))","v":185},0,{"$f":"Norm!$D$12","v":7},0,{"$f":"Norm!$D$7","v":10},{"$f":"VLOOKUP($C35,Norm!$B$19:$Y$52,23)","v":0},{"$f":"VLOOKUP($C35,Norm!$B$19:$Y$52,24)","v":0},{"$f":"VLOOKUP($C35,Norm!$B$19:$Y$52,21)","v":0},{"$f":"VLOOKUP($C35,Norm!$B$19:$Y$52,22)","v":0},185,185,"-"]
[25,0,25,"Honningurt",{"$f":"IF('Efterafgrøde beslutningsstøtte'!A$19=\"Vintersæd\",1,IF(OR('Efterafgrøde beslutningsstøtte'!A$19=\"Vårsæd\",'Efterafgrøde beslutningsstøtte'!A$19=\"Fortsætter som græs - Kun MFO\"),2,\"Fejl\"))","v":2},{"$f":"IF('Efterafgrøde beslutningsstøtte'!A$13=\"Ved såning af primærafgrøde\",1,IF('Efterafgrøde beslutningsstøtte'!A$13=\"Egnet til udsåning ved sidste radrensning\",2,IF('Efterafgrøde beslutningsstøtte'!A$13=\"Efter høst af primærafgrøde\",3,\"Fejl\")))","v":3},{"$f":"IF('Efterafgrøde beslutningsstøtte'!A$16=\"Sand\",1,IF('Efterafgrøde beslutningsstøtte'!A$16=\"Ler\",2,\"Fejl\"))","v":2},14,{"$f":"IF($G$9<>\"Fortsætter som græs - Kun MFO\",VLOOKUP(C36,Norm!$B$19:$Y$52,H36,FALSE),0)","v":1},{"$f":"IF(E36=1,Norm!$D$9,Norm!$D$10)","v":220},220,{"$f":"VLOOKUP(C36,Norm!$B$19:$Y$52,14+F36,FALSE)","v":15},{"$f":"VLOOKUP($C36,Norm!$B$19:$Y$52,18)","v":140},{"$f":"VLOOKUP($C36,Norm!$B$19:$Y$52,19)","v":0},{"$f":"VLOOKUP($C36,Norm!$B$19:$Y$52,20)","v":0},2100,1,{"$f":"IF(F36=1,Norm!$D$3,IF(F36=2,Norm!$D$4,IF(F36=3,Norm!$D$5)))","v":185},1,{"$f":"Norm!$D$12","v":7},1,{"$f":"Norm!$D$7","v":10},{"$f":"VLOOKUP($C36,Norm!$B$19:$Y$52,23)","v":0},{"$f":"VLOOKUP($C36,Norm!$B$19:$Y$52,24)","v":0},{"$f":"VLOOKUP($C36,Norm!$B$19:$Y$52,21)","v":0},{"$f":"VLOOKUP($C36,Norm!$B$19:$Y$52,22)","v":0},202,2302,-2082]
[26,0,26,"Fodervikke ",{"$f":"IF('Efterafgrøde beslutningsstøtte'!A$19=\"Vintersæd\",1,IF(OR('Efterafgrøde beslutningsstøtte'!A$19=\"Vårsæd\",'Efterafgrøde beslutningsstøtte'!A$19=\"Fortsætter som græs - Kun MFO\"),2,\"Fejl\"))","v":2},{"$f":"IF('Efterafgrøde beslutningsstøtte'!A$13=\"Ved såning af primærafgrøde\",1,IF('Efterafgrøde beslutningsstøtte'!A$13=\"Egnet til udsåning ved sidste radrensning\",2,IF('Efterafgrøde beslutningsstøtte'!A$13=\"Efter høst af primærafgrøde\",3,\"Fejl\")))","v":3},{"$f":"IF('Efterafgrøde beslutningsstøtte'!A$16=\"Sand\",1,IF('Efterafgrøde beslutningsstøtte'!A$16=\"Ler\",2,\"Fejl\"))","v":2},14,{"$f":"IF($G$9<>\"Fortsætter som græs - Kun MFO\",VLOOKUP(C37,Norm!$B$19:$Y$52,H37,FALSE),0)","v":4},{"$f":"IF(E37=1,Norm!$D$9,Norm!$D$10)","v":220},880,{"$f":"VLOOKUP(C37,Norm!$B$19:$Y$52,14+F37,FALSE)","v":120},{"$f":"VLOOKUP($C37,Norm!$B$19:$Y$52,18)","v":18},{"$f":"VLOOKUP($C37,Norm!$B$19:$Y$52,19)","v":0},{"$f":"VLOOKUP($C37,Norm!$B$19:$Y$52,20)","v":0},2160,1,{"$f":"IF(F37=1,Norm!$D$3,IF(F37=2,Norm!$D$4,IF(F37=3,Norm!$D$5)))","v":185},4,{"$f":"Norm!$D$12","v":7},4,{"$f":"Norm!$D$7","v":10},{"$f":"VLOOKUP($C37,Norm!$B$19:$Y$52,23)","v":0},{"$f":"VLOOKUP($C37,Norm!$B$19:$Y$52,24)","v":0},{"$f":"VLOOKUP($C37,Norm!$B$19:$Y$52,21)","v":0},{"$f":"VLOOKUP($C37,Norm!$B$19:$Y$52,22)","v":0},253,2413,-1533]
[27,0,27,"Vintervikke",{"$f":"IF('Efterafgrøde beslutningsstøtte'!A$19=\"Vintersæd\",1,IF(OR('Efterafgrøde beslutningsstøtte'!A$19=\"Vårsæd\",'Efterafgrøde beslutningsstøtte'!A$19=\"Fortsætter som græs - Kun MFO\"),2,\"Fejl\"))","v":2},{"$f":"IF('Efterafgrøde beslutningsstøtte'!A$13=\"Ved såning af primærafgrøde\",1,IF('Efterafgrøde beslutningsstøtte'!A$13=\"Egnet til udsåning ved sidste radrensning\",2,IF('Efterafgrøde beslutningsstøtte'!A$13=\"Efter høst af primærafgrøde\",3,\"Fejl\")))","v":3},{"$f":"IF('Efterafgrøde beslutningsstøtte'!A$16=\"Sand\",1,IF('Efterafgrøde beslutningsstøtte'!A$16=\"Ler\",2,\"Fejl\"))","v":2},14,{"$f":"IF($G$9<>\"Fortsætter som græs - Kun MFO\",VLOOKUP(C38,Norm!$B$19:$Y$52,H38,FALSE),0)","v":1},{"$f":"IF(E38=1,Norm!$D$9,Norm!$D$10)","v":220},220,{"$f":"VLOOKUP(C38,Norm!$B$19:$Y$52,14+F38,FALSE)","v":40},{"$f":"VLOOKUP($C38,Norm!$B$19:$Y$52,18)","v":25},{"$f":"VLOOKUP($C38,Norm!$B$19:$Y$52,19)","v":0},{"$f":"VLOOKUP($C38,Norm!$B$19:$Y$52,20)","v":0},1000,1,{"$f":"IF(F38=1,Norm!$D$3,IF(F38=2,Norm!$D$4,IF(F38=3,Norm!$D$5)))","v":185},1,{"$f":"Norm!$D$12","v":7},1,{"$f":"Norm!$D$7","v":10},{"$f":"VLOOKUP($C38,Norm!$B$19:$Y$52,23)","v":0},{"$f":"VLOOKUP($C38,Norm!$B$19:$Y$52,24)","v":0},{"$f":"VLOOKUP($C38,Norm!$B$19:$Y$52,21)","v":0},{"$f":"VLOOKUP($C38,Norm!$B$19:$Y$52,22)","v":0},202,1202,-982]
[28,0,28,"Alexandrinekløver",{"$f":"IF('Efterafgrøde beslutningsstøtte'!A$19=\"Vintersæd\",1,IF(OR('Efterafgrøde beslutningsstøtte'!A$19=\"Vårsæd\",'Efterafgrøde beslutningsstøtte'!A$19=\"Fortsætter som græs - Kun MFO\"),2,\"Fejl\"))","v":2},{"$f":"IF('Efterafgrøde beslutningsstøtte'!A$13=\"Ved såning af primærafgrøde\",1,IF('Efterafgrøde beslutningsstøtte'!A$13=\"Egnet til udsåning ved sidste radrensning\",2,IF('Efterafgrøde beslutningsstøtte'!A$13=\"Efter høst af primærafgrøde\",3,\"Fejl\")))","v":3},{"$f":"IF('Efterafgrøde beslutningsstøtte'!A$16=\"Sand\",1,IF('Efterafgrøde beslutningsstøtte'!A$16=\"Ler\",2,\"Fejl\"))","v":2},14,{"$f":"IF($G$9<>\"Fortsætter som græs - Kun MFO\",VLOOKUP(C39,Norm!$B$19:$Y$52,H39,FALSE),0)","v":1},{"$f":"IF(E39=1,Norm!$D$9,Norm!$D$10)","v":220},220,{"$f":"VLOOKUP(C39,Norm!$B$19:$Y$52,14+F39,FALSE)","v":20},{"$f":"VLOOKUP($C39,Norm!$B$19:$Y$52,18)","v":90},{"$f":"VLOOKUP($C39,Norm!$B$19:$Y$52,19)","v":0},{"$f":"VLOOKUP($C39,Norm!$B$19:$Y$52,20)","v":0},1800,1,{"$f":"IF(F39=1,Norm!$D$3,IF(F39=2,Norm!$D$4,IF(F39=3,Norm!$D$5)))","v":185},1,{"$f":"Norm!$D$12","v":7},1,{"$f":"Norm!$D$7","v":10},{"$f":"VLOOKUP($C39,Norm!$B$19:$Y$52,23)","v":0},{"$f":"VLOOKUP($C39,Norm!$B$19:$Y$52,24)","v":0},{"$f":"VLOOKUP($C39,Norm!$B$19:$Y$52,21)","v":0},{"$f":"VLOOKUP($C39,Norm!$B$19:$Y$52,22)","v":0},202,2002,-1782]
[29,0,29,"Hvidkløver",{"$f":"IF('Efterafgrøde beslutningsstøtte'!A$19=\"Vintersæd\",1,IF(OR('Efterafgrøde beslutningsstøtte'!A$19=\"Vårsæd\",'Efterafgrøde beslutningsstøtte'!A$19=\"Fortsætter som græs - Kun MFO\"),2,\"Fejl\"))","v":2},{"$f":"IF('Efterafgrøde beslutningsstøtte'!A$13=\"Ved såning af primærafgrøde\",1,IF('Efterafgrøde beslutningsstøtte'!A$13=\"Egnet til udsåning ved sidste radrensning\",2,IF('Efterafgrøde beslutningsstøtte'!A$13=\"Efter høst af primærafgrøde\",3,\"Fejl\")))","v":3},{"$f":"IF('Efterafgrøde beslutningsstøtte'!A$16=\"Sand\",1,IF('Efterafgrøde beslutningsstøtte'!A$16=\"Ler\",2,\"Fejl\"))","v":2},14,{"$f":"IF($G$9<>\"Fortsætter som græs - Kun MFO\",VLOOKUP(C40,Norm!$B$19:$Y$52,H40,FALSE),0)","v":0},{"$f":"IF(E40=1,Norm!$D$9,Norm!$D$10)","v":220},0,{"$f":"VLOOKUP(C40,Norm!$B$19:$Y$52,14+F40,FALSE)","v":0},{"$f":"VLOOKUP($C40,Norm!$B$19:$Y$52,18)","v":160},{"$f":"VLOOKUP($C40,Norm!$B$19:$Y$52,19)","v":0},{"$f":"VLOOKUP($C40,Norm!$B$19:$Y$52,20)","v":0},0,1,{"$f":"IF(F40=1,Norm!$D$3,IF(F40=2,Norm!$D$4,IF(F40=3,Norm!$D$5)))","v":185},0,{"$f":"Norm!$D$12","v":7},0,{"$f":"Norm!$D$7","v":10},{"$f":"VLOOKUP($C40,Norm!$B$19:$Y$52,23)","v":0},{"$f":"VLOOKUP($C40,Norm!$B$19:$Y$52,24)","v":0},{"$f":"VLOOKUP($C40,Norm!$B$19:$Y$52,21)","v":0},{"$f":"VLOOKUP($C40,Norm!$B$19:$Y$52,22)","v":0},185,185,"-"]
[30,0,30,"Olieræddike og fodervikke",{"$f":"IF('Efterafgrøde beslutningsstøtte'!A$19=\"Vintersæd\",1,IF(OR('Efterafgrøde beslutningsstøtte'!A$19=\"Vårsæd\",'Efterafgrøde beslutningsstøtte'!A$19=\"Fortsætter som græs - Kun MFO\"),2,\"Fejl\"))","v":2},{"$f":"IF('Efterafgrøde beslutningsstøtte'!A$13=\"Ved såning af primærafgrøde\",1,IF('Efterafgrøde beslutningsstøtte'!A$13=\"Egnet til udsåning ved sidste radrensning\",2,IF('Efterafgrøde beslutningsstøtte'!A$13=\"Efter høst af primærafgrøde\",3,\"Fejl\")))","v":3},{"$f":"IF('Efterafgrøde beslutningsstøtte'!A$16=\"Sand\",1,IF('Efterafgrøde beslutningsstøtte'!A$16=\"Ler\",2,\"Fejl\"))","v":2},14,{"$f":"IF($G$9<>\"Fortsætter som græs - Kun MFO\",VLOOKUP(C41,Norm!$B$19:$Y$52,H41,FALSE),0)","v":4},{"$f":"IF(E41=1,Norm!$D$9,Norm!$D$10)","v":220},880,{"$f":"VLOOKUP(C41,Norm!$B$19:$Y$52,14+F41,FALSE)","v":23},{"$f":"VLOOKUP($C41,Norm!$B$19:$Y$52,18)","v":25},{"$f":"VLOOKUP($C41,Norm!$B$19:$Y$52,19)","v":0},{"$f":"VLOOKUP($C41,Norm!$B$19:$Y$52,20)","v":0},575,1,{"$f":"IF(F41=1,Norm!$D$3,IF(F41=2,Norm!$D$4,IF(F41=3,Norm!$D$5)))","v":185},4,{"$f":"Norm!$D$12","v":7},4,{"$f":"Norm!$D$7","v":10},{"$f":"VLOOKUP($C41,Norm!$B$19:$Y$52,23)","v":0},{"$f":"VLOOKUP($C41,Norm!$B$19:$Y$52,24)","v":0},{"$f":"VLOOKUP($C41,Norm!$B$19:$Y$52,21)","v":0},{"$f":"VLOOKUP($C41,Norm!$B$19:$Y$52,22)","v":0},253,828,52]
[31,0,31,"Hvidkløver/alm. rajgræs",{"$f":"IF('Efterafgrøde beslutningsstøtte'!A$19=\"Vintersæd\",1,IF(OR('Efterafgrøde beslutningsstøtte'!A$19=\"Vårsæd\",'Efterafgrøde beslutningsstøtte'!A$19=\"Fortsætter som græs - Kun MFO\"),2,\"Fejl\"))","v":2},{"$f":"IF('Efterafgrøde beslutningsstøtte'!A$13=\"Ved såning af primærafgrøde\",1,IF('Efterafgrøde beslutningsstøtte'!A$13=\"Egnet til udsåning ved sidste radrensning\",2,IF('Efterafgrøde beslutningsstøtte'!A$13=\"Efter høst af primærafgrøde\",3,\"Fejl\")))","v":3},{"$f":"IF('Efterafgrøde beslutningsstøtte'!A$16=\"Sand\",1,IF('Efterafgrøde beslutningsstøtte'!A$16=\"Ler\",2,\"Fejl\"))","v":2},14,{"$f":"IF($G$9<>\"Fortsætter som græs - Kun MFO\",VLOOKUP(C42,Norm!$B$19:$Y$52,H42,FALSE),0)","v":0},{"$f":"IF(E42=1,Norm!$D$9,Norm!$D$10)","v":220},0,{"$f":"VLOOKUP(C42,Norm!$B$19:$Y$52,14+F42,FALSE)","v":0},{"$f":"VLOOKUP($C42,Norm!$B$19:$Y$52,18)","v":80},{"$f":"VLOOKUP($C42,Norm!$B$19:$Y$52,19)","v":0},{"$f":"VLOOKUP($C42,Norm!$B$19:$Y$52,20)","v":0},0,1,{"$f":"IF(F42=1,Norm!$D$3,IF(F42=2,Norm!$D$4,IF(F42=3,Norm!$D$5)))","v":185},0,{"$f":"Norm!$D$12","v":7},0,{"$f":"Norm!$D$7","v":10},{"$f":"VLOOKUP($C42,Norm!$B$19:$Y$52,23)","v":0},{"$f":"VLOOKUP($C42,Norm!$B$19:$Y$52,24)","v":0},{"$f":"VLOOKUP($C42,Norm!$B$19:$Y$52,21)","v":0},{"$f":"VLOOKUP($C42,Norm!$B$19:$Y$52,22)","v":0},185,185,"-"]
[32,0,32,"Rødkløver/strandsvingel",{"$f":"IF('Efterafgrøde beslutningsstøtte'!A$19=\"Vintersæd\",1,IF(OR('Efterafgrøde beslutningsstøtte'!A$19=\"Vårsæd\",'Efterafgrøde beslutningsstøtte'!A$19=\"Fortsætter som græs - Kun MFO\"),2,\"Fejl\"))","v":2},{"$f":"IF('Efterafgrøde beslutningsstøtte'!A$13=\"Ved såning af primærafgrøde\",1,IF('Efterafgrøde beslutningsstøtte'!A$13=\"Egnet til udsåning ved sidste radrensning\",2,IF('Efterafgrøde beslutningsstøtte'!A$13=\"Efter høst af primærafgrøde\",3,\"Fejl\")))","v":3},{"$f":"IF('Efterafgrøde beslutningsstøtte'!A$16=\"Sand\",1,IF('Efterafgrøde beslutningsstøtte'!A$16=\"Ler\",2,\"Fejl\"))","v":2},14,{"$f":"IF($G$9<>\"Fortsætter som græs - Kun MFO\",VLOOKUP(C43,Norm!$B$19:$Y$52,H43,FALSE),0)","v":0},{"$f":"IF(E43=1,Norm!$D$9,Norm!$D$10)","v":220},0,{"$f":"VLOOKUP(C43,Norm!$B$19:$Y$52,14+F43,FALSE)","v":13},{"$f":"VLOOKUP($C43,Norm!$B$19:$Y$52,18)","v":90},{"$f":"VLOOKUP($C43,Norm!$B$19:$Y$52,19)","v":0},{"$f":"VLOOKUP($C43,Norm!$B$19:$Y$52,20)","v":0},1170,1,{"$f":"IF(F43=1,Norm!$D$3,IF(F43=2,Norm!$D$4,IF(F43=3,Norm!$D$5)))","v":185},0,{"$f":"Norm!$D$12","v":7},0,{"$f":"Norm!$D$7","v":10},{"$f":"VLOOKUP($C43,Norm!$B$19:$Y$52,23)","v":0},{"$f":"VLOOKUP($C43,Norm!$B$19:$Y$52,24)","v":0},{"$f":"VLOOKUP($C43,Norm!$B$19:$Y$52,21)","v":0},{"$f":"VLOOKUP($C43,Norm!$B$19:$Y$52,22)","v":0},185,1355,"-"]
[33,0,33,"Vintervikke/vinterrug",{"$f":"IF('Efterafgrøde beslutningsstøtte'!A$19=\"Vintersæd\",1,IF(OR('Efterafgrøde beslutningsstøtte'!A$19=\"Vårsæd\",'Efterafgrøde beslutningsstøtte'!A$19=\"Fortsætter som græs - Kun MFO\"),2,\"Fejl\"))","v":2},{"$f":"IF('Efterafgrøde beslutningsstøtte'!A$13=\"Ved såning af primærafgrøde\",1,IF('Efterafgrøde beslutningsstøtte'!A$13=\"Egnet til udsåning ved sidste radrensning\",2,IF('Efterafgrøde beslutningsstøtte'!A$13=\"Efter høst af primærafgrøde\",3,\"Fejl\")))","v":3},{"$f":"IF('Efterafgrøde beslutningsstøtte'!A$16=\"Sand\",1,IF('Efterafgrøde beslutningsstøtte'!A$16=\"Ler\",2,\"Fejl\"))","v":2},14,{"$f":"IF($G$9<>\"Fortsætter som græs - Kun MFO\",VLOOKUP(C44,Norm!$B$19:$Y$52,H44,FALSE),0)","v":2},{"$f":"IF(E44=1,Norm!$D$9,Norm!$D$10)","v":220},440,{"$f":"VLOOKUP(C44,Norm!$B$19:$Y$52,14+F44,FALSE)","v":75},{"$f":"VLOOKUP($C44,Norm!$B$19:$Y$52,18)","v":10},{"$f":"VLOOKUP($C44,Norm!$B$19:$Y$52,19)","v":0},{"$f":"VLOOKUP($C44,Norm!$B$19:$Y$52,20)","v":0},750,1,{"$f":"IF(F44=1,Norm!$D$3,IF(F44=2,Norm!$D$4,IF(F44=3,Norm!$D$5)))","v":185},2,{"$f":"Norm!$D$12","v":7},2,{"$f":"Norm!$D$7","v":10},{"$f":"VLOOKUP($C44,Norm!$B$19:$Y$52,23)","v":0},{"$f":"VLOOKUP($C44,Norm!$B$19:$Y$52,24)","v":0},{"$f":"VLOOKUP($C44,Norm!$B$19:$Y$52,21)","v":0},{"$f":"VLOOKUP($C44,Norm!$B$19:$Y$52,22)","v":0},219,969,-529]
[34,0,34,"Kløvergræs (blanding)",{"$f":"IF('Efterafgrøde beslutningsstøtte'!A$19=\"Vintersæd\",1,IF(OR('Efterafgrøde beslutningsstøtte'!A$19=\"Vårsæd\",'Efterafgrøde beslutningsstøtte'!A$19=\"Fortsætter som græs - Kun MFO\"),2,\"Fejl\"))","v":2},{"$f":"IF('Efterafgrøde beslutningsstøtte'!A$13=\"Ved såning af primærafgrøde\",1,IF('Efterafgrøde beslutningsstøtte'!A$13=\"Egnet til udsåning ved sidste radrensning\",2,IF('Efterafgrøde beslutningsstøtte'!A$13=\"Efter høst af primærafgrøde\",3,\"Fejl\")))","v":3},{"$f":"IF('Efterafgrøde beslutningsstøtte'!A$16=\"Sand\",1,IF('Efterafgrøde beslutningsstøtte'!A$16=\"Ler\",2,\"Fejl\"))","v":2},14,{"$f":"IF($G$9<>\"Fortsætter som græs - Kun MFO\",VLOOKUP(C45,Norm!$B$19:$Y$52,H45,FALSE),0)","v":0},{"$f":"IF(E45=1,Norm!$D$9,Norm!$D$10)","v":220},0,{"$f":"VLOOKUP(C45,Norm!$B$19:$Y$52,14+F45,FALSE)","v":24.5},{"$f":"VLOOKUP($C45,Norm!$B$19:$Y$52,18)","v":80},{"$f":"VLOOKUP($C45,Norm!$B$19:$Y$52,19)","v":0},{"$f":"VLOOKUP($C45,Norm!$B$19:$Y$52,20)","v":0},1960,1,{"$f":"IF(F45=1,Norm!$D$3,IF(F45=2,Norm!$D$4,IF(F45=3,Norm!$D$5)))","v":185},0,{"$f":"Norm!$D$12","v":7},0,{"$f":"Norm!$D$7","v":10},{"$f":"VLOOKUP($C45,Norm!$B$19:$Y$52,23)","v":0},{"$f":"VLOOKUP($C45,Norm!$B$19:$Y$52,24)","v":0},{"$f":"VLOOKUP($C45,Norm!$B$19:$Y$52,21)","v":0},{"$f":"VLOOKUP($C45,Norm!$B$19:$Y$52,22)","v":0},185,2145,"-"]

{"sheet":"Norm","index":10,"n_rows":52,"n_cols":26,"rows_kept":52,"cut":false,"hidden":false,"merged":[[13,3,13,14],[14,3,14,8],[14,9,14,14],[16,19,16,20],[15,3,15,8],[16,3,16,5],[16,6,16,8],[15,23,16,24],[15,21,16,22],[16,15,16,17],[15,9,15,14],[16,9,16,11],[16,12,16,14]]}
[]
[null,null,"Omkostninger såning",null,"Kode"]
[null,null,"Sammen med afgrøden",55,1]
[null,null,"Før høst",75,2]
[null,null,"Efter høst",185,3]
[]
[null,null,"Omkostninger tørring",10,"kr. pr. hkg."]
[]
[null,null,"Pris vintersæd (vinerhvede)",220,"kr. pr. hkg."]
[null,null,"Pris vårsæd (foderbyg)",220,"kr. pr. hkg."]
[null,null,"Mejetærskning - basis",800,"kr. pr ha"]
[null,null,"Mejetærskning - korrektion pr. hkg.",7,"kr. pr. hkg."]
[]
[null,null,null,"Jordbund"]
[null,null,null,"Sandjord",null,null,null,null,null,"Lerjord"]
[null,null,null,"Merudbytte, hkg pr. ha",null,null,null,null,null,"Merudbytte, hkg pr. ha",null,null,null,null,null,null,null,null,null,null,null,"Andre kapacitetsomkostninger",null,"Nedmulding",null,"Udsædsmængder for hver art i blandingen ved såning efter høst. "]
[null,null,"Afgrøde","Vintersæd",null,null,"Vårsæd",null,null,"Vintersæd",null,null,"Vårsæd",null,null,"Udsæd - kg. pr. ha",null,null,null,"Andre stykomk"]
[null,null,"Såtid","Som udlæg","sidste radrensning","Efter høst","Som udlæg","sidste radrensning","Efter høst","Sammen med","Før","Efter","Som udlæg","sidste radrensning","Efter høst","Som udlæg","sidste radrensning","Efter høst","Pris","Antal","Pris","Antal","Pris","Antal","Pris"]
[null,1,"Alm. rajgræs, dipl.",null,null,null,2,1,0,null,null,null,2,1,0,6,8,"0",60,0,0,0,0,0,0]
[null,2,"Blanding uden bælgsæd overvintrene",null,null,null,0,2,1,null,null,null,0,2,0.5,0,40,"55",15,0,0,0,0,0,0,"35 kg vinterrug + 3 kg rajgræs + 2 kg vinterrybs"]
[null,3,"Vårbyg /Vikke /Gul Sennep",null,null,null,0,0,4,null,null,null,0,0,2,0,0,67,8.5,0,0,0,0,0,0,"50 kg vårbyg + 10 kg vikke + 7 kg sennep"]
[null,4,"Rajgræs/Cichorie/hvidkløver",null,null,null,6,5,0,null,null,null,3,2,0,6,10,0,100,0,0,0,0,0,0,"6 kg rajgræs + 1,5 kg Cikorie + 2,5 kg hvidkløver"]
[null,5,"Rødkløver",null,null,null,8,7,0,null,null,null,3,2,0,3,4,0,150,0,0,0,0,0,0]
[null,6,"Vinterrug/fodervikke/olieræddike",null,null,null,0,0,5,null,null,null,0,0,2,0,0,44,15,0,0,0,0,0,0,"30 kg vinterrug + 10kg fodervikke + 4 kg foderrædikke"]
[null,7,"Triticale/Gul Sennep",null,null,null,0,0,4,null,null,null,0,0,0,0,0,66,7,0,0,0,0,0,0,"60 kg triticale + 6 kg sennep"]
[null,8,"Frøgræs, udtjent",null,null,null,0,0,0,null,null,null,0,0,0,0,0,0,null,0,0,0,0,0,0]
[null,9,"Gul sennep",null,null,null,0,3,3,null,null,null,0,4,4,0,6,10,25,0,0,0,0,0,0]
[null,10,"Olieræddike",null,null,null,0,3,3,null,null,null,0,4,4,0,8,12,33,0,0,0,0,0,0]
[null,11,"Blanding med bælsæd udvintrene",null,null,null,0,3,4,null,null,null,0,4,4,0,50,102,32,0,0,0,0,0,0,"2,5 kg gul sennep + 40 kg blå lupin + 30 kg foderært + 30 kg fodervikke"]
[null,12,"Vinterraps , linie",null,null,null,0,3,3,null,null,null,0,3,3,0,2,5,180,0,0,0,0,0,0]
["K",13,"Foderradise (Strukturator)",null,null,null,0,3,4,null,null,null,0,4,4,0,5,12,55,0,0,0,0,0,0]
[null,14,"Havre",null,null,null,0,0,3,null,null,null,0,0,1,0,0,150,4.5,0,0,0,0,0,0]
[null,15,"Boghvede",null,null,null,0,0,2,null,null,null,0,0,1,0,0,50,35,0,0,0,0,0,0]
[null,16,"Vinterrybs",null,null,null,0,4,4,null,null,null,0,4,4,0,5,7,180,0,0,0,0,0,0]
[null,17,"Gul Lupin",null,null,null,0,0,5,null,null,null,0,0,3,0,0,60,8,0,0,0,0,0,0]
[null,18,"Vårbyg",null,null,null,0,0,2,null,null,null,0,0,1,0,0,150,4.5,0,0,0,0,0,0]
[null,19,"vårbyg/fodervikke",null,null,null,0,0,4,null,null,null,0,0,2,0,50,130,10,0,0,0,0,0,0,"60 kg fodervikke + 70 kg vårbyg"]
[null,20,"Vinterrug ",null,null,null,0,0,3,null,null,null,0,0,2,0,50,140,4.5,0,0,0,0,0,0]
[null,21,"Olierædikke/gul sennep ",null,null,null,0,3,3,null,null,null,0,2,2,0,8,11,16,0,0,0,0,0,0,"6 kg olieræddikke + 5 kg sennep"]
[null,22,"Blanding med bælsæd overvintrene",null,null,null,0,4,4,null,null,null,0,4,2,0,10,22,70,0,0,0,0,0,0,"2 kg rødkløver + 8 kg blodkløver + 10 kg vintervikke + 2 kg rajgræs"]
[null,23,"Blanding uden bælgsæd udvintrene",null,null,null,0,2,2,null,null,null,0,2,2,0,25,30,35,0,0,0,0,0,0,"3 kg sennep + 20 kg boghvede + 9 kg solsikke"]
[null,24,"Cikorie",null,null,null,3,2,0,null,null,null,3,2,0,2,2,0,167,0,0,0,0,0,0]
[null,25,"Honningurt",null,null,null,0,2,1,null,null,null,0,2,1,0,5,15,140,0,0,0,0,0,0]
[null,26,"Fodervikke ",null,null,null,0,5,4,null,null,null,0,6,4,0,40,120,18,0,0,0,0,0,0]
[null,27,"Vintervikke",null,null,null,0,3,2,null,null,null,0,2,1,0,5,40,25,0,0,0,0,0,0]
[null,28,"Alexandrinekløver",null,null,null,0,3,1,null,null,null,0,3,1,0,10,20,90,0,0,0,0,0,0]
[null,29,"Hvidkløver",null,null,null,7,5,0,null,null,null,6,3,0,2,3,0,160,0,0,0,0,0,0]
[null,30,"Olieræddike og fodervikke",null,null,null,0,4,4,null,null,null,0,6,4,0,25,23,25,0,0,0,0,0,0,"8 kg. olieræddike + 15 kg. fodervikke"]
[null,31,"Hvidkløver/alm. rajgræs",null,null,null,7,5,0,null,null,null,6,3,0,10,10,0,80,0,0,0,0,0,0,"2 kg hvidkløver + 8 kg. alm rajgræs"]
[null,32,"Rødkløver/strandsvingel",null,null,null,7,5,3,null,null,null,7,3,0,10,13,13,90,0,0,0,0,0,0,"4 kg. rødkløver + 9 kg. strandsvingel"]
[null,33,"Vintervikke/vinterrug",null,null,null,0,5,4,null,null,null,0,5,2,0,50,75,10,0,0,0,0,0,0,"15 kg. vintervikke + 60 kg. vinterrug"]
[null,34,"Kløvergræs (blanding)",null,null,null,7,5,5,null,null,null,7,3,0,24.5,24.5,24.5,80,0,0,0,0,0,0]

{"sheet":"Basis_norm","index":11,"n_rows":52,"n_cols":26,"rows_kept":52,"cut":false,"hidden":true,"merged":[[15,23,16,24],[16,3,16,5],[16,6,16,8],[16,9,16,11],[16,12,16,14],[16,15,16,17],[16,19,16,20],[13,3,13,14],[14,9,14,14],[15,3,15,8],[15,9,15,14],[15,21,16,22],[14,3,14,8]]}
[]
[null,null,"Omkostninger såning",null,"Kode"]
[null,null,"Sammen med afgrøden",55,1]
[null,null,"Før høst",75,2]
[null,null,"Efter høst",185,3]
[]
[null,null,"Omkostninger tørring",10,"kr. pr. hkg."]
[]
[null,null,"Pris vintersæd (vinerhvede)",220,"kr. pr. hkg."]
[null,null,"Pris vårsæd (foderbyg)",220,"kr. pr. hkg."]
[null,null,"Mejetærskning - basis",800,"kr. pr ha"]
[null,null,"Mejetærskning - korrektion pr. hkg.",7,"kr. pr. hkg."]
[]
[null,null,null,"Jordbund"]
[null,null,null,"Sandjord",null,null,null,null,null,"Lerjord"]
[null,null,null,"Merudbytte, hkg pr. ha",null,null,null,null,null,"Merudbytte, hkg pr. ha",null,null,null,null,null,null,null,null,null,null,null,"Andre kapacitetsomkostninger",null,"Nedmulding",null,"Udsædsmængder for hver art i blandingen ved såning efter høst. "]
[null,null,"Afgrøde","Vintersæd",null,null,"Vårsæd",null,null,"Vintersæd",null,null,"Vårsæd",null,null,"Udsæd - kg. pr. ha",null,null,null,"Andre stykomk"]
[null,null,"Såtid","Som udlæg","sidste radrensning","Efter høst","Som udlæg","sidste radrensning","Efter høst","Sammen med","Før","Efter","Som udlæg","sidste radrensning","Efter høst","Som udlæg","sidste radrensning","Efter høst","Pris","Antal","Pris","Antal","Pris","Antal","Pris"]
[null,1,"Alm. rajgræs, dipl.",null,null,null,2,1,0,null,null,null,2,1,0,6,8,"0",55,0,0,0,0,0,0]
[null,2,"Blanding uden bælgsæd overvintrene",null,null,null,0,2,1,null,null,null,0,2,0.5,0,40,"55",30,0,0,0,0,0,0,"35 kg vinterrug + 3 kg rajgræs + 2 kg vinterrybs"]
[null,3,"Vårbyg /Vikke /Gul Sennep",null,null,null,0,0,4,null,null,null,0,0,2,0,0,67,5.3,0,0,0,0,0,0,"50 kg vårbyg + 10 kg vikke + 7 kg sennep"]
[null,4,"Rajgræs/Cichorie/hvidkløver",null,null,null,6,5,0,null,null,null,3,2,0,6,10,0,42,0,0,0,0,0,0,"6 kg rajgræs + 1,5 kg Cikorie + 2,5 kg hvidkløver"]
[null,5,"Rødkløver",null,null,null,8,7,0,null,null,null,3,2,0,3,4,0,150,0,0,0,0,0,0]
[null,6,"Vinterrug/fodervikke/olieræddike",null,null,null,0,0,5,null,null,null,0,0,2,0,0,44,32,0,0,0,0,0,0,"30 kg vinterrug + 10kg fodervikke + 4 kg foderrædikke"]
[null,7,"Triticale/Gul Sennep",null,null,null,0,0,4,null,null,null,0,0,0,0,0,66,59,0,0,0,0,0,0,"60 kg triticale + 6 kg sennep"]
[null,8,"Frøgræs, udtjent",null,null,null,0,0,0,null,null,null,0,0,0,0,0,0,null,0,0,0,0,0,0]
[null,9,"Gul sennep",null,null,null,0,3,3,null,null,null,0,4,4,0,6,10,25,0,0,0,0,0,0]
[null,10,"Olieræddike",null,null,null,0,3,3,null,null,null,0,4,4,0,8,12,25,0,0,0,0,0,0]
[null,11,"Blanding med bælsæd udvintrene",null,null,null,0,3,4,null,null,null,0,4,4,0,50,102,21,0,0,0,0,0,0,"2,5 kg gul sennep + 40 kg blå lupin + 30 kg foderært + 30 kg fodervikke"]
[null,12,"Vinterraps , linie",null,null,null,0,3,3,null,null,null,0,3,3,0,2,5,120,0,0,0,0,0,0]
[null,13,"Foderradise (Strukturator)",null,null,null,0,3,4,null,null,null,0,4,4,0,5,12,20,0,0,0,0,0,0]
[null,14,"Havre",null,null,null,0,0,3,null,null,null,0,0,1,0,0,150,4.5,0,0,0,0,0,0]
[null,15,"Boghvede",null,null,null,0,0,2,null,null,null,0,0,1,0,0,50,35,0,0,0,0,0,0]
[null,16,"Vinterrybs",null,null,null,0,4,4,null,null,null,0,4,4,0,5,7,100,0,0,0,0,0,0]
[null,17,"Gul Lupin",null,null,null,0,0,5,null,null,null,0,0,3,0,0,60,8,0,0,0,0,0,0]
[null,18,"Vårbyg",null,null,null,0,0,2,null,null,null,0,0,1,0,0,150,4.5,0,0,0,0,0,0]
[null,19,"vårbyg/fodervikke",null,null,null,0,0,4,null,null,null,0,0,2,0,50,130,12,0,0,0,0,0,0,"60 kg fodervikke + 70 kg vårbyg"]
[null,20,"Vinterrug ",null,null,null,0,0,3,null,null,null,0,0,2,0,50,140,4.5,0,0,0,0,0,0]
[null,21,"Olierædikke/gul sennep ",null,null,null,0,3,3,null,null,null,0,2,2,0,8,11,18,0,0,0,0,0,0,"6 kg olieræddikke + 5 kg sennep"]
[null,22,"Blanding med bælsæd overvintrene",null,null,null,0,4,4,null,null,null,0,4,2,0,10,22,64,0,0,0,0,0,0,"2 kg rødkløver + 8 kg blodkløver + 10 kg vintervikke + 2 kg rajgræs"]
[null,23,"Blanding uden bælgsæd udvintrene",null,null,null,0,2,2,null,null,null,0,2,2,0,25,31,60,0,0,0,0,0,0,"3 kg sennep + 20 kg boghvede + 9 kg solsikke"]
[null,24,"Cikorie",null,null,null,3,2,0,null,null,null,3,2,0,2,2,0,160,0,0,0,0,0,0]
[null,25,"Honningurt",null,null,null,0,2,1,null,null,null,0,2,1,0,5,15,104,0,0,0,0,0,0]
[null,26,"Fodervikke ",null,null,null,0,5,4,null,null,null,0,6,4,0,40,120,20,0,0,0,0,0,0]
[null,27,"Vintervikke",null,null,null,0,3,2,null,null,null,0,2,1,0,5,40,28,0,0,0,0,0,0]
[null,28,"Alexandrinekløver",null,null,null,0,3,1,null,null,null,0,3,1,0,10,20,30,0,0,0,0,0,0]
[null,29,"Hvidkløver",null,null,null,7,5,0,null,null,null,6,3,0,2,3,0,155,0,0,0,0,0,0]
[null,30,"Olieræddike og fodervikke",null,null,null,0,4,4,null,null,null,0,6,4,0,25,23,25,0,0,0,0,0,0,"8 kg. olieræddike + 15 kg. fodervikke"]
[null,31,"Hvidkløver/alm. rajgræs",null,null,null,7,5,0,null,null,null,6,3,0,10,10,0,63,0,0,0,0,0,0,"2 kg hvidkløver + 8 kg. alm rajgræs"]
[null,32,"Rødkløver/strandsvingel",null,null,null,7,5,3,null,null,null,7,3,0,10,13,13,105,0,0,0,0,0,0,"4 kg. rødkløver + 9 kg. strandsvingel"]
[null,33,"Vintervikke/vinterrug",null,null,null,0,5,4,null,null,null,0,5,2,0,50,75,11.4,0,0,0,0,0,0,"15 kg. vintervikke + 60 kg. vinterrug"]
[null,34,"Kløvergræs (blanding)",null,null,null,7,5,5,null,null,null,7,3,0,24.5,24.5,24.5,80,0,0,0,0,0,0]

{"sheet":"Norm lig basisnorm","index":12,"n_rows":57,"n_cols":25,"rows_kept":57,"cut":false,"hidden":true,"merged":[[16,23,17,24],[17,3,17,5],[17,6,17,8],[17,9,17,11],[17,12,17,14],[17,15,17,17],[17,19,17,20],[16,21,17,22],[14,3,14,14],[15,3,15,8],[15,9,15,14],[16,3,16,8],[16,9,16,14]]}
[]
[]
[null,null,"Omkostninger såning",null,"Kode"]
[null,null,"Sammen med afgrøden",{"$f":"Norm!D3=Basis_norm!D3","v":true},{"$f":"Norm!E3=Basis_norm!E3","v":true}]
[null,null,"Før høst",{"$f":"Norm!D4=Basis_norm!D4","v":true},{"$f":"Norm!E4=Basis_norm!E4","v":true}]
[null,null,"Efter høst",{"$f":"Norm!D5=Basis_norm!D5","v":true},{"$f":"Norm!E5=Basis_norm!E5","v":true}]
[]
[null,null,"Omkostninger tørring",{"$f":"Norm!D7=Basis_norm!D7","v":true},"kr. pr. hkg."]
[]
[null,null,"Pris vintersæd (vinerhvede)",{"$f":"Norm!D9=Basis_norm!D9","v":true},"kr. pr. hkg."]
[null,null,"Pris vårsæd (foderbyg)",{"$f":"Norm!D10=Basis_norm!D10","v":true},"kr. pr. hkg."]
[null,null,"Mejetærskning - basis",{"$f":"Norm!D11=Basis_norm!D11","v":true},"kr. pr ha"]
[null,null,"Mejetærskning - korrektion pr. hkg.",{"$f":"Norm!D12=Basis_norm!D12","v":true},"kr. pr. hkg."]
[]
[null,null,null,"Jordbund"]
[null,null,null,"Sandjord",null,null,null,null,null,"Lerjord"]
[null,null,null,"Merudbytte",null,null,null,null,null,"Merudbytte",null,null,null,null,null,null,null,null,null,null,null,"Andre kapacitetsomkostninger",null,"Nedmulding"]
[null,null,"Afgrøde","Vintersæd",null,null,"Vårsæd",null,null,"Vintersæd",null,null,"Vårsæd",null,null,"Udsæd - kg. pr. ha",null,null,null,"Andre stykomk"]
[null,null,"Såtid","Sammen med","Før","Efter","Sammen med","Før","Efter","Sammen med","Før","Efter","Sammen med","Før","Efter","Sammenmed","Før","Efter","Pris","Antal","Pris","Antal","Pris","Antal","Pris"]
[null,1,"Alm. rajgræs, dipl., udlæg1)",{"$f":"Norm!D19=Basis_norm!D19","v":true},{"$f":"Norm!E19=Basis_norm!E19","v":true},{"$f":"Norm!F19=Basis_norm!F19","v":true},{"$f":"Norm!G19=Basis_norm!G19","v":true},{"$f":"Norm!H19=Basis_norm!H19","v":true},{"$f":"Norm!I19=Basis_norm!I19","v":true},{"$f":"Norm!J19=Basis_norm!J19","v":true},{"$f":"Norm!K19=Basis_norm!K19","v":true},{"$f":"Norm!L19=Basis_norm!L19","v":true},{"$f":"Norm!M19=Basis_norm!M19","v":true},{"$f":"Norm!N19=Basis_norm!N19","v":true},{"$f":"Norm!O19=Basis_norm!O19","v":true},{"$f":"Norm!P19=Basis_norm!P19","v":true},{"$f":"Norm!Q19=Basis_norm!Q19","v":true},{"$f":"Norm!R19=Basis_norm!R19","v":true},{"$f":"Norm!S19=Basis_norm!S19","v":false},{"$f":"Norm!T19=Basis_norm!T19","v":true},{"$f":"Norm!U19=Basis_norm!U19","v":true},{"$f":"Norm!V19=Basis_norm!V19","v":true},{"$f":"Norm!W19=Basis_norm!W19","v":true},{"$f":"Norm!X19=Basis_norm!X19","v":true},{"$f":"Norm!Y19=Basis_norm!Y19","v":true}]
[null,2,"Ital. rajgræs, dipl., udlæg1)",{"$f":"Norm!D20=Basis_norm!D20","v":true},{"$f":"Norm!E20=Basis_norm!E20","v":true},{"$f":"Norm!F20=Basis_norm!F20","v":true},{"$f":"Norm!G20=Basis_norm!G20","v":true},{"$f":"Norm!H20=Basis_norm!H20","v":true},{"$f":"Norm!I20=Basis_norm!I20","v":true},{"$f":"Norm!J20=Basis_norm!J20","v":true},{"$f":"Norm!K20=Basis_norm!K20","v":true},{"$f":"Norm!L20=Basis_norm!L20","v":true},{"$f":"Norm!M20=Basis_norm!M20","v":true},{"$f":"Norm!N20=Basis_norm!N20","v":true},{"$f":"Norm!O20=Basis_norm!O20","v":true},{"$f":"Norm!P20=Basis_norm!P20","v":true},{"$f":"Norm!Q20=Basis_norm!Q20","v":true},{"$f":"Norm!R20=Basis_norm!R20","v":true},{"$f":"Norm!S20=Basis_norm!S20","v":false},{"$f":"Norm!T20=Basis_norm!T20","v":true},{"$f":"Norm!U20=Basis_norm!U20","v":true},{"$f":"Norm!V20=Basis_norm!V20","v":true},{"$f":"Norm!W20=Basis_norm!W20","v":true},{"$f":"Norm!X20=Basis_norm!X20","v":true},{"$f":"Norm!Y20=Basis_norm!Y20","v":true}]
[null,3,"Westerwoldisk rajgræs",{"$f":"Norm!D21=Basis_norm!D21","v":true},{"$f":"Norm!E21=Basis_norm!E21","v":true},{"$f":"Norm!F21=Basis_norm!F21","v":true},{"$f":"Norm!G21=Basis_norm!G21","v":true},{"$f":"Norm!H21=Basis_norm!H21","v":true},{"$f":"Norm!I21=Basis_norm!I21","v":true},{"$f":"Norm!J21=Basis_norm!J21","v":true},{"$f":"Norm!K21=Basis_norm!K21","v":true},{"$f":"Norm!L21=Basis_norm!L21","v":true},{"$f":"Norm!M21=Basis_norm!M21","v":true},{"$f":"Norm!N21=Basis_norm!N21","v":true},{"$f":"Norm!O21=Basis_norm!O21","v":true},{"$f":"Norm!P21=Basis_norm!P21","v":true},{"$f":"Norm!Q21=Basis_norm!Q21","v":true},{"$f":"Norm!R21=Basis_norm!R21","v":true},{"$f":"Norm!S21=Basis_norm!S21","v":false},{"$f":"Norm!T21=Basis_norm!T21","v":true},{"$f":"Norm!U21=Basis_norm!U21","v":true},{"$f":"Norm!V21=Basis_norm!V21","v":true},{"$f":"Norm!W21=Basis_norm!W21","v":true},{"$f":"Norm!X21=Basis_norm!X21","v":true},{"$f":"Norm!Y21=Basis_norm!Y21","v":true}]
[null,4,"Strandsvingel, udlæg1)",{"$f":"Norm!D22=Basis_norm!D22","v":true},{"$f":"Norm!E22=Basis_norm!E22","v":true},{"$f":"Norm!F22=Basis_norm!F22","v":true},{"$f":"Norm!G22=Basis_norm!G22","v":true},{"$f":"Norm!H22=Basis_norm!H22","v":true},{"$f":"Norm!I22=Basis_norm!I22","v":true},{"$f":"Norm!J22=Basis_norm!J22","v":true},{"$f":"Norm!K22=Basis_norm!K22","v":true},{"$f":"Norm!L22=Basis_norm!L22","v":true},{"$f":"Norm!M22=Basis_norm!M22","v":true},{"$f":"Norm!N22=Basis_norm!N22","v":true},{"$f":"Norm!O22=Basis_norm!O22","v":true},{"$f":"Norm!P22=Basis_norm!P22","v":true},{"$f":"Norm!Q22=Basis_norm!Q22","v":true},{"$f":"Norm!R22=Basis_norm!R22","v":true},{"$f":"Norm!S22=Basis_norm!S22","v":false},{"$f":"Norm!T22=Basis_norm!T22","v":true},{"$f":"Norm!U22=Basis_norm!U22","v":true},{"$f":"Norm!V22=Basis_norm!V22","v":true},{"$f":"Norm!W22=Basis_norm!W22","v":true},{"$f":"Norm!X22=Basis_norm!X22","v":true},{"$f":"Norm!Y22=Basis_norm!Y22","v":true}]
[null,5,"Rødsvingel, udlæg1)",{"$f":"Norm!D23=Basis_norm!D23","v":true},{"$f":"Norm!E23=Basis_norm!E23","v":true},{"$f":"Norm!F23=Basis_norm!F23","v":true},{"$f":"Norm!G23=Basis_norm!G23","v":true},{"$f":"Norm!H23=Basis_norm!H23","v":true},{"$f":"Norm!I23=Basis_norm!I23","v":true},{"$f":"Norm!J23=Basis_norm!J23","v":true},{"$f":"Norm!K23=Basis_norm!K23","v":true},{"$f":"Norm!L23=Basis_norm!L23","v":true},{"$f":"Norm!M23=Basis_norm!M23","v":true},{"$f":"Norm!N23=Basis_norm!N23","v":true},{"$f":"Norm!O23=Basis_norm!O23","v":true},{"$f":"Norm!P23=Basis_norm!P23","v":true},{"$f":"Norm!Q23=Basis_norm!Q23","v":true},{"$f":"Norm!R23=Basis_norm!R23","v":true},{"$f":"Norm!S23=Basis_norm!S23","v":true},{"$f":"Norm!T23=Basis_norm!T23","v":true},{"$f":"Norm!U23=Basis_norm!U23","v":true},{"$f":"Norm!V23=Basis_norm!V23","v":true},{"$f":"Norm!W23=Basis_norm!W23","v":true},{"$f":"Norm!X23=Basis_norm!X23","v":true},{"$f":"Norm!Y23=Basis_norm!Y23","v":true}]
[null,6,"Engrapgræs, udlæg1)",{"$f":"Norm!D24=Basis_norm!D24","v":true},{"$f":"Norm!E24=Basis_norm!E24","v":true},{"$f":"Norm!F24=Basis_norm!F24","v":true},{"$f":"Norm!G24=Basis_norm!G24","v":true},{"$f":"Norm!H24=Basis_norm!H24","v":true},{"$f":"Norm!I24=Basis_norm!I24","v":true},{"$f":"Norm!J24=Basis_norm!J24","v":true},{"$f":"Norm!K24=Basis_norm!K24","v":true},{"$f":"Norm!L24=Basis_norm!L24","v":true},{"$f":"Norm!M24=Basis_norm!M24","v":true},{"$f":"Norm!N24=Basis_norm!N24","v":true},{"$f":"Norm!O24=Basis_norm!O24","v":true},{"$f":"Norm!P24=Basis_norm!P24","v":true},{"$f":"Norm!Q24=Basis_norm!Q24","v":true},{"$f":"Norm!R24=Basis_norm!R24","v":true},{"$f":"Norm!S24=Basis_norm!S24","v":false},{"$f":"Norm!T24=Basis_norm!T24","v":true},{"$f":"Norm!U24=Basis_norm!U24","v":true},{"$f":"Norm!V24=Basis_norm!V24","v":true},{"$f":"Norm!W24=Basis_norm!W24","v":true},{"$f":"Norm!X24=Basis_norm!X24","v":true},{"$f":"Norm!Y24=Basis_norm!Y24","v":true}]
[null,7,"Hundegræs, udlæg1)",{"$f":"Norm!D25=Basis_norm!D25","v":true},{"$f":"Norm!E25=Basis_norm!E25","v":true},{"$f":"Norm!F25=Basis_norm!F25","v":true},{"$f":"Norm!G25=Basis_norm!G25","v":true},{"$f":"Norm!H25=Basis_norm!H25","v":true},{"$f":"Norm!I25=Basis_norm!I25","v":true},{"$f":"Norm!J25=Basis_norm!J25","v":true},{"$f":"Norm!K25=Basis_norm!K25","v":true},{"$f":"Norm!L25=Basis_norm!L25","v":true},{"$f":"Norm!M25=Basis_norm!M25","v":true},{"$f":"Norm!N25=Basis_norm!N25","v":true},{"$f":"Norm!O25=Basis_norm!O25","v":true},{"$f":"Norm!P25=Basis_norm!P25","v":true},{"$f":"Norm!Q25=Basis_norm!Q25","v":true},{"$f":"Norm!R25=Basis_norm!R25","v":true},{"$f":"Norm!S25=Basis_norm!S25","v":false},{"$f":"Norm!T25=Basis_norm!T25","v":true},{"$f":"Norm!U25=Basis_norm!U25","v":true},{"$f":"Norm!V25=Basis_norm!V25","v":true},{"$f":"Norm!W25=Basis_norm!W25","v":true},{"$f":"Norm!X25=Basis_norm!X25","v":true},{"$f":"Norm!Y25=Basis_norm!Y25","v":true}]
[null,8,"Frøgræs, udtjent",{"$f":"Norm!D26=Basis_norm!D26","v":true},{"$f":"Norm!E26=Basis_norm!E26","v":true},{"$f":"Norm!F26=Basis_norm!F26","v":true},{"$f":"Norm!G26=Basis_norm!G26","v":true},{"$f":"Norm!H26=Basis_norm!H26","v":true},{"$f":"Norm!I26=Basis_norm!I26","v":true},{"$f":"Norm!J26=Basis_norm!J26","v":true},{"$f":"Norm!K26=Basis_norm!K26","v":true},{"$f":"Norm!L26=Basis_norm!L26","v":true},{"$f":"Norm!M26=Basis_norm!M26","v":true},{"$f":"Norm!N26=Basis_norm!N26","v":true},{"$f":"Norm!O26=Basis_norm!O26","v":true},{"$f":"Norm!P26=Basis_norm!P26","v":true},{"$f":"Norm!Q26=Basis_norm!Q26","v":true},{"$f":"Norm!R26=Basis_norm!R26","v":true},{"$f":"Norm!S26=Basis_norm!S26","v":true},{"$f":"Norm!T26=Basis_norm!T26","v":true},{"$f":"Norm!U26=Basis_norm!U26","v":true},{"$f":"Norm!V26=Basis_norm!V26","v":true},{"$f":"Norm!W26=Basis_norm!W26","v":true},{"$f":"Norm!X26=Basis_norm!X26","v":true},{"$f":"Norm!Y26=Basis_norm!Y26","v":true}]
[null,9,"Gul sennep",{"$f":"Norm!D27=Basis_norm!D27","v":true},{"$f":"Norm!E27=Basis_norm!E27","v":true},{"$f":"Norm!F27=Basis_norm!F27","v":true},{"$f":"Norm!G27=Basis_norm!G27","v":true},{"$f":"Norm!H27=Basis_norm!H27","v":true},{"$f":"Norm!I27=Basis_norm!I27","v":true},{"$f":"Norm!J27=Basis_norm!J27","v":true},{"$f":"Norm!K27=Basis_norm!K27","v":true},{"$f":"Norm!L27=Basis_norm!L27","v":true},{"$f":"Norm!M27=Basis_norm!M27","v":true},{"$f":"Norm!N27=Basis_norm!N27","v":true},{"$f":"Norm!O27=Basis_norm!O27","v":true},{"$f":"Norm!P27=Basis_norm!P27","v":true},{"$f":"Norm!Q27=Basis_norm!Q27","v":true},{"$f":"Norm!R27=Basis_norm!R27","v":true},{"$f":"Norm!S27=Basis_norm!S27","v":true},{"$f":"Norm!T27=Basis_norm!T27","v":true},{"$f":"Norm!U27=Basis_norm!U27","v":true},{"$f":"Norm!V27=Basis_norm!V27","v":true},{"$f":"Norm!W27=Basis_norm!W27","v":true},{"$f":"Norm!X27=Basis_norm!X27","v":true},{"$f":"Norm!Y27=Basis_norm!Y27","v":true}]
[null,10,"Olieræddike",{"$f":"Norm!D28=Basis_norm!D28","v":true},{"$f":"Norm!E28=Basis_norm!E28","v":true},{"$f":"Norm!F28=Basis_norm!F28","v":true},{"$f":"Norm!G28=Basis_norm!G28","v":true},{"$f":"Norm!H28=Basis_norm!H28","v":true},{"$f":"Norm!I28=Basis_norm!I28","v":true},{"$f":"Norm!J28=Basis_norm!J28","v":true},{"$f":"Norm!K28=Basis_norm!K28","v":true},{"$f":"Norm!L28=Basis_norm!L28","v":true},{"$f":"Norm!M28=Basis_norm!M28","v":true},{"$f":"Norm!N28=Basis_norm!N28","v":true},{"$f":"Norm!O28=Basis_norm!O28","v":true},{"$f":"Norm!P28=Basis_norm!P28","v":true},{"$f":"Norm!Q28=Basis_norm!Q28","v":true},{"$f":"Norm!R28=Basis_norm!R28","v":true},{"$f":"Norm!S28=Basis_norm!S28","v":false},{"$f":"Norm!T28=Basis_norm!T28","v":true},{"$f":"Norm!U28=Basis_norm!U28","v":true},{"$f":"Norm!V28=Basis_norm!V28","v":true},{"$f":"Norm!W28=Basis_norm!W28","v":true},{"$f":"Norm!X28=Basis_norm!X28","v":true},{"$f":"Norm!Y28=Basis_norm!Y28","v":true}]
[null,11,"Vinterraps, hybrid",{"$f":"Norm!D29=Basis_norm!D29","v":true},{"$f":"Norm!E29=Basis_norm!E29","v":true},{"$f":"Norm!F29=Basis_norm!F29","v":true},{"$f":"Norm!G29=Basis_norm!G29","v":true},{"$f":"Norm!H29=Basis_norm!H29","v":true},{"$f":"Norm!I29=Basis_norm!I29","v":true},{"$f":"Norm!J29=Basis_norm!J29","v":true},{"$f":"Norm!K29=Basis_norm!K29","v":true},{"$f":"Norm!L29=Basis_norm!L29","v":true},{"$f":"Norm!M29=Basis_norm!M29","v":true},{"$f":"Norm!N29=Basis_norm!N29","v":true},{"$f":"Norm!O29=Basis_norm!O29","v":true},{"$f":"Norm!P29=Basis_norm!P29","v":true},{"$f":"Norm!Q29=Basis_norm!Q29","v":true},{"$f":"Norm!R29=Basis_norm!R29","v":true},{"$f":"Norm!S29=Basis_norm!S29","v":false},{"$f":"Norm!T29=Basis_norm!T29","v":true},{"$f":"Norm!U29=Basis_norm!U29","v":true},{"$f":"Norm!V29=Basis_norm!V29","v":true},{"$f":"Norm!W29=Basis_norm!W29","v":true},{"$f":"Norm!X29=Basis_norm!X29","v":true},{"$f":"Norm!Y29=Basis_norm!Y29","v":true}]
[null,12,"Vinterraps , linie",{"$f":"Norm!D30=Basis_norm!D30","v":true},{"$f":"Norm!E30=Basis_norm!E30","v":true},{"$f":"Norm!F30=Basis_norm!F30","v":true},{"$f":"Norm!G30=Basis_norm!G30","v":true},{"$f":"Norm!H30=Basis_norm!H30","v":true},{"$f":"Norm!I30=Basis_norm!I30","v":true},{"$f":"Norm!J30=Basis_norm!J30","v":true},{"$f":"Norm!K30=Basis_norm!K30","v":true},{"$f":"Norm!L30=Basis_norm!L30","v":true},{"$f":"Norm!M30=Basis_norm!M30","v":true},{"$f":"Norm!N30=Basis_norm!N30","v":true},{"$f":"Norm!O30=Basis_norm!O30","v":true},{"$f":"Norm!P30=Basis_norm!P30","v":true},{"$f":"Norm!Q30=Basis_norm!Q30","v":true},{"$f":"Norm!R30=Basis_norm!R30","v":true},{"$f":"Norm!S30=Basis_norm!S30","v":false},{"$f":"Norm!T30=Basis_norm!T30","v":true},{"$f":"Norm!U30=Basis_norm!U30","v":true},{"$f":"Norm!V30=Basis_norm!V30","v":true},{"$f":"Norm!W30=Basis_norm!W30","v":true},{"$f":"Norm!X30=Basis_norm!X30","v":true},{"$f":"Norm!Y30=Basis_norm!Y30","v":true}]
[null,13,"Foderradise (Strukturator)",{"$f":"Norm!D31=Basis_norm!D31","v":true},{"$f":"Norm!E31=Basis_norm!E31","v":true},{"$f":"Norm!F31=Basis_norm!F31","v":true},{"$f":"Norm!G31=Basis_norm!G31","v":true},{"$f":"Norm!H31=Basis_norm!H31","v":true},{"$f":"Norm!I31=Basis_norm!I31","v":true},{"$f":"Norm!J31=Basis_norm!J31","v":true},{"$f":"Norm!K31=Basis_norm!K31","v":true},{"$f":"Norm!L31=Basis_norm!L31","v":true},{"$f":"Norm!M31=Basis_norm!M31","v":true},{"$f":"Norm!N31=Basis_norm!N31","v":true},{"$f":"Norm!O31=Basis_norm!O31","v":true},{"$f":"Norm!P31=Basis_norm!P31","v":true},{"$f":"Norm!Q31=Basis_norm!Q31","v":true},{"$f":"Norm!R31=Basis_norm!R31","v":true},{"$f":"Norm!S31=Basis_norm!S31","v":false},{"$f":"Norm!T31=Basis_norm!T31","v":true},{"$f":"Norm!U31=Basis_norm!U31","v":true},{"$f":"Norm!V31=Basis_norm!V31","v":true},{"$f":"Norm!W31=Basis_norm!W31","v":true},{"$f":"Norm!X31=Basis_norm!X31","v":true},{"$f":"Norm!Y31=Basis_norm!Y31","v":true}]
[null,14,"Havre, sået inden 1. august",{"$f":"Norm!D32=Basis_norm!D32","v":true},{"$f":"Norm!E32=Basis_norm!E32","v":true},{"$f":"Norm!F32=Basis_norm!F32","v":true},{"$f":"Norm!G32=Basis_norm!G32","v":true},{"$f":"Norm!H32=Basis_norm!H32","v":true},{"$f":"Norm!I32=Basis_norm!I32","v":true},{"$f":"Norm!J32=Basis_norm!J32","v":true},{"$f":"Norm!K32=Basis_norm!K32","v":true},{"$f":"Norm!L32=Basis_norm!L32","v":true},{"$f":"Norm!M32=Basis_norm!M32","v":true},{"$f":"Norm!N32=Basis_norm!N32","v":true},{"$f":"Norm!O32=Basis_norm!O32","v":true},{"$f":"Norm!P32=Basis_norm!P32","v":true},{"$f":"Norm!Q32=Basis_norm!Q32","v":true},{"$f":"Norm!R32=Basis_norm!R32","v":true},{"$f":"Norm!S32=Basis_norm!S32","v":true},{"$f":"Norm!T32=Basis_norm!T32","v":true},{"$f":"Norm!U32=Basis_norm!U32","v":true},{"$f":"Norm!V32=Basis_norm!V32","v":true},{"$f":"Norm!W32=Basis_norm!W32","v":true},{"$f":"Norm!X32=Basis_norm!X32","v":true},{"$f":"Norm!Y32=Basis_norm!Y32","v":true}]
[null,15,"Havre, sået mellem 1. og 20. august",{"$f":"Norm!D33=Basis_norm!D33","v":true},{"$f":"Norm!E33=Basis_norm!E33","v":true},{"$f":"Norm!F33=Basis_norm!F33","v":true},{"$f":"Norm!G33=Basis_norm!G33","v":true},{"$f":"Norm!H33=Basis_norm!H33","v":true},{"$f":"Norm!I33=Basis_norm!I33","v":true},{"$f":"Norm!J33=Basis_norm!J33","v":true},{"$f":"Norm!K33=Basis_norm!K33","v":true},{"$f":"Norm!L33=Basis_norm!L33","v":true},{"$f":"Norm!M33=Basis_norm!M33","v":true},{"$f":"Norm!N33=Basis_norm!N33","v":true},{"$f":"Norm!O33=Basis_norm!O33","v":true},{"$f":"Norm!P33=Basis_norm!P33","v":true},{"$f":"Norm!Q33=Basis_norm!Q33","v":true},{"$f":"Norm!R33=Basis_norm!R33","v":true},{"$f":"Norm!S33=Basis_norm!S33","v":true},{"$f":"Norm!T33=Basis_norm!T33","v":true},{"$f":"Norm!U33=Basis_norm!U33","v":true},{"$f":"Norm!V33=Basis_norm!V33","v":true},{"$f":"Norm!W33=Basis_norm!W33","v":true},{"$f":"Norm!X33=Basis_norm!X33","v":true},{"$f":"Norm!Y33=Basis_norm!Y33","v":true}]
[null,16,"Stauderug, sået inden 1. august",{"$f":"Norm!D34=Basis_norm!D34","v":true},{"$f":"Norm!E34=Basis_norm!E34","v":true},{"$f":"Norm!F34=Basis_norm!F34","v":true},{"$f":"Norm!G34=Basis_norm!G34","v":true},{"$f":"Norm!H34=Basis_norm!H34","v":true},{"$f":"Norm!I34=Basis_norm!I34","v":true},{"$f":"Norm!J34=Basis_norm!J34","v":true},{"$f":"Norm!K34=Basis_norm!K34","v":true},{"$f":"Norm!L34=Basis_norm!L34","v":true},{"$f":"Norm!M34=Basis_norm!M34","v":true},{"$f":"Norm!N34=Basis_norm!N34","v":true},{"$f":"Norm!O34=Basis_norm!O34","v":true},{"$f":"Norm!P34=Basis_norm!P34","v":true},{"$f":"Norm!Q34=Basis_norm!Q34","v":true},{"$f":"Norm!R34=Basis_norm!R34","v":true},{"$f":"Norm!S34=Basis_norm!S34","v":false},{"$f":"Norm!T34=Basis_norm!T34","v":true},{"$f":"Norm!U34=Basis_norm!U34","v":true},{"$f":"Norm!V34=Basis_norm!V34","v":true},{"$f":"Norm!W34=Basis_norm!W34","v":true},{"$f":"Norm!X34=Basis_norm!X34","v":true},{"$f":"Norm!Y34=Basis_norm!Y34","v":true}]
[null,17,"Stauderug, sået mellem 1. og 20. august",{"$f":"Norm!D35=Basis_norm!D35","v":true},{"$f":"Norm!E35=Basis_norm!E35","v":true},{"$f":"Norm!F35=Basis_norm!F35","v":true},{"$f":"Norm!G35=Basis_norm!G35","v":true},{"$f":"Norm!H35=Basis_norm!H35","v":true},{"$f":"Norm!I35=Basis_norm!I35","v":true},{"$f":"Norm!J35=Basis_norm!J35","v":true},{"$f":"Norm!K35=Basis_norm!K35","v":true},{"$f":"Norm!L35=Basis_norm!L35","v":true},{"$f":"Norm!M35=Basis_norm!M35","v":true},{"$f":"Norm!N35=Basis_norm!N35","v":true},{"$f":"Norm!O35=Basis_norm!O35","v":true},{"$f":"Norm!P35=Basis_norm!P35","v":true},{"$f":"Norm!Q35=Basis_norm!Q35","v":true},{"$f":"Norm!R35=Basis_norm!R35","v":true},{"$f":"Norm!S35=Basis_norm!S35","v":true},{"$f":"Norm!T35=Basis_norm!T35","v":true},{"$f":"Norm!U35=Basis_norm!U35","v":true},{"$f":"Norm!V35=Basis_norm!V35","v":true},{"$f":"Norm!W35=Basis_norm!W35","v":true},{"$f":"Norm!X35=Basis_norm!X35","v":true},{"$f":"Norm!Y35=Basis_norm!Y35","v":true}]
[null,18,"Vårbyg, sået inden 1. august",{"$f":"Norm!D36=Basis_norm!D36","v":true},{"$f":"Norm!E36=Basis_norm!E36","v":true},{"$f":"Norm!F36=Basis_norm!F36","v":true},{"$f":"Norm!G36=Basis_norm!G36","v":true},{"$f":"Norm!H36=Basis_norm!H36","v":true},{"$f":"Norm!I36=Basis_norm!I36","v":true},{"$f":"Norm!J36=Basis_norm!J36","v":true},{"$f":"Norm!K36=Basis_norm!K36","v":true},{"$f":"Norm!L36=Basis_norm!L36","v":true},{"$f":"Norm!M36=Basis_norm!M36","v":true},{"$f":"Norm!N36=Basis_norm!N36","v":true},{"$f":"Norm!O36=Basis_norm!O36","v":true},{"$f":"Norm!P36=Basis_norm!P36","v":true},{"$f":"Norm!Q36=Basis_norm!Q36","v":true},{"$f":"Norm!R36=Basis_norm!R36","v":true},{"$f":"Norm!S36=Basis_norm!S36","v":true},{"$f":"Norm!T36=Basis_norm!T36","v":true},{"$f":"Norm!U36=Basis_norm!U36","v":true},{"$f":"Norm!V36=Basis_norm!V36","v":true},{"$f":"Norm!W36=Basis_norm!W36","v":true},{"$f":"Norm!X36=Basis_norm!X36","v":true},{"$f":"Norm!Y36=Basis_norm!Y36","v":true}]
[null,19,"Vårbyg, sået mellem 1. og 20. august",{"$f":"Norm!D37=Basis_norm!D37","v":true},{"$f":"Norm!E37=Basis_norm!E37","v":true},{"$f":"Norm!F37=Basis_norm!F37","v":true},{"$f":"Norm!G37=Basis_norm!G37","v":true},{"$f":"Norm!H37=Basis_norm!H37","v":true},{"$f":"Norm!I37=Basis_norm!I37","v":true},{"$f":"Norm!J37=Basis_norm!J37","v":true},{"$f":"Norm!K37=Basis_norm!K37","v":true},{"$f":"Norm!L37=Basis_norm!L37","v":true},{"$f":"Norm!M37=Basis_norm!M37","v":true},{"$f":"Norm!N37=Basis_norm!N37","v":true},{"$f":"Norm!O37=Basis_norm!O37","v":true},{"$f":"Norm!P37=Basis_norm!P37","v":true},{"$f":"Norm!Q37=Basis_norm!Q37","v":true},{"$f":"Norm!R37=Basis_norm!R37","v":true},{"$f":"Norm!S37=Basis_norm!S37","v":false},{"$f":"Norm!T37=Basis_norm!T37","v":true},{"$f":"Norm!U37=Basis_norm!U37","v":true},{"$f":"Norm!V37=Basis_norm!V37","v":true},{"$f":"Norm!W37=Basis_norm!W37","v":true},{"$f":"Norm!X37=Basis_norm!X37","v":true},{"$f":"Norm!Y37=Basis_norm!Y37","v":true}]
[null,20,"Vinterrug (population), sået inden 1. august",{"$f":"Norm!D38=Basis_norm!D38","v":true},{"$f":"Norm!E38=Basis_norm!E38","v":true},{"$f":"Norm!F38=Basis_norm!F38","v":true},{"$f":"Norm!G38=Basis_norm!G38","v":true},{"$f":"Norm!H38=Basis_norm!H38","v":true},{"$f":"Norm!I38=Basis_norm!I38","v":true},{"$f":"Norm!J38=Basis_norm!J38","v":true},{"$f":"Norm!K38=Basis_norm!K38","v":true},{"$f":"Norm!L38=Basis_norm!L38","v":true},{"$f":"Norm!M38=Basis_norm!M38","v":true},{"$f":"Norm!N38=Basis_norm!N38","v":true},{"$f":"Norm!O38=Basis_norm!O38","v":true},{"$f":"Norm!P38=Basis_norm!P38","v":true},{"$f":"Norm!Q38=Basis_norm!Q38","v":true},{"$f":"Norm!R38=Basis_norm!R38","v":true},{"$f":"Norm!S38=Basis_norm!S38","v":true},{"$f":"Norm!T38=Basis_norm!T38","v":true},{"$f":"Norm!U38=Basis_norm!U38","v":true},{"$f":"Norm!V38=Basis_norm!V38","v":true},{"$f":"Norm!W38=Basis_norm!W38","v":true},{"$f":"Norm!X38=Basis_norm!X38","v":true},{"$f":"Norm!Y38=Basis_norm!Y38","v":true}]
[null,21,"Vinterrug (population), sået inden 20. august",{"$f":"Norm!D39=Basis_norm!D39","v":true},{"$f":"Norm!E39=Basis_norm!E39","v":true},{"$f":"Norm!F39=Basis_norm!F39","v":true},{"$f":"Norm!G39=Basis_norm!G39","v":true},{"$f":"Norm!H39=Basis_norm!H39","v":true},{"$f":"Norm!I39=Basis_norm!I39","v":true},{"$f":"Norm!J39=Basis_norm!J39","v":true},{"$f":"Norm!K39=Basis_norm!K39","v":true},{"$f":"Norm!L39=Basis_norm!L39","v":true},{"$f":"Norm!M39=Basis_norm!M39","v":true},{"$f":"Norm!N39=Basis_norm!N39","v":true},{"$f":"Norm!O39=Basis_norm!O39","v":true},{"$f":"Norm!P39=Basis_norm!P39","v":true},{"$f":"Norm!Q39=Basis_norm!Q39","v":true},{"$f":"Norm!R39=Basis_norm!R39","v":true},{"$f":"Norm!S39=Basis_norm!S39","v":false},{"$f":"Norm!T39=Basis_norm!T39","v":true},{"$f":"Norm!U39=Basis_norm!U39","v":true},{"$f":"Norm!V39=Basis_norm!V39","v":true},{"$f":"Norm!W39=Basis_norm!W39","v":true},{"$f":"Norm!X39=Basis_norm!X39","v":true},{"$f":"Norm!Y39=Basis_norm!Y39","v":true}]
[null,22,"Vinterrug (hybrid og syntetisk), sået inden 1. august",{"$f":"Norm!D40=Basis_norm!D40","v":true},{"$f":"Norm!E40=Basis_norm!E40","v":true},{"$f":"Norm!F40=Basis_norm!F40","v":true},{"$f":"Norm!G40=Basis_norm!G40","v":true},{"$f":"Norm!H40=Basis_norm!H40","v":true},{"$f":"Norm!I40=Basis_norm!I40","v":true},{"$f":"Norm!J40=Basis_norm!J40","v":true},{"$f":"Norm!K40=Basis_norm!K40","v":true},{"$f":"Norm!L40=Basis_norm!L40","v":true},{"$f":"Norm!M40=Basis_norm!M40","v":true},{"$f":"Norm!N40=Basis_norm!N40","v":true},{"$f":"Norm!O40=Basis_norm!O40","v":true},{"$f":"Norm!P40=Basis_norm!P40","v":true},{"$f":"Norm!Q40=Basis_norm!Q40","v":true},{"$f":"Norm!R40=Basis_norm!R40","v":true},{"$f":"Norm!S40=Basis_norm!S40","v":false},{"$f":"Norm!T40=Basis_norm!T40","v":true},{"$f":"Norm!U40=Basis_norm!U40","v":true},{"$f":"Norm!V40=Basis_norm!V40","v":true},{"$f":"Norm!W40=Basis_norm!W40","v":true},{"$f":"Norm!X40=Basis_norm!X40","v":true},{"$f":"Norm!Y40=Basis_norm!Y40","v":true}]
[null,23,"Vinterrug (hybrid og syntetisk), sået inden 20. august",{"$f":"Norm!D41=Basis_norm!D41","v":true},{"$f":"Norm!E41=Basis_norm!E41","v":true},{"$f":"Norm!F41=Basis_norm!F41","v":true},{"$f":"Norm!G41=Basis_norm!G41","v":true},{"$f":"Norm!H41=Basis_norm!H41","v":true},{"$f":"Norm!I41=Basis_norm!I41","v":true},{"$f":"Norm!J41=Basis_norm!J41","v":true},{"$f":"Norm!K41=Basis_norm!K41","v":true},{"$f":"Norm!L41=Basis_norm!L41","v":true},{"$f":"Norm!M41=Basis_norm!M41","v":true},{"$f":"Norm!N41=Basis_norm!N41","v":true},{"$f":"Norm!O41=Basis_norm!O41","v":true},{"$f":"Norm!P41=Basis_norm!P41","v":true},{"$f":"Norm!Q41=Basis_norm!Q41","v":true},{"$f":"Norm!R41=Basis_norm!R41","v":false},{"$f":"Norm!S41=Basis_norm!S41","v":false},{"$f":"Norm!T41=Basis_norm!T41","v":true},{"$f":"Norm!U41=Basis_norm!U41","v":true},{"$f":"Norm!V41=Basis_norm!V41","v":true},{"$f":"Norm!W41=Basis_norm!W41","v":true},{"$f":"Norm!X41=Basis_norm!X41","v":true},{"$f":"Norm!Y41=Basis_norm!Y41","v":true}]
[null,24,"Cikorie",{"$f":"Norm!D42=Basis_norm!D42","v":true},{"$f":"Norm!E42=Basis_norm!E42","v":true},{"$f":"Norm!F42=Basis_norm!F42","v":true},{"$f":"Norm!G42=Basis_norm!G42","v":true},{"$f":"Norm!H42=Basis_norm!H42","v":true},{"$f":"Norm!I42=Basis_norm!I42","v":true},{"$f":"Norm!J42=Basis_norm!J42","v":true},{"$f":"Norm!K42=Basis_norm!K42","v":true},{"$f":"Norm!L42=Basis_norm!L42","v":true},{"$f":"Norm!M42=Basis_norm!M42","v":true},{"$f":"Norm!N42=Basis_norm!N42","v":true},{"$f":"Norm!O42=Basis_norm!O42","v":true},{"$f":"Norm!P42=Basis_norm!P42","v":true},{"$f":"Norm!Q42=Basis_norm!Q42","v":true},{"$f":"Norm!R42=Basis_norm!R42","v":true},{"$f":"Norm!S42=Basis_norm!S42","v":false},{"$f":"Norm!T42=Basis_norm!T42","v":true},{"$f":"Norm!U42=Basis_norm!U42","v":true},{"$f":"Norm!V42=Basis_norm!V42","v":true},{"$f":"Norm!W42=Basis_norm!W42","v":true},{"$f":"Norm!X42=Basis_norm!X42","v":true},{"$f":"Norm!Y42=Basis_norm!Y42","v":true}]
[null,25,"Honningurt",{"$f":"Norm!D43=Basis_norm!D43","v":true},{"$f":"Norm!E43=Basis_norm!E43","v":true},{"$f":"Norm!F43=Basis_norm!F43","v":true},{"$f":"Norm!G43=Basis_norm!G43","v":true},{"$f":"Norm!H43=Basis_norm!H43","v":true},{"$f":"Norm!I43=Basis_norm!I43","v":true},{"$f":"Norm!J43=Basis_norm!J43","v":true},{"$f":"Norm!K43=Basis_norm!K43","v":true},{"$f":"Norm!L43=Basis_norm!L43","v":true},{"$f":"Norm!M43=Basis_norm!M43","v":true},{"$f":"Norm!N43=Basis_norm!N43","v":true},{"$f":"Norm!O43=Basis_norm!O43","v":true},{"$f":"Norm!P43=Basis_norm!P43","v":true},{"$f":"Norm!Q43=Basis_norm!Q43","v":true},{"$f":"Norm!R43=Basis_norm!R43","v":true},{"$f":"Norm!S43=Basis_norm!S43","v":false},{"$f":"Norm!T43=Basis_norm!T43","v":true},{"$f":"Norm!U43=Basis_norm!U43","v":true},{"$f":"Norm!V43=Basis_norm!V43","v":true},{"$f":"Norm!W43=Basis_norm!W43","v":true},{"$f":"Norm!X43=Basis_norm!X43","v":true},{"$f":"Norm!Y43=Basis_norm!Y43","v":true}]
[null,26,"Fodervikke ",{"$f":"Norm!D44=Basis_norm!D44","v":true},{"$f":"Norm!E44=Basis_norm!E44","v":true},{"$f":"Norm!F44=Basis_norm!F44","v":true},{"$f":"Norm!G44=Basis_norm!G44","v":true},{"$f":"Norm!H44=Basis_norm!H44","v":true},{"$f":"Norm!I44=Basis_norm!I44","v":true},{"$f":"Norm!J44=Basis_norm!J44","v":true},{"$f":"Norm!K44=Basis_norm!K44","v":true},{"$f":"Norm!L44=Basis_norm!L44","v":true},{"$f":"Norm!M44=Basis_norm!M44","v":true},{"$f":"Norm!N44=Basis_norm!N44","v":true},{"$f":"Norm!O44=Basis_norm!O44","v":true},{"$f":"Norm!P44=Basis_norm!P44","v":true},{"$f":"Norm!Q44=Basis_norm!Q44","v":true},{"$f":"Norm!R44=Basis_norm!R44","v":true},{"$f":"Norm!S44=Basis_norm!S44","v":false},{"$f":"Norm!T44=Basis_norm!T44","v":true},{"$f":"Norm!U44=Basis_norm!U44","v":true},{"$f":"Norm!V44=Basis_norm!V44","v":true},{"$f":"Norm!W44=Basis_norm!W44","v":true},{"$f":"Norm!X44=Basis_norm!X44","v":true},{"$f":"Norm!Y44=Basis_norm!Y44","v":true}]
[null,27,"Vintervikke",{"$f":"Norm!D45=Basis_norm!D45","v":true},{"$f":"Norm!E45=Basis_norm!E45","v":true},{"$f":"Norm!F45=Basis_norm!F45","v":true},{"$f":"Norm!G45=Basis_norm!G45","v":true},{"$f":"Norm!H45=Basis_norm!H45","v":true},{"$f":"Norm!I45=Basis_norm!I45","v":true},{"$f":"Norm!J45=Basis_norm!J45","v":true},{"$f":"Norm!K45=Basis_norm!K45","v":true},{"$f":"Norm!L45=Basis_norm!L45","v":true},{"$f":"Norm!M45=Basis_norm!M45","v":true},{"$f":"Norm!N45=Basis_norm!N45","v":true},{"$f":"Norm!O45=Basis_norm!O45","v":true},{"$f":"Norm!P45=Basis_norm!P45","v":true},{"$f":"Norm!Q45=Basis_norm!Q45","v":true},{"$f":"Norm!R45=Basis_norm!R45","v":true},{"$f":"Norm!S45=Basis_norm!S45","v":false},{"$f":"Norm!T45=Basis_norm!T45","v":true},{"$f":"Norm!U45=Basis_norm!U45","v":true},{"$f":"Norm!V45=Basis_norm!V45","v":true},{"$f":"Norm!W45=Basis_norm!W45","v":true},{"$f":"Norm!X45=Basis_norm!X45","v":true},{"$f":"Norm!Y45=Basis_norm!Y45","v":true}]
[null,28,"Alexandrinekløver",{"$f":"Norm!D46=Basis_norm!D46","v":true},{"$f":"Norm!E46=Basis_norm!E46","v":true},{"$f":"Norm!F46=Basis_norm!F46","v":true},{"$f":"Norm!G46=Basis_norm!G46","v":true},{"$f":"Norm!H46=Basis_norm!H46","v":true},{"$f":"Norm!I46=Basis_norm!I46","v":true},{"$f":"Norm!J46=Basis_norm!J46","v":true},{"$f":"Norm!K46=Basis_norm!K46","v":true},{"$f":"Norm!L46=Basis_norm!L46","v":true},{"$f":"Norm!M46=Basis_norm!M46","v":true},{"$f":"Norm!N46=Basis_norm!N46","v":true},{"$f":"Norm!O46=Basis_norm!O46","v":true},{"$f":"Norm!P46=Basis_norm!P46","v":true},{"$f":"Norm!Q46=Basis_norm!Q46","v":true},{"$f":"Norm!R46=Basis_norm!R46","v":true},{"$f":"Norm!S46=Basis_norm!S46","v":false},{"$f":"Norm!T46=Basis_norm!T46","v":true},{"$f":"Norm!U46=Basis_norm!U46","v":true},{"$f":"Norm!V46=Basis_norm!V46","v":true},{"$f":"Norm!W46=Basis_norm!W46","v":true},{"$f":"Norm!X46=Basis_norm!X46","v":true},{"$f":"Norm!Y46=Basis_norm!Y46","v":true}]
[null,29,"Hvidkløver",{"$f":"Norm!D47=Basis_norm!D47","v":true},{"$f":"Norm!E47=Basis_norm!E47","v":true},{"$f":"Norm!F47=Basis_norm!F47","v":true},{"$f":"Norm!G47=Basis_norm!G47","v":true},{"$f":"Norm!H47=Basis_norm!H47","v":true},{"$f":"Norm!I47=Basis_norm!I47","v":true},{"$f":"Norm!J47=Basis_norm!J47","v":true},{"$f":"Norm!K47=Basis_norm!K47","v":true},{"$f":"Norm!L47=Basis_norm!L47","v":true},{"$f":"Norm!M47=Basis_norm!M47","v":true},{"$f":"Norm!N47=Basis_norm!N47","v":true},{"$f":"Norm!O47=Basis_norm!O47","v":true},{"$f":"Norm!P47=Basis_norm!P47","v":true},{"$f":"Norm!Q47=Basis_norm!Q47","v":true},{"$f":"Norm!R47=Basis_norm!R47","v":true},{"$f":"Norm!S47=Basis_norm!S47","v":false},{"$f":"Norm!T47=Basis_norm!T47","v":true},{"$f":"Norm!U47=Basis_norm!U47","v":true},{"$f":"Norm!V47=Basis_norm!V47","v":true},{"$f":"Norm!W47=Basis_norm!W47","v":true},{"$f":"Norm!X47=Basis_norm!X47","v":true},{"$f":"Norm!Y47=Basis_norm!Y47","v":true}]
[null,30,"Blanding af olieræddike og fodervikke",{"$f":"Norm!D48=Basis_norm!D48","v":true},{"$f":"Norm!E48=Basis_norm!E48","v":true},{"$f":"Norm!F48=Basis_norm!F48","v":true},{"$f":"Norm!G48=Basis_norm!G48","v":true},{"$f":"Norm!H48=Basis_norm!H48","v":true},{"$f":"Norm!I48=Basis_norm!I48","v":true},{"$f":"Norm!J48=Basis_norm!J48","v":true},{"$f":"Norm!K48=Basis_norm!K48","v":true},{"$f":"Norm!L48=Basis_norm!L48","v":true},{"$f":"Norm!M48=Basis_norm!M48","v":true},{"$f":"Norm!N48=Basis_norm!N48","v":true},{"$f":"Norm!O48=Basis_norm!O48","v":true},{"$f":"Norm!P48=Basis_norm!P48","v":true},{"$f":"Norm!Q48=Basis_norm!Q48","v":true},{"$f":"Norm!R48=Basis_norm!R48","v":true},{"$f":"Norm!S48=Basis_norm!S48","v":true},{"$f":"Norm!T48=Basis_norm!T48","v":true},{"$f":"Norm!U48=Basis_norm!U48","v":true},{"$f":"Norm!V48=Basis_norm!V48","v":true},{"$f":"Norm!W48=Basis_norm!W48","v":true},{"$f":"Norm!X48=Basis_norm!X48","v":true},{"$f":"Norm!Y48=Basis_norm!Y48","v":true}]
[null,31,"Hvidkløver/alm. rajgræs",{"$f":"Norm!D49=Basis_norm!D49","v":true},{"$f":"Norm!E49=Basis_norm!E49","v":true},{"$f":"Norm!F49=Basis_norm!F49","v":true},{"$f":"Norm!G49=Basis_norm!G49","v":true},{"$f":"Norm!H49=Basis_norm!H49","v":true},{"$f":"Norm!I49=Basis_norm!I49","v":true},{"$f":"Norm!J49=Basis_norm!J49","v":true},{"$f":"Norm!K49=Basis_norm!K49","v":true},{"$f":"Norm!L49=Basis_norm!L49","v":true},{"$f":"Norm!M49=Basis_norm!M49","v":true},{"$f":"Norm!N49=Basis_norm!N49","v":true},{"$f":"Norm!O49=Basis_norm!O49","v":true},{"$f":"Norm!P49=Basis_norm!P49","v":true},{"$f":"Norm!Q49=Basis_norm!Q49","v":true},{"$f":"Norm!R49=Basis_norm!R49","v":true},{"$f":"Norm!S49=Basis_norm!S49","v":false},{"$f":"Norm!T49=Basis_norm!T49","v":true},{"$f":"Norm!U49=Basis_norm!U49","v":true},{"$f":"Norm!V49=Basis_norm!V49","v":true},{"$f":"Norm!W49=Basis_norm!W49","v":true},{"$f":"Norm!X49=Basis_norm!X49","v":true},{"$f":"Norm!Y49=Basis_norm!Y49","v":true}]
[null,32,"Rødkløver/strandsvingel",{"$f":"Norm!D50=Basis_norm!D50","v":true},{"$f":"Norm!E50=Basis_norm!E50","v":true},{"$f":"Norm!F50=Basis_norm!F50","v":true},{"$f":"Norm!G50=Basis_norm!G50","v":true},{"$f":"Norm!H50=Basis_norm!H50","v":true},{"$f":"Norm!I50=Basis_norm!I50","v":true},{"$f":"Norm!J50=Basis_norm!J50","v":true},{"$f":"Norm!K50=Basis_norm!K50","v":true},{"$f":"Norm!L50=Basis_norm!L50","v":true},{"$f":"Norm!M50=Basis_norm!M50","v":true},{"$f":"Norm!N50=Basis_norm!N50","v":true},{"$f":"Norm!O50=Basis_norm!O50","v":true},{"$f":"Norm!P50=Basis_norm!P50","v":true},{"$f":"Norm!Q50=Basis_norm!Q50","v":true},{"$f":"Norm!R50=Basis_norm!R50","v":true},{"$f":"Norm!S50=Basis_norm!S50","v":false},{"$f":"Norm!T50=Basis_norm!T50","v":true},{"$f":"Norm!U50=Basis_norm!U50","v":true},{"$f":"Norm!V50=Basis_norm!V50","v":true},{"$f":"Norm!W50=Basis_norm!W50","v":true},{"$f":"Norm!X50=Basis_norm!X50","v":true},{"$f":"Norm!Y50=Basis_norm!Y50","v":true}]
[null,33,"Vintervikke/vinterrug",{"$f":"Norm!D51=Basis_norm!D51","v":true},{"$f":"Norm!E51=Basis_norm!E51","v":true},{"$f":"Norm!F51=Basis_norm!F51","v":true},{"$f":"Norm!G51=Basis_norm!G51","v":true},{"$f":"Norm!H51=Basis_norm!H51","v":true},{"$f":"Norm!I51=Basis_norm!I51","v":true},{"$f":"Norm!J51=Basis_norm!J51","v":true},{"$f":"Norm!K51=Basis_norm!K51","v":true},{"$f":"Norm!L51=Basis_norm!L51","v":true},{"$f":"Norm!M51=Basis_norm!M51","v":true},{"$f":"Norm!N51=Basis_norm!N51","v":true},{"$f":"Norm!O51=Basis_norm!O51","v":true},{"$f":"Norm!P51=Basis_norm!P51","v":true},{"$f":"Norm!Q51=Basis_norm!Q51","v":true},{"$f":"Norm!R51=Basis_norm!R51","v":true},{"$f":"Norm!S51=Basis_norm!S51","v":false},{"$f":"Norm!T51=Basis_norm!T51","v":true},{"$f":"Norm!U51=Basis_norm!U51","v":true},{"$f":"Norm!V51=Basis_norm!V51","v":true},{"$f":"Norm!W51=Basis_norm!W51","v":true},{"$f":"Norm!X51=Basis_norm!X51","v":true},{"$f":"Norm!Y51=Basis_norm!Y51","v":true}]
[null,34,"Kløvergræs",{"$f":"Norm!D52=Basis_norm!D52","v":true},{"$f":"Norm!E52=Basis_norm!E52","v":true},{"$f":"Norm!F52=Basis_norm!F52","v":true},{"$f":"Norm!G52=Basis_norm!G52","v":true},{"$f":"Norm!H52=Basis_norm!H52","v":true},{"$f":"Norm!I52=Basis_norm!I52","v":true},{"$f":"Norm!J52=Basis_norm!J52","v":true},{"$f":"Norm!K52=Basis_norm!K52","v":true},{"$f":"Norm!L52=Basis_norm!L52","v":true},{"$f":"Norm!M52=Basis_norm!M52","v":true},{"$f":"Norm!N52=Basis_norm!N52","v":true},{"$f":"Norm!O52=Basis_norm!O52","v":true},{"$f":"Norm!P52=Basis_norm!P52","v":true},{"$f":"Norm!Q52=Basis_norm!Q52","v":true},{"$f":"Norm!R52=Basis_norm!R52","v":true},{"$f":"Norm!S52=Basis_norm!S52","v":true},{"$f":"Norm!T52=Basis_norm!T52","v":true},{"$f":"Norm!U52=Basis_norm!U52","v":true},{"$f":"Norm!V52=Basis_norm!V52","v":true},{"$f":"Norm!W52=Basis_norm!W52","v":true},{"$f":"Norm!X52=Basis_norm!X52","v":true},{"$f":"Norm!Y52=Basis_norm!Y52","v":true}]
[]
[null,null,null,"Antal i alt","Antal sande"]
[null,null,null,{"$f":"COUNTA(D20:Y53)+COUNTA(D4:D6)+COUNTA(D8)+COUNTA(E4:E6)+COUNTA(D10:D13)","v":759},{"$f":"COUNTIF(D20:Y53,TRUE)+COUNTIF(D4:D6,TRUE)+COUNTIF(D8,TRUE)+COUNTIF(E4:E6,TRUE)+COUNTIF(D10:D13,TRUE)","v":734}]
[null,null,"Norm lig basis norm?",{"$f":"D56=E56","v":false}]

{"sheet":"Version","index":13,"n_rows":11,"n_cols":9,"rows_kept":11,"cut":false,"hidden":false,"merged":[]}
["Version 1.12, 21. november 2021",null,null,null,"SHER / MAJH","Opdateret jf. nye regler for pligtige efterafgrøder. Priser for udsæd opdateret."]
["Version 1.11, 8. Ferbuar 2018",null,null,null,"KRP","Mellemafgrøder fjernet og vintersæd ikke en mulighed efter efterafgrøder - opdaterede priser og karaktere for vinterfasthed og anvendelse af egen udsæd"]
["Version 1.10e, 15. December 2017",null,null,null,"KRP","Omarbejdet til Økologi - nye afgrøder og priser, karaktere tilpasset øko, fjernet spørgsmål og kommentaret om kemi"]
["Version 1.09, 26. April 2017",null,null,null,"KRP","Olieræddike vises ikke når der er valg \"Der må ikke opformeres kålbrok\", advarsel om MFO i blanding rettet til \"I blanding med anden art\", såtidspunkt for vinterraps rettet, såtidsunkt for frivillige efterafgrøder rettet, tilføjet mulighed for at MFO græsudlæg kan fortsætte som græs i følgende år og modificeret til kun af beregne nettoomkostninger ved dette valg."]
["Version 1.08, 18. April 2017",null,null,null,"KRP","Stavefejl er rettet, ændret såtidspunkt for græs udlæg som MFO afgrøde, ark til styring af efteagrødenavn er oprettet, ændret formulering ang. kålbrok "]
["Version 1.07, 30. marts 2017",null,null,null,"KRP","Anvendelse af egen udsæd af honning urt gjort ulovlig. Formulering af kålbrok ændret så karakteren 3 medfører at alle sorter ikke opformere kålbrok. Tilføjet at man altid ser seneste såtidspunkt."]
["Version 1.06, 18. januar 2016",null,null,null,"KRP","Anvendelse af egen udsæd ændret så arter hvor detter er ulovligt ikke vises, hvis det vælges at der skal anvendes egen udsæd. Rajgræs og rajgrgræs i blanding med hvidkløver ikke længer anset for brugbare til udlæg sammen med vintersæd"]
["Version 1.05, 11. januar 2016",null,null,null,"KRP","Fjernet spmg ang. sædskiftesygdomme i kartofler, Spmg. Ang. kålbrok ændret så kun afgrøder der ikke opformere kålbrok vises, hvis dette betragtes som meget vigtigt, Spmg. Ang. eftervirkning rettet så det går på eftervirkningens størrelse, Priser ændret så der kun vises omkostninger, tilføjet makro der opdatere frontend når der bliver ændret i valgene. ",null,null,"Sidst opdateret "]
["Version 1.04, 7. januar 2016",null,null,null,"HSO","Diverse rettelser"]
["Version 1.01, 8. december 2015",null,null,null,null,null,null,null,"Sidst opdateret "]
["Version 1.02, 16. december 2015",null,null,null,"ERM","Tilføjet udsædspriser"]

{"sheet":"Afgrøder i regnearket","index":14,"n_rows":31,"n_cols":1,"rows_kept":31,"cut":false,"hidden":true,"merged":[]}
["Afgrøder"]
["Alm. rajgræs"]
["Ital. rajgræs"]
["Westerwoldisk rajgræs"]
["Strandsvingel"]
["Rødsvingel"]
["Engrapgræs"]
["Hundegræs"]
["Frøgræs, udtjent"]
["Gul sennep"]
["Olieræddike"]
["Vinterraps, hybrid"]
["Vinterraps , linie"]
["Foderradise (Strukturator)"]
["Havre"]
["Stauderug"]
["Vårbyg"]
["Vårbyg"]
["Vinterrug "]
["Vinterrug"]
["Cikorie"]
["Honningurt"]
["Fodervikke "]
["Vintervikke"]
["Alexandrinekløver"]
["Hvidkløver"]
["Blanding af olieræddike og fodervikke"]
["Hvidkløver/alm. rajgræs"]
["Rødkløver/strandsvingel"]
["Vintervikke/vinterrug"]
["Kløvergræs"]

{"sheet":"Anvendte kriterier","index":15,"n_rows":20,"n_cols":3,"rows_kept":20,"cut":false,"hidden":false,"merged":[]}
["Kriterier i regnearket","Karakterer"]
["Pligtig efterafgrøde","0, 1",1]
["Pligtig mellemafgrøde","0, 1",{"$f":"C2+1","v":2}]
["MFO-efterafgrøde i blanding","0, 1",{"$f":"C3+1","v":3}]
["MFO-udlæg","0, 1",4]
["Miljø-efterafgrøder",1,5]
["Frivillige efterafgrøder",1,6]
["Grønne marker (2,3 DE-brug)",1,7]
["Egnet til udlæg efterår i vinterkorn","0, 1, 2, 3",8]
["Egnet til udlæg forår","0, 1, 2, 3",9]
["Egnet til udsåning 2-3 uger før høst","0, 1, 2, 3",10]
["Egnet til udsåning efter tidlig høst (10. august)","0, 1, 2, 3",11]
["Kvælstof-fikserende",0.1,12]
["Stor kvælstofeftervirkning","0, 1, 2, 3",13]
["Hurtig og dyb rodvækst på lerjord","0, 1, 2, 3",14]
["Er afgrøden robust mod ukrudtsmidler?","0, 1, 2, 3",15]
["Der findes sorter, der ikke opformerer kålbrok","0, 1, 2, 3",16]
["Der findes sorter, der er sanerende for roecystenematoder","0, 1, 2, 3",17]
["Vinterfast","0, 1, 2, 3",18]
["Egen udsæd kan anvendes4)","0, 1",19]